{"text_format":"1","workbook":"xlsx","n_sheets":11,"sheets":["fPM_min","fPM_Variability","Promulgated_Mins","UPL Pooled Template ","UPL Normal","QA_Calcs","Lognormal Template","lognormal distribution 99 %","PetCoke_fPM_New_nonnormal n<3","ERT","667_PartII"],"not_rendered":{"charts":1,"images":32,"macros":1,"external_links":0,"defined_names":35,"comments":1,"pivot_tables":0},"unopened":[],"bounds":{"document_bytes":16777216,"sheet_cells":100000,"rows_first":2000,"rows_last":500,"rows_between":2000,"halvings":0,"cell_chars":16384,"cell_head_chars":4096},"cells_cut":0,"cells_raw":0,"read":"whole","date_system":"1900"}

{"sheet":"fPM_min","index":0,"n_rows":9,"n_cols":25,"rows_kept":9,"cut":false,"hidden":false,"merged":[]}
["Key f_b","Primary Fuel","fPM_Min_lb_per_MWh_Rank","Reason_for_Removal as top ranked unit for fPM new source floor","facility_ID","facility_name","Boiler ID","Unit ID","Unit Type","Boiler Type","MMBtu/hr Capacity","MWe Capacity","Heat Rate (MMBtu/MWh)","Fuel Types","Emission Factor","Final_EF_Units","From","Report_id","Submittal_ID_ERT","MaxOfEF_Changed","Submitted_EF","lb/MMBtu (min)","MaxOf1mg_corrected","Config_heat_rate_MMBtu/MWh","lb/MWh (Min)"]
["4125_9","petroleum coke",1,"Air Pollution Control system does not include a RACT/BACT/LAER flue gas desulfurization system consistent with the requirements for a newly constructed source. FGD systems can increase the loading on fPM control devices. Therefore this source was not considered as representative of a future new source.",4125,"Manitowoc","9","B-09","Fluidized bed firing","Fluidized bed firing",1244,63.37,19.630740097838096,"petroleum coke,  subbituminous,  other--wood charcoal/paper pellets",2.1775267459726166E-4,"lb/MMBtu","ERT","",2095,"",1.0913870094018435E-4,2.1775267459726166E-4,"Corrected",19.630740097838096,{"$f":"V2*X2","v":4.2746461606279554E-3}]
["667_1A","petroleum coke",2,null,667,"Northside Generating Station","1A","1A","Fluidized bed firing","Fluidized bed firing",2764,310,8.9161290322580644,"petroleum coke,  bituminous",5.0000000000000001E-4,"lb/MMBtu","Part II","",null,"",{"$f":"O3","v":5.0000000000000001E-4},{"$f":"U3","v":5.0000000000000001E-4},"",8.9161290322580644,{"$f":"V3*X3","v":4.4580645161290322E-3}]
["667_2A","petroleum coke",3,null,667,"Northside Generating Station","2A","2A","Fluidized bed firing","Fluidized bed firing",2764,310,8.9161290322580644,"petroleum coke,  bituminous",1.3828405440464442E-3,"lb/MMBtu","Part II","N2_2009_PM",null,"",7.5000000000000002E-4,1.3828405440464442E-3,"Corrected",8.9161290322580644,1.2329584721756038E-2]
["10373_CB1302","petroleum coke",4,null,10373,"Hanford","CB1302","1A","Fluidized bed firing","Fluidized bed firing",290,27.06,10.716925351071692,"petroleum coke",3.3759626939209391E-3,"lb/MMBtu","Part II","2008 Emission Compliance and RATA Report\\08015.4c",null,"",3.3759626939209391E-3,3.3759626939209391E-3,"",10.716925351071692,3.6179940178753596E-2]
["50931_BLR1","petroleum coke",5,null,50931,"Yellowstone Energy LP","BLR1","Config1","Fluidized bed firing","Fluidized bed firing",518,30,17.266666666666666,"petroleum coke",4.9845360158715813E-3,"lb/MMBtu","Part II","3/24/08 to 3/26/08 Testing",null,"",null,4.9845360158715813E-3,"",17.266666666666666,8.6066321874049292E-2]
["50931_BLR2","petroleum coke",6,null,50931,"Yellowstone Energy LP","BLR2","Config1","Fluidized bed firing","Fluidized bed firing",518,30,17.266666666666666,"petroleum coke",4.9845360158715813E-3,"lb/MMBtu","Part II","3/24/08 to 3/26/08 Testing",null,"",null,4.9845360158715813E-3,"",17.266666666666666,8.6066321874049292E-2]
["10670_AAB001","petroleum coke",7,null,10670,"AES Deepwater","AAB001","Deepwater","Conventional Boiler","Arch firing",1817.6,158,11.50379746835443,"petroleum coke",9.1010342985295509E-3,"lb/MMBtu","ERT","",2214,"",9.1010342985295509E-3,9.1010342985295509E-3,"",11.50379746835443,0.10469645532283108]
{"$rows_left_out":2}
{"sheet":"fPM_Variability","index":1,"n_rows":33,"n_cols":15,"rows_kept":33,"cut":false,"hidden":false,"merged":[]}
[null,"Filter","facility_ID","boiler_id","configuration_id","compound","From","Report_id","Submittal_ID_ERT","lb/MMBtu","Config_heat_rate_MMBtu/MWh","lb/MWh","fPM_Min_lb_per_MWh_Rank","Explanation of Excluded Tests","Explanation of Excluded Sources"]
[{"$f":"C2&\"_\"&D2","v":"4125_9"},{"$f":"VLOOKUP(A2,fPM_min!A:A,1,FALSE)","v":"4125_9"},4125,"9","B-09","Filterable Particulate","ERT","",2095,2.1775267459726166E-4,19.630740097838096,null,{"$f":"VLOOKUP(A2,fPM_min!A:C,3,FALSE)","v":1},null,"Unit does not have RACT/BACT/LAER level FGD Controls"]
["667_1A",{"$f":"VLOOKUP(A3,fPM_min!A:A,1,FALSE)","v":"667_1A"},667,"1A","1A","Filterable Particulate","ERT","ERT",1507,{"$f":"VLOOKUP(H3,QA_Calcs!N$212:O$214,2,FALSE)","v":6.8572834795810388E-4},8.9161290322580644,{"$f":"VLOOKUP(H3,QA_Calcs!N$202:O$204,2,FALSE)","v":6.1140424314716111E-3},{"$f":"VLOOKUP(A3,fPM_min!A:C,3,FALSE)","v":2}]
["667_1A",{"$f":"VLOOKUP(A4,fPM_min!A:A,1,FALSE)","v":"667_1A"},667,"1A","1A","Filterable Particulate","Part II","N1_2007_PM",null,7.8125596731707314E-4,8.9161290322580644,{"$f":"J4*K4","v":6.9657790118206131E-3},{"$f":"VLOOKUP(A4,fPM_min!A:C,3,FALSE)","v":2},"Firing > 10% Coal"]
["667_1A",{"$f":"VLOOKUP(A5,fPM_min!A:A,1,FALSE)","v":"667_1A"},667,"1A","1A","Filterable Particulate","Part II","N1_2009_PM",null,{"$f":"VLOOKUP(H5,QA_Calcs!N$212:O$214,2,FALSE)","v":5.0000000000000001E-4},8.9161290322580644,{"$f":"VLOOKUP(H5,QA_Calcs!N$202:O$204,2,FALSE)","v":4.4580645161290322E-3},{"$f":"VLOOKUP(A5,fPM_min!A:C,3,FALSE)","v":2}]
["667_1A",{"$f":"VLOOKUP(A6,fPM_min!A:A,1,FALSE)","v":"667_1A"},667,"1A","1A","Filterable Particulate","Part II","N1_2008_PM",null,{"$f":"VLOOKUP(H6,QA_Calcs!N$212:O$214,2,FALSE)","v":1.0666666666666665E-3},8.9161290322580644,{"$f":"VLOOKUP(H6,QA_Calcs!N$202:O$204,2,FALSE)","v":9.5105376344086015E-3},{"$f":"VLOOKUP(A6,fPM_min!A:C,3,FALSE)","v":2}]
["667_1A",{"$f":"VLOOKUP(A7,fPM_min!A:A,1,FALSE)","v":"667_1A"},667,"1A","1A","Filterable Particulate","Part II","N1_2006_PM",null,1.2999999999999999E-3,8.9161290322580644,{"$f":"J7*K7","v":1.1590967741935482E-2},{"$f":"VLOOKUP(A7,fPM_min!A:C,3,FALSE)","v":2},"Firing > 10% Coal"]
["667_1A",{"$f":"VLOOKUP(A8,fPM_min!A:A,1,FALSE)","v":"667_1A"},667,"1A","1A","Filterable Particulate","Part II","N1_2005_PM",null,3.0000000000000005E-3,8.9161290322580644,{"$f":"J8*K8","v":2.6748387096774198E-2},{"$f":"VLOOKUP(A8,fPM_min!A:C,3,FALSE)","v":2},"Firing > 10% Coal"]
{"$rows_left_out":26}
{"sheet":"Promulgated_Mins","index":2,"n_rows":10,"n_cols":55,"rows_kept":10,"cut":false,"hidden":false,"merged":[]}
["key f_b","primary_fuel","ORIS code","Plant Name","physical_state","Unit Number","boiler_id","Unit Type","boiler_type","max_heat_input","MWe_capacity","Boiler_heat_rate","Fuel types","Filterable Particulate - ERT","Filterable Particulate MW - ERT","Filterable Particulate - Part II","Filterable Particulate MW - Part II","Filterable Particulate - min","Filterable Particulate MW - min","control_group_1","control_type_1","install_date_1","control_group_2","control_type_2","install_date_2","control_group_3","control_type_3","install_date_3","control_group_4","control_type_4","install_date_4","control_group_5","control_type_5","install_date_5","control_group_6","control_type_6","install_date_6","control_group_7","control_type_7","install_date_7","control_group_8","control_type_8","install_date_8","control_group_9","control_type_9","install_date_9","control_group_10","control_type_10","install_date_10","control_group_11","control_type_11","install_date_11","control_group_12","control_type_12","install_date_12"]
[null,null,null,null,null,null,null,null,null,"MMBtu/hr","MW","MMBtu/MWh",null,"lb/MMBtu","lb/MW","lb/MMBtu","lb/MW","lb/MMBtu","lb/MW"]
[{"$f":"C3&\"_\"&G3","v":"4125_9"},"petroleum coke",4125,"Manitowoc","WI","B-09","9","Fluidized bed firing","Fluidized bed firing",1244,63.37,19.630740097838096,"petroleum coke,  subbituminous,  other--wood charcoal/paper pellets",1.5153375350893832E-4,2.9747197311838299E-3,null,null,1.5153375350893832E-4,2.9747197311838299E-3,"NOx control","Selective Noncatalytic Reduction",null,"PM control","Fabric Filter, pulse",null,"","",null,"","",null,"","",null,"","",null,"","",null,"","",null,"","",null,"","",null,"","",null,"",""]
[{"$f":"C4&\"_\"&G4","v":"667_1A"},"petroleum coke",667,"Northside Generating Station","FL","1A","1A","Fluidized bed firing","Fluidized bed firing",2764,310,8.9161290322580644,"petroleum coke,  bituminous",6.8572834795810388E-4,6.1140424314716103E-3,5.0000000000000001E-4,4.4580645161290322E-3,5.0000000000000001E-4,4.4580645161290322E-3,"NOx control","Selective Noncatalytic Reduction","2002-05-01","SO2 control","Dry FGD - Spray Dryer","2002-05-01","PM control","Fabric Filter, pulse","2002-05-01","","",null,"","",null,"","",null,"","",null,"","",null,"","",null,"","",null,"","",null,"",""]
["667_2A","petroleum coke",667,"Northside Generating Station","FL","2A","2A","Fluidized bed firing","Fluidized bed firing",2764,310,8.9161290322580644,"petroleum coke,  bituminous",5.0678544165756853E-4,4.5185643894887721E-3,7.5000000000000002E-4,6.6870967741935487E-3,5.0678544165756853E-4,4.5185643894887721E-3,"NOx control","Selective Noncatalytic Reduction","2002-02-01","SO2 control","Dry FGD - Spray Dryer","2002-02-01","PM control","Fabric Filter, pulse","2002-02-01","","",null,"","",null,"","",null,"","",null,"","",null,"","",null,"","",null,"","",null,"",""]
["10373_CB1302","petroleum coke",10373,"Hanford","CA","1A","CB1302","Fluidized bed firing","Fluidized bed firing",290,27.06,10.716925351071692,"petroleum coke",4.6904447789564985E-3,5.026714655940076E-2,3.3759626939209382E-3,3.6179940178753589E-2,3.3759626939209382E-3,3.6179940178753589E-2,"PM control","Fabric Filter, pulse","1991-08-01","","",null,"","",null,"","",null,"","",null,"","",null,"","",null,"","",null,"","",null,"","",null,"","",null,"",""]
["50931_BLR2","petroleum coke",50931,"Yellowstone Energy LP","MT","Config1","BLR2","Fluidized bed firing","Fluidized bed firing",518,30,17.266666666666666,"petroleum coke",null,null,4.9845360158715813E-3,8.6066321874049292E-2,4.9845360158715813E-3,8.6066321874049292E-2,"PM control","Fabric Filter, pulse","1995-07-01","","",null,"","",null,"","",null,"","",null,"","",null,"","",null,"","",null,"","",null,"","",null,"","",null,"",""]
["50931_BLR1","petroleum coke",50931,"Yellowstone Energy LP","MT","Config1","BLR1","Fluidized bed firing","Fluidized bed firing",518,30,17.266666666666666,"petroleum coke",null,null,4.9845360158715813E-3,8.6066321874049292E-2,4.9845360158715813E-3,8.6066321874049292E-2,"PM control","Fabric Filter, pulse","1995-07-01","","",null,"","",null,"","",null,"","",null,"","",null,"","",null,"","",null,"","",null,"","",null,"","",null,"",""]
{"$rows_left_out":3}
{"sheet":"UPL Pooled Template ","index":3,"n_rows":107,"n_cols":12,"rows_kept":107,"cut":false,"hidden":false,"merged":[[0,1,0,11],[37,0,37,3]]}
[null,"Emissions (lb/MW)"]
["Averages","667\nNorthside\n1A"]
[1,4.4580645161290322E-3]
[2,9.5105376344086015E-3]
[3,6.1140424314716111E-3]
[4]
[5]
[6]
{"$rows_left_out":100}
{"sheet":"UPL Normal","index":4,"n_rows":106,"n_cols":11,"rows_kept":106,"cut":false,"hidden":false,"merged":[[47,16,48,16]]}
["Emissions (lb/MW)","fPM"]
[null,667]
["ORIS/Facility/Unit","Northside"]
["Averages","1A"]
[1,4.4580645161290322E-3]
[2,9.5105376344086015E-3]
[3,6.1140424314716111E-3]
[4]
{"$rows_left_out":99}
{"sheet":"QA_Calcs","index":5,"n_rows":214,"n_cols":100,"rows_kept":214,"cut":false,"hidden":false,"merged":[[8,0,8,4],[8,6,8,18],[8,20,8,26],[8,28,8,36],[8,37,8,44]]}
[null,null,null,null,null,null,null,null,"Anthracite",null,"Anthracite",null,null,"fPM","30B",null,"μg/dscm","No",null,"μg/dscm",{"$f":"1/453592370","v":2.2046226218487758E-9},"lbs/μg",2.8316846592000001E-2,null,null,null,"cm/cf",null,null,null,null,null,"lb/hr",null,null,"lb/MMBtu",null,null,null,null,null,null,"Round to",null,null,null,"From ",null,"original database export===>"]
[null,null,null,null,null,null,null,null,"Bituminous",null,"Bituminous",null,null,"Se","M5",null,"lb/dscf","Yes",null,"ppm",{"$f":"U1/1000","v":2.2046226218487757E-12},"lb/mg",null,null,null,null,null,null,null,null,null,null,null,null,null,null,null,null,null,null,null,null,"Same ",null,null,null,"Min ",null,"original database export===>"]
[null,null,null,null,null,null,null,null,"Lignite",null,"Lignite",null,null,"Pb","M5B",null,"ppm",null,null,null,null,"lb/scf",null,null,null,null,null,null,null,null,null,null,null,null,null,null,null,null,null,null,null,null,"Sig Figs ",null,null,null,"Test",null,"original database export===>"]
[null,null,null,null,null,null,null,null,"Oil",null,"Oil",null,null,"Hg","M29",null,"ppm @ 3% O2",null,null,null,null,"lb/gr",null,null,null,null,null,null,null,null,null,null,null,null,null,null,null,null,null,null,null,null,"as Submitted",null,null,null,"Sheet",null,"original database export===>"]
[null,null,null,null,null,null,null,null,"Pet Coke",null,"Pet Coke",null,null,"HCl","OTM27",null,"ppm @ 7% O2",null,null,null,null,null,null,null,null,null,null,null,null,null,null,null,null,null,null,null,null,null,null,null,null,null,"prior to ",null,null,null,null,null,"original database export===>"]
[null,null,null,null,null,null,null,null,"Subbituminous",null,"Sub Bituminous",null,null,"SO2","26A",null,"gr/dscf",null,null,null,null,null,null,null,null,null,null,null,null,null,null,null,null,null,null,null,null,null,null,null,null,null,"Calc % Diff.",null,null,null,null,null,"original database export===>"]
[null,null,null,null,null,null,null,null,null,null,null,null,null,null,"M6C",null,null,null,null,null,null,null,null,null,null,null,null,null,null,null,null,null,null,null,null,null,null,null,null,null,null,null,null,null,null,null,null,null,"original database export===>"]
[null,null,null,null,null,null,null,null,null,null,null,null,null,null,"M17",null,null,null,null,null,null,null,null,null,null,null,null,null,null,null,null,null,null,null,null,null,null,null,null,null,null,null,null,null,null,null,null,null,"original database export===>"]
{"$rows_left_out":207}
{"sheet":"Lognormal Template","index":6,"n_rows":167,"n_cols":12,"rows_kept":167,"cut":false,"hidden":false,"merged":[[127,0,127,3],[132,0,132,8],[133,0,133,4],[135,0,135,8],[137,0,137,2],[116,0,116,2],[0,1,0,11],[37,0,37,3],[48,1,48,11],[86,0,86,1],[113,0,113,2]]}
[null,"Emissions (lb/MW)"]
["Averages","667\nNorthside\n1A"]
[1,4.4580645161290322E-3]
[2,9.5105376344086015E-3]
[3,6.1140424314716111E-3]
[4]
[5]
[6]
{"$rows_left_out":160}
{"sheet":"lognormal distribution 99 %","index":7,"n_rows":110,"n_cols":33,"rows_kept":110,"cut":false,"hidden":false,"merged":[]}
[]
[null,null,null,null,null,null,null,null,null,null,null,null,null,null,null,"distribution of Z"]
[null,null,null,null,null,null,null,null,null,null,null,null,null,"Normal "]
[null,null,null,null,null,null,null,null,null,null,null,null,null,"distribution"]
["∆z","z",null,null,null,null,null,null,null,null,null,null,null,null,null,null,null,null,null,null,null,"Absolute values"]
[null,null,null,null,null,null,null,null,null,null,null,null,null,null,null,null,null,null,null,null,null,null,null,null,null,null,null,null,null,"Cumulative","normalization"]
[0.10100000000000001,null,null,{"$f":"'Lognormal Template'!C121","v":242.1140801388741},null,{"$f":"'Lognormal Template'!F125","v":1.2459001357898949}]
[]
{"$rows_left_out":103}
{"sheet":"PetCoke_fPM_New_nonnormal n<3","index":8,"n_rows":167,"n_cols":12,"rows_kept":167,"cut":false,"hidden":false,"merged":[[153,0,153,7],[158,1,158,2],[159,1,159,6],[163,1,163,3],[0,1,0,11],[40,0,40,4],[43,0,43,4],[149,0,149,9],[151,0,151,7]]}
[null,"Emissions (lb/MW)"]
["Runs","667\nNorthside\n1A"]
[1,4.4580645161290322E-3]
[2,9.5105376344086015E-3]
[3,6.1140424314716111E-3]
[4]
[5]
[6]
{"$rows_left_out":160}
{"sheet":"ERT","index":9,"n_rows":20,"n_cols":49,"rows_kept":20,"cut":false,"hidden":false,"merged":[]}
["Key","RTI Calculated QA\nlb/MMBtu","Run Grade","Submitted Value","Submitted Value UOM","Use ?","Comment","facility_id","configuration_id","submittal_id","Compound","RunDate","Method","RunNumber","RunStartTime","RunEndTime","NetTravPts","Mass_TOOL","mass","units","Vmstd","Cd","Vwstd","PercH20","PercCO2","PercO2","Fd","19-1","19-5","Fc","19-6","19-9","Fw","FuelType","lb/mmBtuO2","CountOfComments","AvgOfStackTemp","AvgOfDryGasInlet","AvgOfDryGasOutlet","AvgOfOrificePresDesired","AvgOfOrificePresActual","AvgOfProbeTemp","AvgOfFilterTemp","AvgOfImpingTemp","CountOfNotes","M29 Isokinetic (+/- 10%)","OTM27 includes all fractions?","QA Comment","Questions for EPA"]
[null,null,null,null,null,null,null,null,null,null,null,null,null,null,null,null,null,null,null,null,"DSCF","lb/dscf"]
["5_fPM_T1_R1",{"$f":"AB3","v":9.6299428557001295E-4},"A",{"$f":"AI3","v":9.6386048618314656E-4},{"$f":"$AI$1","v":"lb/mmBtuO2"},"Yes",null,667,"1A",1507,"Filterable Particulate","2010-05-18","Method 29","1","08:30","12:46",48,5.55,5.55,"mg","159.765",{"$f":"S3/$H$9/$H$11/U3","v":7.6516568732352089E-8},"19.74","11.00",15.6,4.8,9695,{"$f":"V3*AA3*20.9/((20.9-Z3))","v":9.6299428557001295E-4},{"$f":"V3*AA3*20.9/((20.9-Z3)/(1-X3/100))","v":8.5706491415731153E-4},0,{"$f":"V3*AD3/Y3","v":0},{"$f":"V3*AD3*(1-X3/100)*100/Y3","v":0},0,"Override",9.6386048618314656E-4,49,197.72916666666666,94.729166666666671,94.729166666666671,1.4742647774056079,1.5209374999999996,254.54166666666666,252.5,52.9375,0,102.1]
["5_fPM_T1_R2",{"$f":"AB4","v":5.367876214866596E-4},"A",{"$f":"AI4","v":5.3727045484696268E-4},{"$f":"$AI$1","v":"lb/mmBtuO2"},"Yes",null,667,"1A",1507,"Filterable Particulate","2010-05-18","Method 29","2","15:45","19:32",48,3.15,3.15,"mg","163.044",{"$f":"S4/$H$9/$H$11/U4","v":4.2554929903519457E-8},"19.85","10.85",15.2,4.8,9717,5.367876214866596E-4,{"$f":"V4*AA4*20.9/((20.9-Z4)/(1-X4/100))","v":4.7854616455535702E-4},0,{"$f":"V4*AD4/Y4","v":0},{"$f":"V4*AD4*(1-X4/100)*100/Y4","v":0},0,"Override",5.3727045484696268E-4,49,197.10416666666666,102.54166666666667,102.54166666666667,1.5941315176243114,1.6601250000000001,254.66666666666666,254.08333333333334,52.479166666666664,0,100.7]
["5_fPM_T1_R3",5.5555438902490635E-4,"A",5.5605410284420239E-4,"lb/mmBtuO2","Yes",null,667,"1A",1507,"Filterable Particulate","2010-05-19","Method 29","3","09:30","13:39",48,3.15,3.15,"mg","159.448",{"$f":"S5/$H$9/$H$11/U5","v":4.351466303239568E-8},"19.21","10.75",15.2,4.7,9896,5.5555438902490635E-4,4.9583229220472892E-4,0,0,0,0,"Override",5.5605410284420239E-4,49,198.8125,100.52083333333333,100.52083333333333,1.496576943409359,1.5532229166666662,254.20833333333334,254.89583333333334,54.354166666666664,0,101.6]
[]
[null,null,"Run 1",{"$f":"D3*B$20","v":8.5939044639039269E-3},"lb/MWh",">90",null,null,null,null,null,null,null,null,null,null,null,null,null,null,null,null,null,null,null,null,null,null,null,null,null,null,null,null,null,"Header tab comments",null,null,null,null,null,null,null,null,"Point tab notes"]
[null,null,"Run 2",{"$f":"D4*B$20","v":4.7903727006354995E-3},"lb/MWh",">90",null,"Conversions Used"]
{"$rows_left_out":13}
{"sheet":"667_PartII","index":10,"n_rows":58,"n_cols":50,"rows_kept":58,"cut":false,"hidden":false,"merged":[]}
[null,null,null,null,null,null,null,"Not a good F-factor estimation",null,null,null,null,null,null,null,null,null,null,null,null,null,null,null,null,null,null,null,null,null,null,null,null,null,null,null,null,"NO Fd",null,"No Fc"]
["Key","RTI Calculated QA\nlb/MMBtu","Run Grade","Submitted Value","Submitted Value UOM","Use ?","Comment","facility_id","configuration_id","report_id","sampling_port_id","order","pollutant_id","pollutant_name","run_id","start_datetime","end_datetime","unit_load","fuel_flow_rate","fuel_heating_value","fg_moisture_content","fg_oxygen_content","fg_CO2_content","fg_temperature","test_method","conc","conc_units","conc_ND","conc_MDL","conc2","conc2_units","emission_rate","emission_rate_units","emission_rate_ND","emission_rate_MDL","Calculated conc lb/dscf","19-1\nlb/MMBtu","%diff\n19-1","19-6\nlb/MMBtu","%diff\n19-6","emission_factor","emission_factor_units","emission_factor_ND","emission_factor_MDL","run_pollutant_comment","Fuel1","Fuel1%Btu","Fuel2","Fuel2%Btu","QA Comment"]
["5_fPM_T2_R1","n/a","C",{"$f":"AO3","v":3.0000000000000001E-3},{"$f":"AP3","v":"pound per million British Thermal Unit (lb/MMBtu)"},"Yes","Method 19 doesn't provide an F factor for petcoke; RTI was unable to determine a good F factor to calculate lb/MMBtu from conc",667,"1A","N1_2005_PM","1AStack",5,1,"PM (Filterable)","1","2005-06-14T09:25:00","2005-06-14T11:35:00",297.32,192921,15017.1,9.06,3.6,15.02,222,"Method 17",2.8599999999999999E-7,"pound per dry standard cubic foot (lb/dscf)",false,null,null,"",10.53,"pound per hour (lb/hr)",false,null,null,null,null,null,null,3.0000000000000001E-3,"pound per million British Thermal Unit (lb/MMBtu)",false,null,"gr/dscf"]
["5_fPM_T2_R2","n/a","C",{"$f":"AO4","v":3.0000000000000001E-3},"pound per million British Thermal Unit (lb/MMBtu)","Yes","Method 19 doesn't provide an F factor for petcoke; RTI was unable to determine a good F factor to calculate lb/MMBtu from conc",667,"1A","N1_2005_PM","1AStack",5,1,"PM (Filterable)","2","2005-06-14T12:00:00","2005-06-14T14:05:00",297.32,192921,15017.7,9.56,3.59,14.99,226,"Method 17",2.8200000000000001E-7,"pound per dry standard cubic foot (lb/dscf)",false,null,null,"",10.33,"pound per hour (lb/hr)",false,null,null,null,null,null,null,3.0000000000000001E-3,"pound per million British Thermal Unit (lb/MMBtu)",false,null,"lb/dscf"]
["5_fPM_T2_R3","n/a","C",3.0000000000000001E-3,"pound per million British Thermal Unit (lb/MMBtu)","Yes","Method 19 doesn't provide an F factor for petcoke; RTI was unable to determine a good F factor to calculate lb/MMBtu from conc",667,"1A","N1_2005_PM","1AStack",5,1,"PM (Filterable)","3","2005-06-14T14:20:00","2005-06-14T16:26:00",297.32,192921,15017.7,9.56,3.59,14.99,226,"Method 17",2.8200000000000001E-7,"pound per dry standard cubic foot (lb/dscf)",false,null,null,"",10.33,"pound per hour (lb/hr)",false,null,null,null,null,null,null,3.0000000000000001E-3,"pound per million British Thermal Unit (lb/MMBtu)",false,null,"lb/dscf"]
[null,null,null,{"$f":"D3*B$47","v":2.6748387096774195E-2},"lb/MWh",null,null,667,"1A","N1_2005_PM","1AStack",null,null,"PM (Filterable)","1","2005-06-14T09:25:00","2005-06-14T11:35:00",297.32,192921,15017.1,9.06,3.6,15.02,222,"Method 17",2.8599999999999999E-7,null,false,null,null,null,null,null,null,null,{"$f":"Z3","v":2.8599999999999999E-7},{"$f":"AJ6*$I$57*20.9/(20.9-V6)","v":3.4067724855491332E-3},{"$f":"($AO6-AK6)/$AO6","v":-0.13559082851637771},{"$f":"AJ6*$K$54*100/$I$60","v":{"$error":"#DIV/0!"}},{"$f":"($AO6-AM6)/$AO6","v":{"$error":"#DIV/0!"}},3.0000000000000001E-3,"pound per million British Thermal Unit (lb/MMBtu)",false,null,"gr/dscf","petroleum coke",77.27,"coal - bituminous",22.73,"Run1 conc UOM should be lb/dscf"]
[null,null,null,{"$f":"D4*B$47","v":2.6748387096774195E-2},"lb/MWh",null,null,667,"1A","N1_2005_PM","1AStack",null,null,"PM (Filterable)","2","2005-06-14T12:00:00","2005-06-14T14:05:00",297.32,192921,15017.7,9.56,3.59,14.99,226,"Method 17",2.8200000000000001E-7,null,false,null,null,null,null,null,null,null,{"$f":"Z4","v":2.8200000000000001E-7},{"$f":"AJ7*$I$57*20.9/(20.9-V7)","v":3.3571847487001739E-3},{"$f":"($AO7-AK7)/$AO7","v":-0.11906158290005796},{"$f":"AJ7*$K$54*100/$I$60","v":{"$error":"#DIV/0!"}},{"$f":"($AO7-AM7)/$AO7","v":{"$error":"#DIV/0!"}},3.0000000000000001E-3,"pound per million British Thermal Unit (lb/MMBtu)",false,null,"lb/dscf","petroleum coke",77.27,"coal - bituminous",22.73]
[null,null,null,2.6748387096774195E-2,"lb/MWh",null,null,667,"1A","N1_2005_PM","1AStack",null,null,"PM (Filterable)","3","2005-06-14T14:20:00","2005-06-14T16:26:00",297.32,192921,15017.7,9.56,3.59,14.99,226,"Method 17",2.8200000000000001E-7,null,false,null,null,null,null,null,null,null,{"$f":"Z5","v":2.8200000000000001E-7},{"$f":"AJ8*$I$57*20.9/(20.9-V8)","v":3.3571847487001739E-3},{"$f":"($AO8-AK8)/$AO8","v":-0.11906158290005796},{"$f":"AJ8*$K$54*100/$I$60","v":{"$error":"#DIV/0!"}},{"$f":"($AO8-AM8)/$AO8","v":{"$error":"#DIV/0!"}},3.0000000000000001E-3,"pound per million British Thermal Unit (lb/MMBtu)",false,null,"lb/dscf","petroleum coke",77.27,"coal - bituminous",22.73]
{"$rows_left_out":50}