{"text_format":"1","workbook":"xlsx","n_sheets":17,"sheets":["Hg_Min_Tests","Hg_Variability_Tests","SourceAchievingNewSourceLimit","UPL Pooled Template ","UPL_Calc_n=3_Results","Hg_QA_Calcs","Instructions","Step 6. Instructions","Template_nonnormal n=3","Recalculate t-stat n=3","Calculations for Template n=3","Recalculations1 n=3","Recalculation 2 n=3","Recalculations3 n=3","Recalculations4 n=3","Recalculations5 n<3","Recalculations6 n=3"],"not_rendered":{"charts":0,"images":45,"macros":0,"external_links":0,"defined_names":14,"comments":3,"pivot_tables":0},"unopened":[],"bounds":{"document_bytes":16777216,"sheet_cells":100000,"rows_first":2000,"rows_last":500,"rows_between":2000,"halvings":0,"cell_chars":16384,"cell_head_chars":4096},"cells_cut":0,"cells_raw":0,"read":"whole","date_system":"1900"}

{"sheet":"Hg_Min_Tests","index":0,"n_rows":385,"n_cols":62,"rows_kept":385,"cut":false,"hidden":false,"merged":[]}
["Key","primary_fuel","Hg_Min_lb_per_MWh_Rank","Reason_for_Removal","ORIS code","Plant Name","physical_state","Unit Number","boiler_id","Unit Type","boiler_type","MWe_capacity","max_heat_input","Unit_heat_rate","Fuel_types","fuel","Fuel_Conc_lb/MMBtu","Mercury - ERT","Mercury MW - ERT","Mercury - ETTS","Mercury MW - ETTS","Mercury - CEMS","Mercury - Part II","Mercury MW - Part II","Mercury - min","Mercury MW - min","control_group_1","control_type_1","install_date_1","control_group_2","control_type_2","install_date_2","control_group_3","control_type_3","install_date_3","control_group_4","control_type_4","install_date_4","control_group_5","control_type_5","install_date_5","control_group_6","control_type_6","install_date_6","control_group_7","control_type_7","install_date_7","control_group_8","control_type_8","install_date_8","control_group_9","control_type_9","install_date_9","control_group_10","control_type_10","install_date_10","control_group_11","control_type_11","install_date_11","control_group_12","control_type_12","install_date_12"]
[{"$f":"E2&\"_\"&I2","v":"54081_2A"},"coal",1,"Control technology and unit size are not representative of 2012 RACT/BACT/LAER technologies or sizes of utility units likely to be constructed in future.",54081,"Spruance Genco, LLC","VA","GEN2","2A","Conventional Boiler","Stoker - underfeed",28.7,375,13.066202090592334,"bituminous","bituminous",3.2818472738122867E-6,null,null,2.6333333333333338E-9,3.4407665505226488E-8,null,null,null,2.6333333333333338E-9,3.4407665505226488E-8,"SO2 control","Dry FGD - Spray Dryer","1992-05-01","SO2 control","Dry FGD - Spray Dryer","1992-05-01","PM control","Fabric Filter, pulse","1992-05-01","PM control","Fabric Filter, pulse","1992-05-01","","",null,"","",null,"","",null,"","",null,"","",null,"","",null,"","",null,"",""]
["54081_2B","coal",2,"Control technology and unit size are not representative of 2012 RACT/BACT/LAER technologies or sizes of utility units likely to be constructed in future.",54081,"Spruance Genco, LLC","VA","GEN2","2B","Conventional Boiler","Stoker - underfeed",28.7,375,13.066202090592334,"bituminous","bituminous",3.2818472738122867E-6,null,null,2.6333333333333338E-9,3.4407665505226488E-8,null,null,null,2.6333333333333338E-9,3.4407665505226488E-8,"SO2 control","Dry FGD - Spray Dryer","1992-05-01","SO2 control","Dry FGD - Spray Dryer","1992-05-01","PM control","Fabric Filter, pulse","1992-05-01","PM control","Fabric Filter, pulse","1992-05-01","","",null,"","",null,"","",null,"","",null,"","",null,"","",null,"","",null,"",""]
["10043_B01","coal",3,"Minimum test average reported was result from stack test that did not meet Method 30B QA criteria. Test was invalid.",10043,"Logan Generating Plant","NJ","Unit1","B01","Conventional Boiler","Wall firing - opposed firing",241.7,2116,8.7546545304095993,"bituminous","bituminous",7.3285134054669697E-6,null,null,5.3333333333333339E-9,4.6691490828851201E-8,null,null,null,5.3333333333333339E-9,4.6691490828851201E-8,"NOx control","Selective Catalytic Reduction","1994-09-01","SO2 control","Dry FGD - Spray Dryer","1994-09-01","PM control","Fabric Filter, reverse air","1994-09-01","","",null,"","",null,"","",null,"","",null,"","",null,"","",null,"","",null,"","",null,"",""]
["527_1","coal",4,null,527,"Nucla","CO","001","1","Fluidized bed firing","Fluidized bed firing",110,1032,9.3818181818181809,"bituminous","bituminous",3.9065283637693357E-6,null,null,9.8533333333333332E-9,9.244218181818181E-8,null,5.3333333333333339E-9,5.0036363636363636E-8,5.3333333333333339E-9,5.0036363636363636E-8,"NOx control","Selective Noncatalytic Reduction","2006-07-01","PM control","Fabric Filter, shake and deflate","1987-06-01","","",null,"","",null,"","",null,"","",null,"","",null,"","",null,"","",null,"","",null,"","",null,"",""]
["54081_3A","coal",5,null,54081,"Spruance Genco, LLC","VA","GEN3","3A","Conventional Boiler","Stoker - underfeed",28.7,375,13.066202090592334,"bituminous","bituminous",1.6995757764745597E-6,null,null,4.6900000000000001E-9,6.1280487804878046E-8,null,null,null,4.6900000000000001E-9,6.1280487804878046E-8,"SO2 control","Dry FGD - Spray Dryer","1992-05-01","SO2 control","Dry FGD - Spray Dryer","1992-05-01","PM control","Fabric Filter, pulse","1992-05-01","PM control","Fabric Filter, pulse","1992-05-01","","",null,"","",null,"","",null,"","",null,"","",null,"","",null,"","",null,"",""]
["54081_3B","coal",6,null,54081,"Spruance Genco, LLC","VA","GEN3","3B","Conventional Boiler","Stoker - underfeed",28.7,375,13.066202090592334,"bituminous","bituminous",1.6995757764745597E-6,null,null,4.6900000000000001E-9,6.1280487804878046E-8,null,null,null,4.6900000000000001E-9,6.1280487804878046E-8,"SO2 control","Dry FGD - Spray Dryer","1992-05-01","SO2 control","Dry FGD - Spray Dryer","1992-05-01","PM control","Fabric Filter, pulse","1992-05-01","PM control","Fabric Filter, pulse","1992-05-01","","",null,"","",null,"","",null,"","",null,"","",null,"","",null,"","",null,"",""]
["2527_6","coal",7,null,2527,"AES Greenidge","NY","Unit 4","6","Conventional Boiler","Tangential firing",112,1117,9.9732142857142865,"coal - bituminous, petroleum coke","bituminous",null,null,null,null,null,null,6.4601660216679329E-9,6.4428620055384651E-8,6.4601660216679329E-9,6.4428620055384651E-8,"NOx control","Selective Catalytic Reduction","2007-05-01","NOx control","Selective Noncatalytic Reduction","2007-05-01","Other control","Activated carbon injection","2007-05-01","SO2 control","Dry FGD - Circulating Dry Scrubber","2007-05-01","PM control","Fabric Filter, pulse","2006-11-01","","",null,"","",null,"","",null,"","",null,"","",null,"","",null,"",""]
["3130_1","coal",8,null,3130,"Seward","PA","SEW-1","1","Fluidized bed firing","Fluidized bed firing",292.5,3100,10.598290598290598,"coal refuse (culm or gob)","coal refuse (culm or gob)",1.0061606218095747E-4,null,null,6.3500000000000006E-9,6.7299145299145298E-8,null,3.7999999999999996E-8,4.0273504273504268E-7,6.3500000000000006E-9,6.7299145299145298E-8,"NOx control","Selective Noncatalytic Reduction","2004-03-01","PM control","Fabric Filter, pulse","2004-03-01","","",null,"","",null,"","",null,"","",null,"","",null,"","",null,"","",null,"","",null,"","",null,"",""]
["3130_2","coal",9,null,3130,"Seward","PA","SEW-1","2","Fluidized bed firing","Fluidized bed firing",292.5,3100,10.598290598290598,"coal refuse (culm or gob)","coal refuse (culm or gob)",1.0061606218095747E-4,null,null,6.3500000000000006E-9,6.7299145299145298E-8,null,3.7999999999999996E-8,4.0273504273504268E-7,6.3500000000000006E-9,6.7299145299145298E-8,"NOx control","Selective Noncatalytic Reduction","2004-03-01","PM control","Fabric Filter, pulse","2004-03-01","","",null,"","",null,"","",null,"","",null,"","",null,"","",null,"","",null,"","",null,"","",null,"",""]
["54035_BLR1","coal",10,null,54035,"Roanoke Valley I","NC","Boiler 1","BLR1","Conventional Boiler","Wall firing - front firing",182,1700,9.3406593406593412,"bituminous","bituminous",7.6383974701787273E-6,null,null,7.2633333333333329E-9,6.7844322344322346E-8,null,null,null,7.2633333333333329E-9,6.7844322344322346E-8,"SO2 control","Dry FGD - Spray Dryer","1994-05-01","PM control","Fabric Filter, reverse air","1994-05-01","","",null,"","",null,"","",null,"","",null,"","",null,"","",null,"","",null,"","",null,"","",null,"",""]
["50976_AABO1","coal",11,null,50976,"INDIANTOWN COGENERATION L.P.","FL","001","AABO1","Conventional Boiler","Wall firing - opposed firing",361,3422,9.4792243767313025,"bituminous","bituminous",5.1869666876194475E-6,null,null,8.5384486838666669E-9,8.0937870903578218E-8,null,5.4899999999999995E-7,5.2040941828254846E-6,8.5384486838666669E-9,8.0937870903578218E-8,"NOx control","Selective Catalytic Reduction","1995-12-01","SO2 control","Dry FGD - Spray Dryer","1995-12-01","PM control","Fabric Filter, pulse","1995-12-01","","",null,"","",null,"","",null,"","",null,"","",null,"","",null,"","",null,"","",null,"",""]
["2526_13","coal",12,null,2526,"AES Westover, LLC","NY","8","13","Conventional Boiler","Tangential firing",86,875,10.174418604651162,"coal - bituminous","bituminous",null,null,null,null,null,null,8.1455731092436972E-9,8.2876470588235283E-8,8.1455731092436972E-9,8.2876470588235283E-8,"NOx control","Selective Catalytic Reduction","2009-01-01","SO2 control","Dry FGD - Spray Dryer","2009-01-01","PM control","Fabric Filter, pulse","2009-01-01","","",null,"","",null,"","",null,"","",null,"","",null,"","",null,"","",null,"","",null,"",""]
["50888_BLR1","coal",13,null,50888,"Northampton Generating Company, L.P.","PA","GEN1","BLR1","Fluidized bed firing","Fluidized bed firing",121,1146,9.4710743801652892,"coal refuse (culm or gob)","coal refuse (culm or gob)",3.3352265482940456E-5,null,null,1.0396666666666668E-8,9.8467603305785135E-8,null,1.2872094908400804E-7,1.2191256830601093E-6,1.0396666666666668E-8,9.8467603305785135E-8,"NOx control","Selective Noncatalytic Reduction","1995-08-01","PM control","Fabric Filter, pulse","1995-08-01","","",null,"","",null,"","",null,"","",null,"","",null,"","",null,"","",null,"","",null,"","",null,"",""]
["10675_A","coal",14,null,10675,"AES Thames","CT","A","A","Fluidized bed firing","Fluidized bed firing",104,1002,9.634615384615385,"bituminous","bituminous",null,null,null,null,null,null,1.0500000000000001E-8,1.0116346153846155E-7,1.0500000000000001E-8,1.0116346153846155E-7,"SO2 control","Dry FGD - Circulating Dry Scrubber","1990-03-01","PM control","Fabric Filter, pulse","1990-03-01","","",null,"","",null,"","",null,"","",null,"","",null,"","",null,"","",null,"","",null,"","",null,"",""]
["10675_B","coal",15,null,10675,"AES Thames","CT","B","B","Fluidized bed firing","Fluidized bed firing",104,1002,9.634615384615385,"bituminous","bituminous",null,null,null,null,null,null,1.0500000000000001E-8,1.0116346153846155E-7,1.0500000000000001E-8,1.0116346153846155E-7,"SO2 control","Dry FGD - Circulating Dry Scrubber","1990-03-01","PM control","Fabric Filter, pulse","1990-03-01","","",null,"","",null,"","",null,"","",null,"","",null,"","",null,"","",null,"","",null,"","",null,"",""]
["10673_BLR A","coal",16,null,10673,"AES Hawaii","HI","001","BLR A","Fluidized bed firing","Fluidized bed firing",101.5,1021.4,10.063054187192119,"bituminous","bituminous",4.6424493580862562E-6,null,null,1.1710624187000002E-8,1.1784464575962368E-7,null,null,null,1.1710624187000002E-8,1.1784464575962368E-7,"NOx control","Selective Noncatalytic Reduction",null,"PM control","Fabric Filter, unspecified",null,"","",null,"","",null,"","",null,"","",null,"","",null,"","",null,"","",null,"","",null,"","",null,"",""]
["54755_BLR2","coal",17,null,54755,"Roanoke Valley II","NC","Boiler 2","BLR2","Conventional Boiler","Wall firing - front firing",50,560,11.2,"bituminous","bituminous",6.5568761629075488E-6,null,null,1.076E-8,1.2051199999999999E-7,null,null,null,1.076E-8,1.2051199999999999E-7,"NOx control","Selective Noncatalytic Reduction","1995-06-01","SO2 control","Dry FGD - Spray Dryer","1995-06-01","PM control","Fabric Filter, pulse","1995-06-01","","",null,"","",null,"","",null,"","",null,"","",null,"","",null,"","",null,"","",null,"",""]
["10673_BLR B","coal",18,null,10673,"AES Hawaii","HI","002","BLR B","Fluidized bed firing","Fluidized bed firing",101.5,944.2,9.3024630541871929,"bituminous","bituminous",4.8274925234523978E-6,null,null,1.2993811432333332E-8,1.2087445078235599E-7,null,null,null,1.2993811432333332E-8,1.2087445078235599E-7,"NOx control","Selective Noncatalytic Reduction",null,"PM control","Fabric Filter, unspecified",null,"","",null,"","",null,"","",null,"","",null,"","",null,"","",null,"","",null,"","",null,"","",null,"",""]
["54081_4A","coal",19,null,54081,"Spruance Genco, LLC","VA","GEN4","4A","Conventional Boiler","Stoker - underfeed",28.7,375,13.066202090592334,"bituminous","bituminous",2.2728354398227828E-6,null,null,1.1770000000000001E-8,1.5378919860627178E-7,null,1.6075415240268799E-6,2.1004462421954004E-5,1.1770000000000001E-8,1.5378919860627178E-7,"SO2 control","Dry FGD - Spray Dryer","1992-05-01","SO2 control","Dry FGD - Spray Dryer","1992-05-01","PM control","Fabric Filter, pulse","1992-05-01","PM control","Fabric Filter, pulse","1992-05-01","","",null,"","",null,"","",null,"","",null,"","",null,"","",null,"","",null,"",""]
["54081_4B","coal",20,null,54081,"Spruance Genco, LLC","VA","GEN4","4B","Conventional Boiler","Stoker - underfeed",28.7,375,13.066202090592334,"bituminous","bituminous",2.2728354398227828E-6,null,null,1.1770000000000001E-8,1.5378919860627178E-7,null,1.6075415240268799E-6,2.1004462421954004E-5,1.1770000000000001E-8,1.5378919860627178E-7,"SO2 control","Dry FGD - Spray Dryer","1992-05-01","SO2 control","Dry FGD - Spray Dryer","1992-05-01","PM control","Fabric Filter, pulse","1992-05-01","PM control","Fabric Filter, pulse","1992-05-01","","",null,"","",null,"","",null,"","",null,"","",null,"","",null,"","",null,"",""]
["10143_AAB01","coal",21,null,10143,"Colver Power Project","PA","AAB01","AAB01","Fluidized bed firing","Fluidized bed firing",131,1204,9.1908396946564892,"coal refuse (culm or gob)","coal refuse (culm or gob)",1.1365140211038033E-4,null,null,7.1566666666666666E-8,6.5775776081424945E-7,null,1.7381623128491174E-8,1.59751711806896E-7,1.7381623128491174E-8,1.59751711806896E-7,"NOx control","Selective Noncatalytic Reduction","1995-05-01","PM control","Fabric Filter, pulse","1995-05-01","","",null,"","",null,"","",null,"","",null,"","",null,"","",null,"","",null,"","",null,"","",null,"",""]
["54304_1A","coal",22,null,54304,"Birchwood Power Facility","VA","1A","1A","Conventional Boiler","Tangential firing",222,2300,10.36036036036036,"bituminous","bituminous",5.3835357027379058E-6,1.5476139667835107E-8,1.603383839460394E-7,null,null,null,null,null,1.5476139667835107E-8,1.603383839460394E-7,"NOx control","Selective Catalytic Reduction","1996-10-01","SO2 control","Dry FGD - Spray Dryer","1996-10-01","PM control","Fabric Filter, reverse air","1996-10-01","","",null,"","",null,"","",null,"","",null,"","",null,"","",null,"","",null,"","",null,"",""]
["10603_031","coal",23,null,10603,"Ebensburg Power Company","PA","EPC01","031","Fluidized bed firing","Fluidized bed firing",58,830,14.310344827586206,"coal refuse (culm or gob)","coal refuse (culm or gob)",65.541869671515201,null,null,1.2483369380666667E-8,1.7864132044747127E-7,null,3.8677255269280689E-8,5.5348485988798223E-7,1.2483369380666667E-8,1.7864132044747127E-7,"PM control","Fabric Filter, pulse","1990-11-01","","",null,"","",null,"","",null,"","",null,"","",null,"","",null,"","",null,"","",null,"","",null,"","",null,"",""]
["10566_Boil 1","coal",24,null,10566,"Chambers Cogeneration LP","NJ","Boil 1","Boil 1","Conventional Boiler","Wall firing - front firing",142.5,1387,9.7333333333333325,"bituminous","bituminous",8.560577945601549E-6,null,null,1.9306666666666669E-8,1.8791822222222223E-7,null,null,null,1.9306666666666669E-8,1.8791822222222223E-7,"NOx control","Selective Catalytic Reduction","1994-03-01","SO2 control","Dry FGD - Spray Dryer","1994-03-01","PM control","Fabric Filter, reverse air","1994-03-01","","",null,"","",null,"","",null,"","",null,"","",null,"","",null,"","",null,"","",null,"",""]
["2324_1","coal",25,null,2324,"Reid Gardner","NV","1","1","Conventional Boiler","Wall firing - front firing",111,1215,10.945945945945946,"bituminous","bituminous",4.7610706927686875E-6,null,null,2.007333333333333E-8,2.1972162162162159E-7,null,null,null,2.007333333333333E-8,2.1972162162162159E-7,"PM control","Fabric Filter, pulse","2008-12-01","SO2 control","Wet FGD - Venturi Type","1976-07-01","","",null,"","",null,"","",null,"","",null,"","",null,"","",null,"","",null,"","",null,"","",null,"",""]
["10672_CBB","coal",26,null,10672,"Cedar Bay Generating Company L.P.","FL","CBB1","CBB","Fluidized bed firing","Fluidized bed firing",92,1063,11.554347826086957,"bituminous","bituminous",1.3144242333833245E-5,null,null,1.9031033333333333E-8,2.198911786231884E-7,null,4.8622194975001844E-8,5.6179775280898874E-7,1.9031033333333333E-8,2.198911786231884E-7,"SO2 control","Dry FGD - Circulating Dry Scrubber","1994-01-01","NOx control","Selective Noncatalytic Reduction","1994-01-01","PM control","Fabric Filter, pulse","1994-01-01","","",null,"","",null,"","",null,"","",null,"","",null,"","",null,"","",null,"","",null,"",""]
["7213_1","coal",27,null,7213,"Clover","VA","Unit 1","1","Conventional Boiler","Tangential firing",431,4923,11.422273781902552,"bituminous","bituminous",8.095264418647503E-6,null,null,2.0233292389999999E-8,2.3111020518786541E-7,null,null,null,2.0233292389999999E-8,2.3111020518786541E-7,"PM control","Fabric Filter, reverse air","2003-05-01","SO2 control","Wet FGD - Spray Type","2003-05-01","","",null,"","",null,"","",null,"","",null,"","",null,"","",null,"","",null,"","",null,"","",null,"",""]
["4042_1","coal",28,null,4042,"Valley","WI","VAPP-B1","1","Conventional Boiler","Wall firing - front firing",72,868,12.055555555555555,"bituminous","bituminous",1.5064299042552158E-6,null,null,1.9300000000000001E-8,2.3267222222222224E-7,null,null,null,1.9300000000000001E-8,2.3267222222222224E-7,"PM control","Fabric Filter, pulse","1994-06-01","","",null,"","",null,"","",null,"","",null,"","",null,"","",null,"","",null,"","",null,"","",null,"","",null,"",""]
["10678_BLR1","coal",29,null,10678,"AES Warrior Run Cogeneration Facility","MD","BLR1","BLR1","Fluidized bed firing","Fluidized bed firing",202,2047,10.133663366336634,"bituminous","bituminous",2.125459780361477E-5,null,null,2.3400000000000001E-8,2.3712772277227726E-7,null,2.0099999999999999E-7,2.0368663366336634E-6,2.3400000000000001E-8,2.3712772277227726E-7,"NOx control","Selective Noncatalytic Reduction","2000-02-01","PM control","Fabric Filter, pulse","2000-02-01","","",null,"","",null,"","",null,"","",null,"","",null,"","",null,"","",null,"","",null,"","",null,"",""]
["4042_3","coal",30,null,4042,"Valley","WI","VAPP-B3","3","Conventional Boiler","Wall firing - front firing",72,868,12.055555555555555,"bituminous","bituminous",1.6442513913867095E-6,null,null,2.0933333333333332E-8,2.5236296296296292E-7,null,null,null,2.0933333333333332E-8,2.5236296296296292E-7,"PM control","Fabric Filter, pulse","1995-06-01","","",null,"","",null,"","",null,"","",null,"","",null,"","",null,"","",null,"","",null,"","",null,"","",null,"",""]
["10672_CBA","coal",31,null,10672,"Cedar Bay Generating Company L.P.","FL","CBA1","CBA","Fluidized bed firing","Fluidized bed firing",92,1063,11.554347826086957,"bituminous","bituminous",8.2118522949409673E-6,null,null,2.2238249999999997E-8,2.5694847554347826E-7,null,2.4814320204724722E-6,2.8671328671328676E-5,2.2238249999999997E-8,2.5694847554347826E-7,"SO2 control","Dry FGD - Circulating Dry Scrubber","1994-01-01","NOx control","Selective Noncatalytic Reduction","1994-01-01","PM control","Fabric Filter, pulse","1994-01-01","","",null,"","",null,"","",null,"","",null,"","",null,"","",null,"","",null,"","",null,"",""]
["7210_COP1","coal",32,null,7210,"Cope","SC","COP001","COP1","Conventional Boiler","Tangential firing",441,4059.1,9.2043083900226748,"bituminous","bituminous",5.8597294228616258E-6,7.0496571531439765E-8,6.4887218481466469E-7,null,null,null,2.8959999999999999E-8,2.6655677097505664E-7,2.8959999999999999E-8,2.6655677097505664E-7,"NOx control","Selective Catalytic Reduction","2009-01-01","SO2 control","Dry FGD - Spray Dryer","1993-04-01","PM control","Fabric Filter, unspecified","1993-04-01","","",null,"","",null,"","",null,"","",null,"","",null,"","",null,"","",null,"","",null,"",""]
["2378_2","coal",33,null,2378,"BL England","NJ","2 Coal w or w/o TDF","2","Conventional Boiler","Cyclone firing",167.3,1600,9.5636580992229518,"bituminous","bituminous",null,null,null,null,null,null,2.9648674242424249E-8,2.835497835497836E-7,2.9648674242424249E-8,2.835497835497836E-7,"NOx control","Selective Noncatalytic Reduction","1998-06-01","Other control","Activated carbon injection","2007-12-01","PM control","Electrostatic precipitator, cold side, w/o flue gas conditioning","1979-01-01","SO2 control","Wet FGD - Spray Type","1994-11-01","","",null,"","",null,"","",null,"","",null,"","",null,"","",null,"","",null,"",""]
["10672_CBC","coal",34,null,10672,"Cedar Bay Generating Company L.P.","FL","CBC1","CBC","Fluidized bed firing","Fluidized bed firing",92,1063,11.554347826086957,"bituminous","bituminous",7.3276849095488896E-6,null,null,2.6500033333333332E-8,3.0619060253623187E-7,null,null,null,2.6500033333333332E-8,3.0619060253623187E-7,"SO2 control","Dry FGD - Circulating Dry Scrubber","1994-01-01","NOx control","Selective Noncatalytic Reduction","1994-01-01","PM control","Fabric Filter, pulse","1994-01-01","","",null,"","",null,"","",null,"","",null,"","",null,"","",null,"","",null,"","",null,"",""]
["469_3","coal",35,null,469,"Cherokee","CO","Unit 3","3","Conventional Boiler","Wall firing - front firing",165,1877,11.375757575757575,"bituminous","bituminous",null,null,null,null,null,null,2.8072885363020188E-8,3.1935033834175087E-7,2.8072885363020188E-8,3.1935033834175087E-7,"SO2 control","Dry FGD - Spray Dryer","2002-06-01","PM control","Fabric Filter, reverse air","1988-02-01","","",null,"","",null,"","",null,"","",null,"","",null,"","",null,"","",null,"","",null,"","",null,"",""]
["492_7","coal",36,null,492,"Martin Drake","CO","Unit 7 - Coal","7","Conventional Boiler","Wall firing - front firing",141,1475,10.460992907801419,"subbituminous,  bituminous","subbituminous,  bituminous",1.9613667161328888E-6,null,null,3.1133333333333334E-8,3.2568557919621752E-7,null,1.8300000000000001E-7,1.9143617021276598E-6,3.1133333333333334E-8,3.2568557919621752E-7,"PM control","Fabric Filter, reverse air","1993-11-01","","",null,"","",null,"","",null,"","",null,"","",null,"","",null,"","",null,"","",null,"","",null,"","",null,"",""]
["10566_Boil 2","coal",37,null,10566,"Chambers Cogeneration LP","NJ","Boil 2","Boil 2","Conventional Boiler","Wall firing - front firing",142.5,1387,9.7333333333333325,"bituminous","bituminous",8.2265746473444783E-6,null,null,3.3789999999999994E-8,3.2888933333333324E-7,null,null,null,3.3789999999999994E-8,3.2888933333333324E-7,"NOx control","Selective Catalytic Reduction","1994-03-01","SO2 control","Dry FGD - Spray Dryer","1994-03-01","PM control","Fabric Filter, reverse air","1994-03-01","","",null,"","",null,"","",null,"","",null,"","",null,"","",null,"","",null,"","",null,"",""]
["4042_2","coal",38,null,4042,"Valley","WI","VAPP-B2","2","Conventional Boiler","Wall firing - front firing",72,868,12.055555555555555,"bituminous","bituminous",1.7521757406332535E-6,null,null,2.7399999999999997E-8,3.3032222222222219E-7,null,null,null,2.7399999999999997E-8,3.3032222222222219E-7,"PM control","Fabric Filter, pulse","1994-06-01","","",null,"","",null,"","",null,"","",null,"","",null,"","",null,"","",null,"","",null,"","",null,"","",null,"",""]
["469_4","coal",39,null,469,"Cherokee","CO","Unit 4","4","Conventional Boiler","Tangential firing",383,3520,9.1906005221932112,"bituminous","bituminous",null,null,null,null,null,null,3.5970022575090311E-8,3.3058610826192658E-7,3.5970022575090311E-8,3.3058610826192658E-7,"SO2 control","Dry FGD - Spray Dryer","2002-10-01","PM control","Fabric Filter, reverse air","1989-04-01","","",null,"","",null,"","",null,"","",null,"","",null,"","",null,"","",null,"","",null,"","",null,"",""]
["2451_Unit 4","coal",40,null,2451,"San Juan","NM","Unit 4","Unit 4","Conventional Boiler","Wall firing - opposed firing",544,5649,10.384191176470589,"subbituminous","subbituminous",5.310458681526468E-6,null,null,3.4300000000000003E-8,3.5617775735294123E-7,null,1.36E-7,1.4122500000000001E-6,3.4300000000000003E-8,3.5617775735294123E-7,"Other control","Activated carbon injection","2008-04-01","PM control","Fabric Filter, pulse","2007-10-01","SO2 control","Wet FGD - Spray Type","1998-04-01","","",null,"","",null,"","",null,"","",null,"","",null,"","",null,"","",null,"","",null,"",""]
["3287_MCM2","coal",41,null,3287,"McMeekin","SC","MCM002","MCM2","Conventional Boiler","Tangential firing",132,1101.3,8.3431818181818187,"bituminous","bituminous",4.6986472381395578E-6,4.5298120846488614E-8,3.7793045824422661E-7,null,null,null,8.8999999999999995E-7,7.4254318181818183E-6,4.5298120846488614E-8,3.7793045824422661E-7,"PM control","Fabric Filter, unspecified","1992-11-01","","",null,"","",null,"","",null,"","",null,"","",null,"","",null,"","",null,"","",null,"","",null,"","",null,"",""]
["492_5","coal",42,null,492,"Martin Drake","CO","Unit 5 - Coal","5","Conventional Boiler","Wall firing - front firing",55,570,10.363636363636363,"subbituminous","subbituminous",8.6410456036541206E-6,null,null,3.7500000000000005E-8,3.8863636363636368E-7,null,3.3666666666666669E-7,3.4890909090909092E-6,3.7500000000000005E-8,3.8863636363636368E-7,"PM control","Fabric Filter, reverse air","1998-05-01","","",null,"","",null,"","",null,"","",null,"","",null,"","",null,"","",null,"","",null,"","",null,"","",null,"",""]
["3280_CAN3","coal",43,null,3280,"Canadys Steam","SC","CAN003","CAN3","Conventional Boiler","Wall firing - unspecified",185,1824.5,9.8621621621621625,"bituminous","bituminous",7.2395978617743599E-6,4.3387113091501101E-8,4.2789074505645274E-7,null,null,null,4.224E-8,4.1657772972972975E-7,4.224E-8,4.1657772972972975E-7,"PM control","Fabric Filter, unspecified","1998-07-01","","",null,"","",null,"","",null,"","",null,"",null,null,"","",null,"","",null,"","",null,"","",null,"","",null,"",""]
["50974_#1 CFB boiler","coal",44,null,50974,"Scrubgrass Generating Company L.P.","PA","Gen 1","#1 CFB boiler","Fluidized bed firing","Fluidized bed firing",48.5,650,13.402061855670103,"coal refuse (culm or gob)","coal refuse (culm or gob)",9.2783316165172164E-5,null,null,3.5299999999999998E-8,4.5489690721649483E-7,null,5.6000000000000004E-7,7.2164948453608251E-6,3.5299999999999998E-8,4.5489690721649483E-7,"NOx control","Selective Noncatalytic Reduction","1999-06-01","NOx control","Selective Noncatalytic Reduction","1999-06-01","PM control","Fabric Filter, pulse","1993-06-01","PM control","Fabric Filter, pulse","1993-06-01","SO2 control","Dry FGD - Circulating Dry Scrubber","1993-06-01","SO2 control","Dry FGD - Circulating Dry Scrubber","1993-06-01","","",null,"","",null,"","",null,"","",null,"","",null,"",""]
["50974_#2 CFB Boiler","coal",45,null,50974,"Scrubgrass Generating Company L.P.","PA","Gen 1","#2 CFB Boiler","Fluidized bed firing","Fluidized bed firing",48.5,600,12.371134020618557,"coal refuse (culm or gob)","coal refuse (culm or gob)",9.2783316165172164E-5,null,null,3.5299999999999998E-8,4.5489690721649483E-7,null,5.6000000000000004E-7,7.2164948453608251E-6,3.5299999999999998E-8,4.5489690721649483E-7,"NOx control","Selective Noncatalytic Reduction","1999-06-01","NOx control","Selective Noncatalytic Reduction","1999-06-01","PM control","Fabric Filter, pulse","1993-06-01","PM control","Fabric Filter, pulse","1993-06-01","SO2 control","Dry FGD - Circulating Dry Scrubber","1993-06-01","SO2 control","Dry FGD - Circulating Dry Scrubber","1993-06-01","","",null,"","",null,"","",null,"","",null,"","",null,"",""]
["477_5","coal",46,null,477,"Valmont","CO","Unit 5","5","Conventional Boiler","Tangential firing",196,1845,9.4132653061224492,"bituminous","bituminous",null,null,null,null,null,null,4.9993927304857498E-8,4.7060610141562286E-7,4.9993927304857498E-8,4.7060610141562286E-7,"SO2 control","Dry FGD - Spray Dryer","2002-04-01","PM control","Fabric Filter, reverse air","1984-04-01","","",null,"","",null,"","",null,"","",null,"","",null,"","",null,"","",null,"","",null,"","",null,"",""]
["2451_Unit 3","coal",47,null,2451,"San Juan","NM","Unit 3","Unit 3","Conventional Boiler","Wall firing - opposed firing",544,5758,10.584558823529411,"subbituminous","subbituminous",1.706376600649773E-5,null,null,4.6833333333333342E-8,4.9571017156862753E-7,null,2.4999999999999999E-7,2.6461397058823528E-6,4.6833333333333342E-8,4.9571017156862753E-7,"Other control","Activated carbon injection","2008-04-01","PM control","Fabric Filter, pulse","2008-03-01","SO2 control","Wet FGD - Spray Type","1998-05-01","","",null,"","",null,"","",null,"","",null,"","",null,"","",null,"","",null,"","",null,"",""]
["10671_1b","coal",48,null,10671,"AES Shady Point,LLC","OK","Unit 1","1b","Fluidized bed firing","Fluidized bed firing",80,1110.4350359049981,13.880437948812476,"bituminous,  subbituminous","bituminous,  subbituminous",2.5093234932200198E-5,null,null,3.6666666666666671E-8,5.0894939145645751E-7,null,null,null,3.6666666666666671E-8,5.0894939145645751E-7,"PM control","Fabric Filter, pulse","1991-01-01","","",null,"","",null,"","",null,"","",null,"","",null,"","",null,"","",null,"","",null,"","",null,"","",null,"",""]
["10671_1A","coal",49,null,10671,"AES Shady Point,LLC","OK","Unit 1","1A","Fluidized bed firing","Fluidized bed firing",80,1110.4350359049981,13.880437948812476,"bituminous,  subbituminous","bituminous,  subbituminous",2.5093234932200198E-5,null,null,3.6666666666666671E-8,5.0894939145645751E-7,null,null,null,3.6666666666666671E-8,5.0894939145645751E-7,"PM control","Fabric Filter, pulse","1991-01-01","","",null,"","",null,"","",null,"","",null,"","",null,"","",null,"","",null,"","",null,"","",null,"","",null,"",""]
["10671_2b","coal",50,null,10671,"AES Shady Point,LLC","OK","Unit 2","2b","Fluidized bed firing","Fluidized bed firing",80,1110.4350359049981,13.880437948812476,"bituminous,  subbituminous","bituminous,  subbituminous",2.5093234932200198E-5,null,null,3.6666666666666671E-8,5.0894939145645751E-7,null,null,null,3.6666666666666671E-8,5.0894939145645751E-7,"PM control","Fabric Filter, pulse","1991-01-01","","",null,"","",null,"","",null,"","",null,"","",null,"","",null,"","",null,"","",null,"","",null,"","",null,"",""]
["10671_2a","coal",51,null,10671,"AES Shady Point,LLC","OK","Unit 2","2a","Fluidized bed firing","Fluidized bed firing",80,1110.4350359049981,13.880437948812476,"bituminous,  subbituminous","bituminous,  subbituminous",2.5093234932200198E-5,null,null,3.6666666666666671E-8,5.0894939145645751E-7,null,null,null,3.6666666666666671E-8,5.0894939145645751E-7,"PM control","Fabric Filter, pulse","1991-01-01","","",null,"","",null,"","",null,"","",null,"","",null,"","",null,"","",null,"","",null,"","",null,"","",null,"",""]
["1606_1","coal",52,null,1606,"Mount Tom","MA","1 current","1","Conventional Boiler","Wall firing - front firing",155,1480,9.5483870967741939,"coal - bituminous","bituminous",null,null,null,null,null,null,5.5500000000000001E-8,5.2993548387096773E-7,5.5500000000000001E-8,5.2993548387096773E-7,"NOx control","Selective Catalytic Reduction","2006-06-01","PM control","Electrostatic precipitator, cold side, w/o flue gas conditioning","1982-09-01","SO2 control","Dry FGD - Circulating Dry Scrubber","2009-12-01","PM control","Fabric Filter, pulse","2009-12-01","","",null,"","",null,"","",null,"","",null,"","",null,"","",null,"","",null,"",""]
["50776_BLR1","coal",53,null,50776,"PANTHER CREEK ENERGY FACILITY","PA","BG1","BLR1","Fluidized bed firing","Fluidized bed firing",46.5,600,12.903225806451612,"coal refuse (culm or gob)","coal refuse (culm or gob)",3.4799351186253401E-5,null,null,4.1333333333333333E-8,5.3333333333333334E-7,null,8.1000000000000011E-8,1.0451612903225808E-6,4.1333333333333333E-8,5.3333333333333334E-7,"NOx control","Selective Noncatalytic Reduction","1992-10-01","PM control","Fabric Filter, pulse","1992-10-01","","",null,"","",null,"","",null,"","",null,"","",null,"","",null,"","",null,"","",null,"","",null,"",""]
["50776_BLR2","coal",54,null,50776,"PANTHER CREEK ENERGY FACILITY","PA","BG2","BLR2","Fluidized bed firing","Fluidized bed firing",46.5,600,12.903225806451612,"coal refuse (culm or gob)","coal refuse (culm or gob)",3.4799351186253401E-5,null,null,4.1333333333333333E-8,5.3333333333333334E-7,null,5.9833333333333333E-8,7.7204301075268812E-7,4.1333333333333333E-8,5.3333333333333334E-7,"NOx control","Selective Noncatalytic Reduction","1992-10-01","PM control","Fabric Filter, pulse","1992-10-01","","",null,"","",null,"","",null,"","",null,"","",null,"","",null,"","",null,"","",null,"","",null,"",""]
["2408_E1","coal",55,null,2408,"PSEG Mercer Generating Station","NJ","MERU1E1PT1OS1-Coal","E1","Conventional Boiler","Wall firing - unspecified",343,3100,9.037900874635568,"bituminous","bituminous",3.1779332418774582E-6,null,null,3.1833333333333334E-7,2.8770651117589891E-6,null,5.9130000000000001E-8,5.3441107871720119E-7,5.9130000000000001E-8,5.3441107871720119E-7,"PM control","Electrostatic precipitator, cold side, w/ flue gas conditioning","1994-05-01","NOx control","Selective Catalytic Reduction","2004-06-01","Other control","Activated carbon injection","2007-01-01","PM control","Fabric Filter, pulse","2008-12-01","","",null,"","",null,"","",null,"","",null,"","",null,"","",null,"","",null,"",""]
["7213_2","coal",56,null,7213,"Clover","VA","Unit 2","2","Conventional Boiler","Tangential firing",434,5041,11.61520737327189,"bituminous","bituminous",5.4208333509157636E-6,null,null,4.8745858007666673E-8,5.6619324934711457E-7,null,null,null,4.8745858007666673E-8,5.6619324934711457E-7,"NOx control","Selective Noncatalytic Reduction","2003-03-01","PM control","Fabric Filter, reverse air","2003-05-01","SO2 control","Wet FGD - Spray Type","2003-05-01","","",null,"","",null,"","",null,"","",null,"","",null,"","",null,"","",null,"","",null,"",""]
["10771_10771-01","coal",57,null,10771,"Hopewell","VA","1 & 2","10771-01","Conventional Boiler","Stoker - spreader",34,433,12.735294117647058,"bituminous","bituminous",7.3049289891395158E-6,null,null,4.5931342286333333E-8,5.7751908315904416E-7,null,null,null,4.5931342286333333E-8,5.7751908315904416E-7,"NOx control","Selective Noncatalytic Reduction","1992-04-01","NOx control","Selective Noncatalytic Reduction","1992-04-01","PM control","Multiple cyclone","1992-04-01","PM control","Multiple cyclone","1992-04-01","SO2 control","Dry FGD - Spray Dryer","1992-04-01","SO2 control","Dry FGD - Spray Dryer","1992-04-01","PM control","Fabric Filter, pulse","1992-04-01","PM control","Fabric Filter, pulse","1992-04-01","","",null,"","",null,"","",null,"",""]
["10771_10771-02","coal",58,null,10771,"Hopewell","VA","1 & 2","10771-02","Conventional Boiler","Stoker - underfeed",34,422,12.411764705882353,"bituminous","bituminous",7.3049289891395158E-6,null,null,4.5931342286333333E-8,5.7751908315904416E-7,null,null,null,4.5931342286333333E-8,5.7751908315904416E-7,"NOx control","Selective Noncatalytic Reduction","1992-04-01","NOx control","Selective Noncatalytic Reduction","1992-04-01","PM control","Multiple cyclone","1992-04-01","PM control","Multiple cyclone","1992-04-01","SO2 control","Dry FGD - Spray Dryer","1992-04-01","SO2 control","Dry FGD - Spray Dryer","1992-04-01","PM control","Fabric Filter, pulse","1992-04-01","PM control","Fabric Filter, pulse","1992-04-01","","",null,"","",null,"","",null,"",""]
["6041_3","coal",59,null,6041,"H L Spurlock Station","KY","Unit 03","3","Fluidized bed firing","Fluidized bed firing",300,2500,8.3333333333333339,"bituminous","bituminous",1.2623505352171143E-5,null,null,7.1999999999999996E-8,5.9999999999999997E-7,null,null,null,7.1999999999999996E-8,5.9999999999999997E-7,"NOx control","Selective Noncatalytic Reduction","2005-03-01","SO2 control","Dry FGD - Unspecified","2005-03-01","PM control","Fabric Filter, pulse","2005-03-01","","",null,"","",null,"","",null,"","",null,"","",null,"","",null,"","",null,"","",null,"",""]
["2451_Unit 2","coal",60,null,2451,"San Juan","NM","Unit 2","Unit 2","Conventional Boiler","Wall firing - front firing",370,3688,9.967567567567567,"subbituminous","subbituminous",8.2275469999659974E-6,null,null,6.1033333333333344E-8,6.0835387387387398E-7,null,null,null,6.1033333333333344E-8,6.0835387387387398E-7,"Other control","Activated carbon injection","2009-06-01","PM control","Fabric Filter, pulse","2009-04-01","SO2 control","Wet FGD - Spray Type","1998-05-01","","",null,"","",null,"","",null,"","",null,"","",null,"","",null,"","",null,"","",null,"",""]
["50951_1","coal",61,null,50951,"Sunnyside Cogen Associates","UT","Config 1","1","Fluidized bed firing","Fluidized bed firing",60,700,11.666666666666666,"bituminous","bituminous",1.3882284194262253E-5,null,null,5.32E-8,6.2066666666666664E-7,null,null,null,5.32E-8,6.2066666666666664E-7,"NOx control","Other (specify): Anhydrous ammonia injection","1993-01-01","SO2 control","Dry FGD - Sorbent Injection","1993-01-01","PM control","Fabric Filter, pulse","1993-01-01","","",null,"","",null,"","",null,"","",null,"","",null,"","",null,"","",null,"","",null,"",""]
["6021_C2","coal",62,null,6021,"Craig","CO","C2","C2","Conventional Boiler","Wall firing - opposed firing",456,4269,9.3618421052631575,"subbituminous","subbituminous",1.6414252455585893E-6,null,null,6.7920000000000002E-8,6.3585631578947373E-7,null,8.3566666666666667E-8,7.8233793859649118E-7,6.7920000000000002E-8,6.3585631578947373E-7,"PM control","Fabric Filter, pulse","2004-05-01","SO2 control","Wet FGD - Spray Type","1979-11-01","","",null,"","",null,"","",null,"","",null,"","",null,"","",null,"","",null,"","",null,"","",null,"",""]
["56068_1","coal",63,null,56068,"Elm Road Generating Station","WI","ERGS-B1","1","Conventional Boiler","Wall firing - unspecified",677,6515,9.6233382570162487,"bituminous","bituminous",8.7406792856999475E-6,null,null,7.5333333333333333E-8,7.2495814869522406E-7,null,null,null,7.5333333333333333E-8,7.2495814869522406E-7,"NOx control","Selective Catalytic Reduction","2009-10-01","PM control","Fabric Filter, pulse","2009-10-01","SO2 control","Wet FGD - Spray Type","2009-10-01","Other control","Wet electrostatic precipitator","2009-10-01","","",null,"","",null,"","",null,"","",null,"","",null,"","",null,"","",null,"",""]
["3287_MCM1","coal",64,null,3287,"McMeekin","SC","MCM001","MCM1","Conventional Boiler","Tangential firing",135,1143.5,8.4703703703703699,"bituminous","bituminous",4.8187002976052354E-6,8.8463094938116517E-8,7.4931517823508316E-7,null,null,null,1.0100000000000001E-6,8.5550740740740741E-6,8.8463094938116517E-8,7.4931517823508316E-7,"PM control","Fabric Filter, unspecified","1993-04-01","","",null,"","",null,"","",null,"","",null,"","",null,"","",null,"","",null,"","",null,"","",null,"","",null,"",""]
[{"$f":"E66&\"_\"&I66","v":"54144_BRBR1"},"coal",65,null,54144,"Piney Creek Project","PA","BRBRI","BRBR1","Fluidized bed firing","Fluidized bed firing",36,450,12.5,"bituminous,  synfuel","bituminous,  synfuel",6.9238759718575799E-5,null,null,1.2733333333333334E-7,1.5916666666666667E-6,null,6.0972972972972973E-8,7.6216216216216218E-7,6.0972972972972973E-8,7.6216216216216218E-7,"NOx control","Selective Noncatalytic Reduction","2002-08-01","PM control","Fabric Filter, pulse","1992-11-01","","",null,"","",null,"","",null,"","",null,"","",null,"","",null,"","",null,"","",null,"","",null,"",""]
["2408_E2","coal",66,null,2408,"PSEG Mercer Generating Station","NJ","MERU2E2PT2OS1-Coal","E2","Conventional Boiler","Wall firing - unspecified",343,3100,9.037900874635568,"bituminous","bituminous",6.1200403893571266E-6,null,null,4.8033333333333339E-7,4.341205053449952E-6,null,8.9406666666666672E-8,8.0804859086491742E-7,8.9406666666666672E-8,8.0804859086491742E-7,"PM control","Electrostatic precipitator, cold side, w/ flue gas conditioning","1991-08-01","NOx control","Selective Catalytic Reduction","2004-06-01","Other control","Activated carbon injection","2007-01-01","PM control","Fabric Filter, pulse","2008-12-01","","",null,"","",null,"","",null,"","",null,"","",null,"","",null,"","",null,"",""]
["4042_4","coal",67,null,4042,"Valley","WI","VAPP-B4","4","Conventional Boiler","Wall firing - front firing",72,868,12.055555555555555,"bituminous","bituminous",1.3143585093746274E-6,null,null,7.3400000000000009E-8,8.848777777777779E-7,null,null,null,7.3400000000000009E-8,8.848777777777779E-7,"PM control","Fabric Filter, pulse","1995-06-01","","",null,"","",null,"","",null,"","",null,"","",null,"","",null,"","",null,"","",null,"","",null,"","",null,"",""]
["2384_8","coal",68,null,2384,"Deepwater","NJ","Coal-firing","8","Conventional Boiler","Wall firing - front firing",87,820,9.4252873563218387,"","bituminous",null,null,null,null,null,null,9.4342410975609746E-8,8.8920433333333324E-7,9.4342410975609746E-8,8.8920433333333324E-7,"Other control","Other (specify): Hydrated lime injection to control HCl","2008-09-01","NOx control","Selective Noncatalytic Reduction","2008-09-01","PM control","Fabric Filter, reverse air","1981-01-01","","",null,"","",null,"","",null,"","",null,"","",null,"","",null,"","",null,"","",null,"",""]
["568_BHB3","coal",69,null,568,"Bridgeport Station","CT","BHSEMU3OS2-Coal","BHB3","Conventional Boiler","Tangential firing",403,4100,10.173697270471465,"subbituminous","subbituminous",1.8870308736066488E-6,null,null,1.2166666666666666E-7,1.2377998345740282E-6,null,9.0066666666666679E-8,9.1631100082713001E-7,9.0066666666666679E-8,9.1631100082713001E-7,"PM control","Electrostatic precipitator, cold side, w/o flue gas conditioning","1968-08-01","Other control","Activated carbon injection","2008-07-01","PM control","Fabric Filter, pulse","2008-01-01","","",null,"","",null,"","",null,"","",null,"","",null,"","",null,"","",null,"","",null,"",""]
["963_34","coal",70,null,963,"Dallman","IL","34","34","Conventional Boiler","Wall firing - opposed firing",229.4,1924.9,8.3910200523103757,"bituminous","bituminous",6.0378362671802397E-6,null,null,5.7268999999999998E-7,4.8054532737576288E-6,null,1.1600000000000001E-7,9.7335832606800371E-7,1.1600000000000001E-7,9.7335832606800371E-7,"NOx control","Selective Catalytic Reduction","2009-05-01","PM control","Fabric Filter, pulse","2009-05-01","SO2 control","Wet FGD - Packed Type","2009-05-01","Other control","Wet electrostatic precipitator","2009-05-01","","",null,"","",null,"","",null,"","",null,"","",null,"","",null,"","",null,"",""]
["6021_C1","coal",71,null,6021,"Craig","CO","C1","C1","Conventional Boiler","Wall firing - opposed firing",456,4028,8.8333333333333339,"subbituminous","subbituminous",1.7000550765434694E-6,null,null,2.2625E-7,1.9985416666666668E-6,null,1.1266666666666666E-7,9.9522222222222222E-7,1.1266666666666666E-7,9.9522222222222222E-7,"PM control","Fabric Filter, pulse","2003-11-01","SO2 control","Wet FGD - Spray Type","1980-07-01","","",null,"","",null,"","",null,"","",null,"","",null,"","",null,"","",null,"","",null,"","",null,"",""]
["6082_1","coal",72,null,6082,"AES Somerset LLC","NY","001","1","Conventional Boiler","Wall firing - opposed firing",680.8,6280,9.2244418331374867,"","Bituminous",null,null,null,null,null,null,1.3199999999999999E-7,1.2176263219741481E-6,1.3199999999999999E-7,1.2176263219741481E-6,"NOx control","Selective Catalytic Reduction","1999-01-01","Other control","Dry sorbent injection",null,"PM control","Electrostatic precipitator, unspecified","1984-01-01","SO2 control","Wet FGD - Spray Type","1984-01-01","","",null,"","",null,"","",null,"","",null,"","",null,"","",null,"","",null,"",""]
["2712_1","coal",73,null,2712,"Roxboro Steam Electric Plant","NC","Rox_Cfg_1b","1","Conventional Boiler","Wall firing - opposed firing",385,3755,9.7532467532467528,"bituminous","bituminous",5.5678373194470977E-6,null,null,1.2937892664800001E-7,1.2618645962681559E-6,null,null,null,1.2937892664800001E-7,1.2618645962681559E-6,"NOx control","Selective Catalytic Reduction","2002-05-01","PM control","Electrostatic precipitator, cold side, w/o flue gas conditioning","1974-01-01","SO2 control","Wet FGD - Spray/Tray Type","2008-12-01","","",null,"","",null,"","",null,"","",null,"","",null,"","",null,"","",null,"","",null,"",""]
["2451_Unit 1","coal",74,null,2451,"San Juan","NM","Unit 1","Unit 1","Conventional Boiler","Wall firing - front firing",370,3707,10.018918918918919,"subbituminous","subbituminous",1.4886714056583725E-5,null,null,1.3090000000000001E-7,1.3114764864864867E-6,null,null,null,1.3090000000000001E-7,1.3114764864864867E-6,"Other control","Activated carbon injection","2009-06-01","PM control","Fabric Filter, pulse","2008-10-01","SO2 control","Wet FGD - Spray Type","1998-05-01","","",null,"","",null,"","",null,"","",null,"","",null,"","",null,"","",null,"","",null,"",""]
["2712_2","coal",75,null,2712,"Roxboro Steam Electric Plant","NC","Rox_Cfg_2c","2","Conventional Boiler","Tangential firing",703,6893,9.8051209103840691,"bituminous","bituminous",6.0380420350958305E-6,null,null,1.5089201328E-7,1.4795144346216786E-6,null,6.2783333333333335E-7,6.1559817449027981E-6,1.5089201328E-7,1.4795144346216786E-6,"NOx control","Selective Catalytic Reduction","2005-05-01","PM control","Electrostatic precipitator, cold side, w/o flue gas conditioning","1974-05-01","SO2 control","Wet FGD - Spray/Tray Type","2007-04-20","","",null,"","",null,"","",null,"","",null,"","",null,"","",null,"","",null,"","",null,"",""]
["52007_BLR2","coal",76,null,52007,"Mecklenburg Power Station","VA","Unit 1 & 2","BLR2","Conventional Boiler","Wall firing - front firing",76,918,12.078947368421053,"bituminous","bituminous",7.1657674063562729E-6,null,null,1.2533333333333332E-7,1.5122456140350875E-6,null,null,null,1.2533333333333332E-7,1.5122456140350875E-6,"SO2 control","Dry FGD - Spray Dryer","1992-11-01","SO2 control","Dry FGD - Spray Dryer","1992-11-01","PM control","Fabric Filter, pulse","1992-11-01","PM control","Fabric Filter, pulse","1992-11-01","","",null,"","",null,"","",null,"","",null,"","",null,"","",null,"","",null,"",""]
["52007_BLR2","coal",77,null,52007,"Mecklenburg Power Station","VA","Unit 1 & 2","BLR2","Conventional Boiler","Wall firing - front firing",76,918,12.078947368421053,"bituminous","bituminous",7.1657674063562729E-6,null,null,1.2533333333333332E-7,1.5122456140350875E-6,null,null,null,1.2533333333333332E-7,1.5122456140350875E-6,"SO2 control","Dry FGD - Spray Dryer","1992-11-01","SO2 control","Dry FGD - Spray Dryer","1992-11-01","PM control","Fabric Filter, pulse","1992-11-01","PM control","Fabric Filter, pulse","1992-11-01","","",null,"","",null,"","",null,"","",null,"","",null,"","",null,"","",null,"",""]
["52007_BLR1","coal",78,null,52007,"Mecklenburg Power Station","VA","Unit 1 & 2","BLR1","Conventional Boiler","Wall firing - front firing",76,916,12.052631578947368,"bituminous","bituminous",7.1657674063562729E-6,null,null,1.2533333333333332E-7,1.5122456140350875E-6,null,null,null,1.2533333333333332E-7,1.5122456140350875E-6,"SO2 control","Dry FGD - Spray Dryer","1992-11-01","SO2 control","Dry FGD - Spray Dryer","1992-11-01","PM control","Fabric Filter, pulse","1992-11-01","PM control","Fabric Filter, pulse","1992-11-01","","",null,"","",null,"","",null,"","",null,"","",null,"","",null,"","",null,"",""]
["52007_BLR1","coal",79,null,52007,"Mecklenburg Power Station","VA","Unit 1 & 2","BLR1","Conventional Boiler","Wall firing - front firing",76,916,12.052631578947368,"bituminous","bituminous",7.1657674063562729E-6,null,null,1.2533333333333332E-7,1.5122456140350875E-6,null,null,null,1.2533333333333332E-7,1.5122456140350875E-6,"SO2 control","Dry FGD - Spray Dryer","1992-11-01","SO2 control","Dry FGD - Spray Dryer","1992-11-01","PM control","Fabric Filter, pulse","1992-11-01","PM control","Fabric Filter, pulse","1992-11-01","","",null,"","",null,"","",null,"","",null,"","",null,"","",null,"","",null,"",""]
["6041_4","coal",80,null,6041,"H L Spurlock Station","KY","Unit 04","4","Fluidized bed firing","Fluidized bed firing",300,2800,9.3333333333333339,"bituminous","bituminous",1.6314179247363216E-5,null,null,1.7100000000000001E-7,1.5960000000000003E-6,null,5.1399999999999997E-7,4.7973333333333332E-6,1.7100000000000001E-7,1.5960000000000003E-6,"NOx control","Selective Noncatalytic Reduction","2009-04-01","SO2 control","Dry FGD - Unspecified","2009-04-01","PM control","Fabric Filter, pulse","2009-04-01","","",null,"","",null,"","",null,"","",null,"","",null,"","",null,"","",null,"","",null,"",""]
["130_1","coal",81,null,130,"Cross","SC","C1","1","Conventional Boiler","Wall firing - opposed firing",610,6502,10.659016393442624,"bituminous","bituminous",1.5559776089564174E-6,null,null,1.5033333333333334E-7,1.6024054644808746E-6,null,null,null,1.5033333333333334E-7,1.6024054644808746E-6,"NOx control","Selective Catalytic Reduction","2003-06-01","PM control","Electrostatic precipitator, cold side, w/o flue gas conditioning","1995-05-01","SO2 control","Wet FGD - Spray Type","1995-05-01","","",null,"","",null,"","",null,"","",null,"","",null,"","",null,"","",null,"","",null,"",""]
["891_Boiler 9","coal",82,null,891,"Havana","IL","Boiler 9","Boiler 9","Conventional Boiler","Wall firing - unspecified",481,5030,10.457380457380458,"bituminous","bituminous",5.6622601277056156E-6,null,null,1.5966666666666665E-7,1.6696950796950796E-6,null,null,null,1.5966666666666665E-7,1.6696950796950796E-6,"PM control","Electrostatic precipitator, hot side, unspecified","1978-04-01","NOx control","Selective Catalytic Reduction","2003-08-01","Other control","Activated carbon injection","2009-07-01","SO2 control","Dry FGD - Spray Dryer",null,"PM control","Fabric Filter, unspecified","2009-06-01","","",null,"","",null,"","",null,"","",null,"","",null,"","",null,"",""]
["892_Unit 1","coal",83,null,892,"Hennepin Power Station","IL","001","Unit 1","Conventional Boiler","Tangential firing",75,776,10.346666666666666,"subbituminous","subbituminous",6.631960680160477E-6,null,null,1.6166666666666667E-7,1.6727111111111111E-6,null,null,null,1.6166666666666667E-7,1.6727111111111111E-6,"PM control","Electrostatic precipitator, cold side, unspecified","1972-08-01","Other control","Activated carbon injection","2009-12-01","PM control","Fabric Filter, unspecified","2008-10-01","","",null,"","",null,"","",null,"","",null,"","",null,"","",null,"","",null,"","",null,"",""]
["892_Unit 2","coal",84,null,892,"Hennepin Power Station","IL","002","Unit 2","Conventional Boiler","Tangential firing",234,2500,10.683760683760683,"subbituminous","subbituminous",6.631960680160477E-6,null,null,1.6166666666666667E-7,1.7272079772079771E-6,null,null,null,1.6166666666666667E-7,1.7272079772079771E-6,"PM control","Electrostatic precipitator, cold side, unspecified","1974-06-01","Other control","Activated carbon injection","2009-06-01","PM control","Fabric Filter, unspecified","2008-12-01","","",null,"","",null,"","",null,"","",null,"","",null,"","",null,"","",null,"","",null,"",""]
["602_2","coal",85,null,602,"Brandon Shores","MD","002","2","Conventional Boiler","Wall firing - unspecified",690,6700,9.7101449275362324,"bituminous","bituminous",7.901053232838728E-6,null,null,null,null,1.8469666666666669E-7,null,null,1.8469666666666669E-7,1.7934314009661838E-6,"NOx control","Selective Catalytic Reduction",null,"PM control","Electrostatic precipitator, hot side, unspecified",null,"Other control","Activated carbon injection",null,"Other control","Other (specify): lime injection",null,"PM control","Fabric Filter, unspecified",null,"SO2 control","Wet FGD - Unspecified",null,"","",null,"","",null,"","",null,"","",null,"","",null,"",""]
["1613_8","coal",86,null,1613,"Somerset Station","MA","Unit 8","8","Conventional Boiler","Tangential firing",113,1284,11.36283185840708,"coal - bituminous","bituminous",null,null,null,null,null,null,1.7450000000000001E-7,1.9828141592920355E-6,1.7450000000000001E-7,1.9828141592920355E-6,"NOx control","Selective Noncatalytic Reduction","1995-03-01","PM control","Electrostatic precipitator, cold side, w/o flue gas conditioning","1984-03-01","","",null,"","",null,"","",null,"","",null,"","",null,"","",null,"","",null,"","",null,"","",null,"",""]
["8219_1","coal",87,null,8219,"Ray D Nixon","CO","Unit 1","1","Conventional Boiler","Wall firing - front firing",225,2095,9.3111111111111118,"subbituminous","subbituminous",null,null,null,null,null,null,2.1549999999999999E-7,2.0065444444444446E-6,2.1549999999999999E-7,2.0065444444444446E-6,"PM control","Fabric Filter, reverse air","1980-04-01","","",null,"","",null,"","",null,"","",null,"","",null,"","",null,"","",null,"","",null,"","",null,"","",null,"",""]
["3775_1","coal",88,null,3775,"Clinch River","VA","CR-1","1","Conventional Boiler","Vertical firing",230,2100.9,9.1343478260869571,"bituminous","bituminous",2.2451059271555435E-6,null,null,2.2725261675750002E-7,2.0758044458514426E-6,null,null,null,2.2725261675750002E-7,2.0758044458514426E-6,"NOx control","Selective Noncatalytic Reduction","2009-01-01","PM control","Electrostatic precipitator, cold side, w/ flue gas conditioning","1975-02-01","","",null,"","",null,"","",null,"","",null,"","",null,"","",null,"","",null,"","",null,"","",null,"",""]
["2706_1","coal",89,null,2706,"Asheville Steam Electric Plant","NC","Ash_Cfg_1d","1","Conventional Boiler","Wall firing - front firing",207,1914,9.2463768115942031,"bituminous","bituminous",7.1529326312437024E-6,null,null,6.7033333333333326E-7,6.1981545893719802E-6,null,2.2933333333333335E-7,2.1205024154589375E-6,2.2933333333333335E-7,2.1205024154589375E-6,"NOx control","Selective Catalytic Reduction","2007-06-14","PM control","Electrostatic precipitator, cold side, w/o flue gas conditioning","2005-11-17","SO2 control","Wet FGD - Spray/Tray Type","2005-11-17","","",null,"","",null,"","",null,"","",null,"","",null,"","",null,"","",null,"","",null,"",""]
["130_3","coal",90,null,130,"Cross","SC","C3","3","Conventional Boiler","Tangential firing",625,6058,9.6928000000000001,"bituminous","bituminous",1.1826523712933451E-6,null,null,2.2900000000000003E-7,2.2196512000000001E-6,null,4.7208814879537854E-7,4.5758560086438452E-6,2.2900000000000003E-7,2.2196512000000001E-6,"NOx control","Selective Catalytic Reduction","2006-08-01","PM control","Electrostatic precipitator, cold side, w/o flue gas conditioning","2006-08-01","SO2 control","Wet FGD - Spray Type","2006-08-01","","",null,"","",null,"","",null,"","",null,"","",null,"","",null,"","",null,"","",null,"",""]
["876_2","coal",91,null,876,"Kincaid Generation LLC","IL","KI1 & 2","2","Conventional Boiler","Cyclone firing",626,6708,10.715654952076678,"coal - subbituminous","subbituminous",null,null,null,null,null,null,2.2333333333333332E-7,2.408707264957265E-6,2.2333333333333332E-7,2.408707264957265E-6,"NOx control","Selective Catalytic Reduction","2003-05-01","NOx control","Selective Catalytic Reduction","2002-06-01","Other control","Activated carbon injection","2009-07-01","Other control","Activated carbon injection","2009-07-01","PM control","Electrostatic precipitator, cold side, w/o flue gas conditioning","1981-06-01","PM control","Electrostatic precipitator, cold side, w/o flue gas conditioning","1982-02-01","","",null,"","",null,"","",null,"","",null,"","",null,"",""]
["876_1","coal",92,null,876,"Kincaid Generation LLC","IL","KI1 & 2","1","Conventional Boiler","Cyclone firing",622,6752,10.855305466237942,"coal - subbituminous","subbituminous",null,null,null,null,null,null,2.2333333333333332E-7,2.408707264957265E-6,2.2333333333333332E-7,2.408707264957265E-6,"NOx control","Selective Catalytic Reduction","2003-05-01","NOx control","Selective Catalytic Reduction","2002-06-01","Other control","Activated carbon injection","2009-07-01","Other control","Activated carbon injection","2009-07-01","PM control","Electrostatic precipitator, cold side, w/o flue gas conditioning","1981-06-01","PM control","Electrostatic precipitator, cold side, w/o flue gas conditioning","1982-02-01","","",null,"","",null,"","",null,"","",null,"","",null,"",""]
["3298_WIL1","coal",93,null,3298,"Williams","SC","WIL001","WIL1","Conventional Boiler","Tangential firing",654,5701.2,8.7174311926605501,"","Bituminous",null,null,null,null,null,null,2.8099999999999999E-7,2.4495981651376143E-6,2.8099999999999999E-7,2.4495981651376143E-6,"NOx control","Selective Catalytic Reduction","2004-05-01","PM control","Electrostatic precipitator, cold side, unspecified","1984-01-01","SO2 control","Wet FGD - Unspecified","2009-10-01","","",null,"","",null,"","",null,"","",null,"","",null,"","",null,"","",null,"","",null,"",""]
["3149_1","coal",94,null,3149,"PPL Montour","PA","U1","1","Conventional Boiler","Tangential firing",797,7239,9.0828105395232122,"bituminous","bituminous",4.6228044804764952E-6,null,null,2.8333333333333336E-7,2.5734629861982436E-6,null,null,null,2.8333333333333336E-7,2.5734629861982436E-6,"PM control","Electrostatic precipitator, cold side, w/o flue gas conditioning","2001-05-01","NOx control","Selective Catalytic Reduction","2001-05-01","SO2 control","Wet FGD - Tray Type","2008-05-01","","",null,"","",null,"","",null,"","",null,"","",null,"","",null,"","",null,"","",null,"",""]
["10343_SG-101","coal",95,null,10343,"Foster Wheeler Mt Carmel Cogen","PA","SG-101","SG-101","Fluidized bed firing","Fluidized bed firing",43,505,11.744186046511627,"coal refuse (culm or gob)","coal refuse (culm or gob)",null,null,null,null,null,null,2.2499999999999996E-7,2.6424418604651157E-6,2.2499999999999996E-7,2.6424418604651157E-6,"PM control","Fabric Filter, reverse air","1990-01-01","","",null,"","",null,"","",null,"","",null,"","",null,"","",null,"","",null,"","",null,"","",null,"","",null,"",""]
["525_1","coal",96,null,525,"Hayden","CO","Unit 1","1","Conventional Boiler","Wall firing - front firing",202,1963,9.717821782178218,"bituminous","bituminous",1.5910236621808459E-6,null,null,3.3352866666666663E-7,3.2411721419141913E-6,null,2.8002063718263203E-7,2.7211906474728053E-6,2.8002063718263203E-7,2.7211906474728053E-6,"SO2 control","Dry FGD - Spray Dryer","1998-12-01","PM control","Fabric Filter, reverse air","1998-12-01","","",null,"","",null,"","",null,"","",null,"","",null,"","",null,"","",null,"","",null,"","",null,"",""]
["6137_1","coal",97,null,6137,"A. B. Brown Generating Station","IN","1Config","1","Conventional Boiler","Wall firing - opposed firing",265,2518,9.5018867924528294,"subbituminous","subbituminous",9.2808140065817434E-6,null,null,3.0507975404E-7,2.8988332855574337E-6,null,null,null,3.0507975404E-7,2.8988332855574337E-6,"NOx control","Selective Catalytic Reduction","2005-04-01","PM control","Fabric Filter, pulse","2004-11-01","SO2 control","Wet FGD - Spray Type","1979-04-01","","",null,"","",null,"","",null,"","",null,"","",null,"","",null,"","",null,"","",null,"",""]
["2535_1","coal",98,null,2535,"AES Cayuga, LLC","NY","Unit_1","1","Conventional Boiler","Tangential firing",164,1462,8.9146341463414629,"bituminous","bituminous",null,null,null,null,null,null,3.3700000000000001E-7,3.0042317073170731E-6,3.3700000000000001E-7,3.0042317073170731E-6,"NOx control","Selective Catalytic Reduction",null,"PM control","Electrostatic precipitator, cold side, w/o flue gas conditioning",null,"SO2 control","Wet FGD - Spray Type","1995-06-01","","",null,"","",null,"","",null,"","",null,"","",null,"","",null,"","",null,"","",null,"",""]
["130_4","coal",99,null,130,"Cross","SC","C4","4","Conventional Boiler","Tangential firing",625,6798,10.876799999999999,"bituminous","bituminous",1.1535871672836241E-6,null,null,2.7666666666666668E-7,3.009248E-6,null,3.8266666666666671E-7,4.1621887999999998E-6,2.7666666666666668E-7,3.009248E-6,"NOx control","Selective Catalytic Reduction","2008-05-01","PM control","Electrostatic precipitator, cold side, w/o flue gas conditioning","2008-05-01","SO2 control","Wet FGD - Spray Type","2008-05-01","","",null,"","",null,"","",null,"","",null,"","",null,"","",null,"","",null,"","",null,"",""]
["10641_B1","coal",100,null,10641,"Cambria Cogen","PA","001","B1","Fluidized bed firing","Fluidized bed firing",49,560,11.428571428571429,"coal refuse (culm or gob),  other--natural gas","coal refuse (culm or gob),  other--natural gas",8.2719826813903169E-5,null,null,2.6333333333333334E-7,3.0095238095238094E-6,null,null,null,2.6333333333333334E-7,3.0095238095238094E-6,"NOx control","Selective Noncatalytic Reduction",null,"PM control","Fabric Filter, unspecified",null,"","",null,"","",null,"","",null,"","",null,"","",null,"","",null,"","",null,"","",null,"","",null,"",""]
["10641_B2","coal",101,null,10641,"Cambria Cogen","PA","002","B2","Fluidized bed firing","Fluidized bed firing",49,560,11.428571428571429,"coal refuse (culm or gob),  other--natural gas","coal refuse (culm or gob),  other--natural gas",6.1750314893970189E-5,null,null,2.8500000000000002E-7,3.2571428571428577E-6,null,null,null,2.8500000000000002E-7,3.2571428571428577E-6,"NOx control","Selective Noncatalytic Reduction",null,"PM control","Fabric Filter, unspecified",null,"","",null,"","",null,"","",null,"","",null,"","",null,"","",null,"","",null,"","",null,"","",null,"",""]
["525_2","coal",102,null,525,"Hayden","CO","Unit 2","2","Conventional Boiler","Tangential firing",285,2712,9.5157894736842099,"bituminous","bituminous",1.7930925780211013E-6,null,null,5.5166666666666664E-7,5.2495438596491223E-6,3.4499999999999998E-7,7.4000000000000001E-7,7.0416842105263157E-6,3.4499999999999998E-7,3.2829473684210523E-6,"SO2 control","Dry FGD - Spray Dryer","1999-06-01","PM control","Fabric Filter, reverse air","1999-06-01","","",null,"","",null,"","",null,"","",null,"","",null,"","",null,"","",null,"","",null,"","",null,"",""]
["2277_2","coal",103,null,2277,"Sheldon Station","NE","U2","2","Conventional Boiler","Cyclone firing",141,1514,10.73758865248227,"subbituminous","subbituminous",5.296763705821299E-6,3.3075371243317893E-7,3.551497309388886E-6,null,null,null,null,null,3.3075371243317893E-7,3.551497309388886E-6,"PM control","Fabric Filter, pulse","2000-02-01","","",null,"","",null,"","",null,"","",null,"","",null,"","",null,"","",null,"","",null,"","",null,"","",null,"",""]
["10774_1","coal",104,null,10774,"Southampton Power Station","VA","Unit 1 & 2","1","Conventional Boiler","Stoker - spreader",34,442,13,"bituminous","bituminous",9.7640777072708853E-6,null,null,2.7960188469666665E-7,3.6553834631667156E-6,null,null,null,2.7960188469666665E-7,3.6553834631667156E-6,"PM control","Multiple cyclone","1992-03-01","PM control","Multiple cyclone","1992-03-01","SO2 control","Dry FGD - Spray Dryer","1992-03-01","SO2 control","Dry FGD - Spray Dryer","1992-03-01","PM control","Fabric Filter, pulse","1992-03-01","PM control","Fabric Filter, pulse","1992-03-01","","",null,"","",null,"","",null,"","",null,"","",null,"",""]
["10774_2","coal",105,null,10774,"Southampton Power Station","VA","Unit 1 & 2","2","Conventional Boiler","Stoker - spreader",34,447,13.147058823529411,"bituminous","bituminous",9.7640777072708853E-6,null,null,2.7960188469666665E-7,3.6553834631667156E-6,null,null,null,2.7960188469666665E-7,3.6553834631667156E-6,"PM control","Multiple cyclone","1992-03-01","PM control","Multiple cyclone","1992-03-01","SO2 control","Dry FGD - Spray Dryer","1992-03-01","SO2 control","Dry FGD - Spray Dryer","1992-03-01","PM control","Fabric Filter, pulse","1992-03-01","PM control","Fabric Filter, pulse","1992-03-01","","",null,"","",null,"","",null,"","",null,"","",null,"",""]
["883_8","coal",106,null,883,"Waukegan","IL","WK8CONFIG","8","Conventional Boiler","Tangential firing",383,3960.8919999999998,10.3417545691906,"subbituminous","subbituminous",7.2420756057862228E-6,null,null,3.6899999999999998E-7,3.816107436031331E-6,null,8.6864692767858023E-7,8.9833333333333343E-6,3.6899999999999998E-7,3.816107436031331E-6,"Other control","Activated carbon injection","2008-07-01","PM control","Electrostatic precipitator, cold side, w/o flue gas conditioning","1962-07-01","","",null,"","",null,"","",null,"","",null,"","",null,"","",null,"","",null,"","",null,"","",null,"",""]
["897_Unit 2","coal",107,null,897,"Vermilion","IL","002","Unit 2","Conventional Boiler","Tangential firing",110,1076,9.7818181818181813,"subbituminous","subbituminous",6.8198643125805173E-6,null,null,3.9699999999999997E-7,3.883381818181818E-6,null,null,null,3.9699999999999997E-7,3.883381818181818E-6,"PM control","Electrostatic precipitator, unspecified","1974-01-01","Other control","Activated carbon injection","2007-05-01","PM control","Fabric Filter, unspecified","2007-05-01","","",null,"","",null,"","",null,"","",null,"","",null,"","",null,"","",null,"","",null,"",""]
["963_31","coal",108,null,963,"Dallman","IL","31","31","Conventional Boiler","Cyclone firing",90,962.12,10.690222222222221,"bituminous","bituminous",null,null,null,null,null,null,3.7417369974639341E-7,3.9999999999999998E-6,3.7417369974639341E-7,3.9999999999999998E-6,"NOx control","Selective Catalytic Reduction","2003-05-01","PM control","Electrostatic precipitator, cold side, w/o flue gas conditioning","1968-06-01","SO2 control","Wet FGD - Packed Type","2001-08-01","","",null,"","",null,"","",null,"","",null,"","",null,"","",null,"","",null,"","",null,"",""]
["963_32","coal",109,null,963,"Dallman","IL","32","32","Conventional Boiler","Cyclone firing",84,905.94,10.785,"bituminous","bituminous",null,null,null,null,null,null,3.7088548910523871E-7,3.9999999999999998E-6,3.7088548910523871E-7,3.9999999999999998E-6,"NOx control","Selective Catalytic Reduction","2003-05-01","PM control","Electrostatic precipitator, cold side, w/o flue gas conditioning","1972-06-01","SO2 control","Wet FGD - Packed Type","2001-08-01","","",null,"","",null,"","",null,"","",null,"","",null,"","",null,"","",null,"","",null,"",""]
["3149_2","coal",110,null,3149,"PPL Montour","PA","U2","2","Conventional Boiler","Tangential firing",792,7239,9.1401515151515156,"bituminous","bituminous",6.1383185030878509E-6,null,null,4.4366666666666668E-7,4.0551805555555558E-6,null,null,null,4.4366666666666668E-7,4.0551805555555558E-6,"PM control","Electrostatic precipitator, cold side, w/o flue gas conditioning","2000-05-01","NOx control","Selective Catalytic Reduction","2000-05-01","SO2 control","Wet FGD - Tray Type","2008-03-01","","",null,"","",null,"","",null,"","",null,"","",null,"","",null,"","",null,"","",null,"",""]
["708_2","coal",111,null,708,"Hammond","GA","Unit 2","2","Conventional Boiler","Wall firing - front firing",115,1138.0319999999999,9.895930434782608,"bituminous","bituminous",6.745922315073341E-6,null,null,6.049633333333333E-7,5.9866750622608685E-6,4.2526666666666673E-7,1.0713442429767558E-6,1.0601948100202811E-5,4.2526666666666673E-7,4.2084093495652176E-6,"PM control","Electrostatic precipitator, cold side, w/ flue gas conditioning","1969-04-01","SO2 control","Wet FGD - Spray Type","2008-05-01","","",null,"","",null,"","",null,"","",null,"","",null,"","",null,"","",null,"","",null,"","",null,"",""]
["708_3","coal",112,null,708,"Hammond","GA","Unit 3","3","Conventional Boiler","Wall firing - front firing",115,1141.3920000000001,9.9251478260869561,"bituminous","bituminous",6.745922315073341E-6,null,null,6.049633333333333E-7,6.0043505126956518E-6,4.2526666666666673E-7,1.0713442429767558E-6,1.0633249984171524E-5,4.2526666666666673E-7,4.2208345321739134E-6,"PM control","Electrostatic precipitator, cold side, w/ flue gas conditioning","1968-12-01","SO2 control","Wet FGD - Spray Type","2008-05-01","","",null,"","",null,"","",null,"","",null,"","",null,"","",null,"","",null,"","",null,"","",null,"",""]
["3946_2","coal",113,null,3946,"Willow Island","WV","Unit 2","2","Conventional Boiler","Cyclone firing",190,1458,7.6736842105263161,"","Bituminous",null,null,null,null,null,null,5.5300000000000004E-7,4.2435473684210533E-6,5.5300000000000004E-7,4.2435473684210533E-6,"PM control","Electrostatic precipitator, hot side, w/o flue gas conditioning","1976-06-01","","",null,"","",null,"","",null,"","",null,"","",null,"","",null,"","",null,"","",null,"","",null,"","",null,"",""]
["708_1","coal",114,null,708,"Hammond","GA","Unit 1","1","Conventional Boiler","Wall firing - front firing",115,1158.752,10.076104347826087,"bituminous","bituminous",6.745922315073341E-6,null,null,6.049633333333333E-7,6.0956736732753624E-6,4.2526666666666673E-7,1.0713442429767558E-6,1.0794976384676537E-5,4.2526666666666673E-7,4.2850313089855077E-6,"PM control","Electrostatic precipitator, cold side, w/ flue gas conditioning","1971-02-01","SO2 control","Wet FGD - Spray Type","2008-05-01","","",null,"","",null,"","",null,"","",null,"","",null,"","",null,"","",null,"","",null,"","",null,"",""]
["708_4","coal",115,null,708,"Hammond","GA","Unit 4","4","Conventional Boiler","Wall firing - front firing",520,5458.53,10.497173076923076,"bituminous","bituminous",6.745922315073341E-6,null,null,6.049633333333333E-7,6.3504048151923066E-6,4.2526666666666673E-7,1.0713442429767558E-6,1.1246085943492136E-5,4.2526666666666673E-7,4.4640978038461545E-6,"NOx control","Selective Catalytic Reduction","2002-05-01","PM control","Electrostatic precipitator, cold side, w/ flue gas conditioning","1970-12-01","SO2 control","Wet FGD - Spray Type","2008-05-01","","",null,"","",null,"","",null,"","",null,"","",null,"","",null,"","",null,"","",null,"",""]
["564_2","coal",116,null,564,"Stanton Energy Center","FL","2 coal","2","Conventional Boiler","Wall firing - opposed firing",468,4286,9.1581196581196576,"coal - bituminous","bituminous",null,null,null,6.1500000000000004E-7,5.6322435897435896E-6,null,4.912786695754839E-7,4.499188841454111E-6,4.912786695754839E-7,4.499188841454111E-6,"NOx control","Selective Catalytic Reduction","1996-06-01","PM control","Electrostatic precipitator, cold side, w/o flue gas conditioning","1996-06-01","SO2 control","Wet FGD - Spray Type","1996-06-01","","",null,"","",null,"","",null,"","",null,"","",null,"","",null,"","",null,"","",null,"",""]
["897_Unit 1","coal",117,null,897,"Vermilion","IL","001","Unit 1","Conventional Boiler","Tangential firing",72,831,11.541666666666666,"subbituminous","subbituminous",6.8198643125805173E-6,null,null,3.9699999999999997E-7,4.5820416666666663E-6,null,null,null,3.9699999999999997E-7,4.5820416666666663E-6,"PM control","Electrostatic precipitator, unspecified","1973-06-01","Other control","Activated carbon injection","2007-05-01","PM control","Fabric Filter, unspecified","2007-05-01","","",null,"","",null,"","",null,"","",null,"","",null,"","",null,"","",null,"","",null,"",""]
["470_2","coal",118,null,470,"Comanche","CO","Unit 2","2","Conventional Boiler","Wall firing - front firing",365,3482,9.5397260273972595,"subbituminous","subbituminous",7.1869917830172324E-6,null,null,4.8799999999999992E-7,4.6553863013698617E-6,5.6799999999999998E-6,7.5625789642898419E-7,7.2144931379882817E-6,4.8799999999999992E-7,4.6553863013698617E-6,"Other control","Activated carbon injection",null,"SO2 control","Dry FGD - Spray Dryer","2008-07-01","PM control","Fabric Filter, reverse air","1991-12-01","","",null,"","",null,"","",null,"","",null,"","",null,"","",null,"","",null,"","",null,"",""]
["1073_3","coal",119,null,1073,"Prairie Creek","IA","Unit 3","3","Conventional Boiler","Wall firing - front firing",49.5,562.29999999999995,11.359595959595959,"coal - subbituminous","natural gas, subbituminous",null,null,null,null,null,null,4.15E-7,4.7142323232323227E-6,4.15E-7,4.7142323232323227E-6,"PM control","Electrostatic precipitator, cold side, w/ flue gas conditioning","1971-06-01","","",null,"","",null,"","",null,"","",null,"","",null,"","",null,"","",null,"","",null,"","",null,"","",null,"",""]
["1626_1","coal",120,null,1626,"Salem Harbor","MA","Unit 1","1","Conventional Boiler","Wall firing - front firing",81.418999999999997,981,12.0487846817082,"bituminous","bituminous",3.8636363636363636E-6,null,null,3.9819992437000003E-7,4.7978251490066201E-6,null,null,null,3.9819992437000003E-7,4.7978251490066201E-6,"NOx control","Selective Noncatalytic Reduction","1993-08-01","PM control","Electrostatic precipitator, cold side, w/o flue gas conditioning","1984-07-01","","",null,"","",null,"","",null,"","",null,"","",null,"","",null,"","",null,"","",null,"","",null,"",""]
["492_6","coal",121,null,492,"Martin Drake","CO","Unit 6 - Coal","6","Conventional Boiler","Wall firing - front firing",85,930,10.941176470588236,"","bituminous",null,null,null,null,null,null,4.5333333333333337E-7,4.9600000000000008E-6,4.5333333333333337E-7,4.9600000000000008E-6,"PM control","Fabric Filter, reverse air","1978-09-01","","",null,"","",null,"","",null,"","",null,"","",null,"","",null,"","",null,"","",null,"","",null,"","",null,"",""]
["47_4","coal",122,null,47,"Colbert","AL","4","4","Conventional Boiler","Wall firing - front firing",200,2121,10.605,"subbituminous,  bituminous","subbituminous,  bituminous",1.7727010312869494E-6,null,null,4.8433333333333326E-7,5.136354999999999E-6,null,null,null,4.8433333333333326E-7,5.136354999999999E-6,"PM control","Electrostatic precipitator, cold side, w/o flue gas conditioning","1991-01-01","","",null,"","",null,"","",null,"","",null,"","",null,"","",null,"","",null,"","",null,"","",null,"","",null,"",""]
["3152_4","coal",123,null,3152,"Sunbury Generation LP","PA","Boiler 4","4","Conventional Boiler","Wall firing - front firing",128,1360,10.625,"bituminous","bituminous",1.2783468469593436E-5,null,null,2.8966666666666667E-6,3.0777083333333337E-5,null,4.8510975317915704E-7,5.1542911275285431E-6,4.8510975317915704E-7,5.1542911275285431E-6,"Other control","Other (specify): SO3 injection","1980-06-01","PM control","Electrostatic precipitator, cold side, w/ flue gas conditioning","1970-06-01","","",null,"","",null,"","",null,"","",null,"","",null,"","",null,"","",null,"","",null,"","",null,"",""]
["2324_4","coal",124,null,2324,"Reid Gardner","NV","4","4","Conventional Boiler","Wall firing - front firing",281,2956,10.519572953736654,"","bituminous",null,null,null,null,null,null,4.8999999999999997E-7,5.1545907473309605E-6,4.8999999999999997E-7,5.1545907473309605E-6,"PM control","Fabric Filter, pulse","1983-07-01","SO2 control","Wet FGD - Venturi Type","1983-07-01","","",null,"","",null,"","",null,"","",null,"","",null,"","",null,"","",null,"","",null,"","",null,"",""]
["8224_2","coal",125,null,8224,"North Valmy","NV","2","2","Conventional Boiler","Wall firing - front firing",270.2,2881,10.662472242783124,"","subbituminous, bituminous",null,null,null,null,null,null,4.9999999999999998E-7,5.3312361213915621E-6,4.9999999999999998E-7,5.3312361213915621E-6,"SO2 control","Dry FGD - Spray Dryer","1985-05-01","PM control","Fabric Filter, reverse air","1985-05-01","","",null,"","",null,"","",null,"","",null,"","",null,"","",null,"","",null,"","",null,"","",null,"",""]
["6041_1","coal",126,null,6041,"H L Spurlock Station","KY","Unit 01","1","Conventional Boiler","Wall firing - opposed firing",344,3641,10.584302325581396,"bituminous","bituminous",8.4385328182850063E-6,null,null,5.2199999999999994E-7,5.5250058139534875E-6,null,null,null,5.2199999999999994E-7,5.5250058139534875E-6,"PM control","Electrostatic precipitator, cold side, w/o flue gas conditioning","2003-05-01","NOx control","Selective Catalytic Reduction","2003-05-01","SO2 control","Wet FGD - Unspecified","2009-04-01","Other control","Wet electrostatic precipitator","2009-04-01","","",null,"","",null,"","",null,"","",null,"","",null,"","",null,"","",null,"",""]
["4140_B4","coal",127,null,4140,"Alma","WI","B4","B4","Conventional Boiler","Wall firing - unspecified",53.63,557.20000000000005,10.389707253402946,"","Bituminous, Subbituminous",null,null,null,null,null,null,5.5533333333333341E-7,5.7697507613897705E-6,5.5533333333333341E-7,5.7697507613897705E-6,"NOx control","Selective Noncatalytic Reduction",null,"PM control","Electrostatic precipitator, cold side, unspecified","1974-06-01","","",null,"","",null,"","",null,"","",null,"","",null,"","",null,"","",null,"","",null,"","",null,"",""]
["988_4","coal",128,null,988,"Tanners Creek","IN","TC-4","4","Conventional Boiler","Cyclone firing",579.70000000000005,4990,8.6079006382611691,"subbituminous,  bituminous","subbituminous,  bituminous",6.4632488727402192E-6,null,null,6.7624614569333329E-7,5.8210596291352992E-6,null,null,null,6.7624614569333329E-7,5.8210596291352992E-6,"PM control","Electrostatic precipitator, cold side, w/o flue gas conditioning","1977-11-01","","",null,"","",null,"","",null,"","",null,"","",null,"","",null,"","",null,"","",null,"","",null,"","",null,"",""]
[{"$f":"E130&\"_\"&I130","v":"2718_ES-3"},"coal",129,null,2718,"G G Allen","NC","3-2009","ES-3","Conventional Boiler","Tangential firing",281.5,2228,7.9147424511545292,"bituminous","bituminous",1.0214266951855606E-5,null,null,7.3787019894333335E-7,5.8400525870186384E-6,null,null,null,7.3787019894333335E-7,5.8400525870186384E-6,"NOx control","Selective Noncatalytic Reduction","2005-05-01","PM control","Electrostatic precipitator, cold side, w/ flue gas conditioning","2002-06-01","SO2 control","Wet FGD - Spray Type","2009-05-01","","",null,"","",null,"","",null,"","",null,"","",null,"","",null,"","",null,"","",null,"",""]
["2718_ES-4","coal",130,null,2718,"G G Allen","NC","4-2009","ES-4","Conventional Boiler","Tangential firing",297.3,2380,8.0053817692566422,"bituminous","bituminous",1.0214266951855606E-5,null,null,7.3787019894333335E-7,5.9069326386987329E-6,null,null,null,7.3787019894333335E-7,5.9069326386987329E-6,"NOx control","Selective Noncatalytic Reduction","2006-06-01","PM control","Electrostatic precipitator, cold side, w/ flue gas conditioning","1999-02-01","SO2 control","Wet FGD - Spray Type","2009-04-01","","",null,"","",null,"","",null,"","",null,"","",null,"","",null,"","",null,"","",null,"",""]
["3251_1","coal",131,null,3251,"HB Robinson / Darlington Electric Power Plant","SC","Rob_Cfg_1","1","Conventional Boiler","Tangential firing",187,1733,9.2673796791443852,"bituminous","bituminous",5.3773108101914915E-6,null,null,6.6000000000000003E-7,6.1164705882352942E-6,null,null,null,6.6000000000000003E-7,6.1164705882352942E-6,"PM control","Electrostatic precipitator, cold side, w/o flue gas conditioning","1974-07-01","","",null,"","",null,"","",null,"","",null,"","",null,"","",null,"","",null,"","",null,"","",null,"","",null,"",""]
["1710_Unit 2","coal",132,null,1710,"Consumers Energy - J.H. Campbell","MI","JHC2-Conf","Unit 2","Conventional Boiler","Wall firing - front firing",374,3392,9.0695187165775408,"subbituminous,  bituminous","subbituminous,  bituminous",6.5028604193428913E-6,6.8796225004041256E-7,6.2394865030403196E-6,null,null,null,null,null,6.8796225004041256E-7,6.2394865030403196E-6,"PM control","Electrostatic precipitator, cold side, w/ flue gas conditioning","1978-12-01","","",null,"","",null,"","",null,"","",null,"","",null,"","",null,"","",null,"","",null,"","",null,"","",null,"",""]
["6018_2","coal",133,null,6018,"East Bend Station","KY","2","2","Conventional Boiler","Wall firing - front firing",650.72463770000002,6313,9.7014922046188872,"bituminous","bituminous",8.3600492607834572E-6,null,null,6.5066666666666667E-7,6.3124375944720224E-6,null,null,null,6.5066666666666667E-7,6.3124375944720224E-6,"Other control","Dry sorbent injection","2005-01-01","PM control","Electrostatic precipitator, hot side, w/ flue gas conditioning","1981-01-01","NOx control","Selective Catalytic Reduction","2002-01-01","SO2 control","Wet FGD - Spray Type","1981-01-01","","",null,"","",null,"","",null,"","",null,"","",null,"","",null,"","",null,"",""]
["1710_Unit 1","coal",134,null,1710,"Consumers Energy - J.H. Campbell","MI","JHC1-Conf","Unit 1","Conventional Boiler","Tangential firing",274,2561,9.3467153284671536,"subbituminous","subbituminous",8.8637705612172724E-6,6.8796225004041256E-7,6.4301873078594764E-6,null,null,null,null,null,6.8796225004041256E-7,6.4301873078594764E-6,"PM control","Electrostatic precipitator, cold side, w/o flue gas conditioning","2001-07-01","","",null,"","",null,"","",null,"","",null,"","",null,"","",null,"","",null,"","",null,"","",null,"","",null,"",""]
["3946_1","coal",135,null,3946,"Willow Island","WV","Unit 1","1","Conventional Boiler","Vertical firing",58,436,7.5172413793103452,"","bituminous",null,null,null,null,null,null,8.5933333333333338E-7,6.4598160919540238E-6,8.5933333333333338E-7,6.4598160919540238E-6,"PM control","Electrostatic precipitator, cold side, w/o flue gas conditioning","1975-06-01","","",null,"","",null,"","",null,"","",null,"","",null,"","",null,"","",null,"","",null,"","",null,"","",null,"",""]
["1082_4","coal",136,null,1082,"Walter Scott Jr. Energy Center","IA","4","4","Conventional Boiler","Wall firing - unspecified",850,7675,9.0294117647058822,"subbituminous","subbituminous",8.1499324198168359E-6,2.9381345626222745E-6,2.6529626786030538E-5,null,null,null,7.1999999999999999E-7,6.5011764705882348E-6,7.1999999999999999E-7,6.5011764705882348E-6,"NOx control","Selective Catalytic Reduction","2007-02-01","Other control","Activated carbon injection","2007-02-01","SO2 control","Dry FGD - Circulating Dry Scrubber","2007-02-01","PM control","Fabric Filter, pulse","2007-02-01","","",null,"","",null,"","",null,"","",null,"","",null,"","",null,"","",null,"",""]
["8223_4","coal",137,null,8223,"Springerville","AZ","4","4","Conventional Boiler","Wall firing - opposed firing",450,4200,9.3333333333333339,"bituminous","bituminous",6.0247208823977568E-6,null,null,3.5833333333333335E-6,3.344444444444445E-5,null,6.9999999999999997E-7,6.5333333333333332E-6,6.9999999999999997E-7,6.5333333333333332E-6,"NOx control","Selective Catalytic Reduction","2009-12-01","SO2 control","Dry FGD - Spray Dryer","2009-12-01","PM control","Fabric Filter, pulse","2009-12-01","","",null,"","",null,"","",null,"","",null,"","",null,"","",null,"","",null,"","",null,"",""]
["47_3","coal",138,null,47,"Colbert","AL","3","3","Conventional Boiler","Wall firing - front firing",200,2121,10.605,"other--subbituminous/bituminous blend","other--subbituminous/bituminous blend",2.053836864301656E-6,null,null,6.4433333333333332E-7,6.8331550000000003E-6,null,null,null,6.4433333333333332E-7,6.8331550000000003E-6,"PM control","Electrostatic precipitator, cold side, w/o flue gas conditioning","1990-05-01","","",null,"","",null,"","",null,"","",null,"","",null,"","",null,"","",null,"","",null,"","",null,"","",null,"",""]
["2098_6","coal",139,null,2098,"Lake Road","MO","6","6","Conventional Boiler","Cyclone firing",99,980,9.8989898989898997,"subbituminous,  bituminous","subbituminous,  bituminous",4.3019655786382206E-6,null,null,1.4733333333333333E-6,1.4584511784511786E-5,null,7.0699999999999996E-7,6.9985858585858583E-6,7.0699999999999996E-7,6.9985858585858583E-6,"PM control","Electrostatic precipitator, cold side, w/o flue gas conditioning","1995-07-01","","",null,"","",null,"","",null,"","",null,"","",null,"","",null,"","",null,"","",null,"","",null,"","",null,"",""]
["2480_3","coal",140,null,2480,"Danskammer Generating Station","NY","3","3","Conventional Boiler","Tangential firing",144.9,1365,9.420289855072463,"bituminous","bituminous",null,null,null,null,null,null,7.5327333333333339E-7,7.0960531400966181E-6,7.5327333333333339E-7,7.0960531400966181E-6,"PM control","Electrostatic precipitator, cold side, w/o flue gas conditioning","1987-09-01","","",null,"","",null,"","",null,"","",null,"","",null,"","",null,"","",null,"","",null,"","",null,"","",null,"",""]
["470_1","coal",141,null,470,"Comanche","CO","Unit 1","1","Conventional Boiler","Tangential firing",360,3531,9.8083333333333336,"coal - subbituminous","subbituminous",null,null,null,null,null,null,7.3485842084461381E-7,7.2077363444509207E-6,7.3485842084461381E-7,7.2077363444509207E-6,"Other control","Activated carbon injection",null,"SO2 control","Dry FGD - Spray Dryer","2008-12-01","PM control","Fabric Filter, reverse air","1990-11-01","","",null,"","",null,"","",null,"","",null,"","",null,"","",null,"","",null,"","",null,"",""]
["884_4","coal",142,null,884,"Will County","IL","WC4CONFIG","4","Conventional Boiler","Tangential firing",542,5254.5300000000007,9.6947047970479723,"subbituminous","subbituminous",8.0021437797905982E-6,null,null,1.0676666666666668E-6,1.0350713154981552E-5,null,7.4955007076433715E-7,7.2666666666666668E-6,7.4955007076433715E-7,7.2666666666666668E-6,"Other control","Activated carbon injection","2009-07-01","PM control","Electrostatic precipitator, cold side, w/o flue gas conditioning","1963-06-01","","",null,"","",null,"","",null,"","",null,"","",null,"","",null,"","",null,"","",null,"","",null,"",""]
["87_1","coal",143,null,87,"Escalante","NM","1","1","Conventional Boiler","Tangential firing",260,2366,9.1,"coal - subbituminous","subbituminous",null,null,null,null,null,null,8.0586080586080591E-7,7.3333333333333331E-6,8.0586080586080591E-7,7.3333333333333331E-6,"PM control","Fabric Filter, reverse air","1984-01-01","SO2 control","Wet FGD - Spray Type","1984-01-01","","",null,"","",null,"","",null,"","",null,"","",null,"","",null,"","",null,"","",null,"","",null,"",""]
["56224_BLR100","coal",144,null,56224,"TS Power Plant","NV","TSPower","BLR100","Conventional Boiler","Wall firing - opposed firing",242,2112,8.7272727272727266,"subbituminous","subbituminous",7.5160787016636593E-6,9.0314717987723086E-7,7.8820117516558331E-6,1.26E-6,1.0996363636363636E-5,null,8.6701388888888898E-7,7.5666666666666665E-6,8.6701388888888898E-7,7.5666666666666665E-6,"NOx control","Selective Catalytic Reduction","2008-03-01","Other control","Activated carbon injection","2008-03-01","SO2 control","Dry FGD - Spray Dryer","2008-03-01","PM control","Fabric Filter, pulse","2008-01-01","","",null,"","",null,"","",null,"","",null,"","",null,"","",null,"","",null,"",""]
["2554_4","coal",145,null,2554,"Dunkirk Generating Plant","NY","4","4","Conventional Boiler","Tangential firing",195,1836,9.4153846153846157,"subbituminous","subbituminous",8.8895636465571241E-6,null,null,8.0507664672333333E-7,7.5801062737643082E-6,null,null,null,8.0507664672333333E-7,7.5801062737643082E-6,"NOx control","Selective Noncatalytic Reduction",null,"Other control","Dry sorbent injection",null,"PM control","Fabric Filter, unspecified","2009-05-01","","",null,"","",null,"","",null,"","",null,"","",null,"","",null,"","",null,"","",null,"",""]
["4078_4","coal",146,null,4078,"Weston","WI","W4","4","Conventional Boiler","Wall firing - opposed firing",574.5,5173.07,9.0044734551784149,"subbituminous","subbituminous",7.042162550180501E-6,null,null,1.0763333333333334E-6,9.6918149289237005E-6,null,8.9333333333333329E-7,8.0439962866260495E-6,8.9333333333333329E-7,8.0439962866260495E-6,"NOx control","Selective Catalytic Reduction","2008-07-01","Other control","Activated carbon injection","2008-07-01","SO2 control","Dry FGD - Spray Dryer","2008-07-01","PM control","Fabric Filter, pulse","2008-07-01","","",null,"","",null,"","",null,"","",null,"","",null,"","",null,"","",null,"",""]
["874_5","coal",147,null,874,"Joliet 9","IL","JOL5 CONFIG","5","Conventional Boiler","Cyclone firing",326,3572.3780000000002,10.95821472392638,"subbituminous","subbituminous",6.7525720586170241E-6,null,null,1.029E-6,1.1276002950920245E-5,null,7.5285985973488832E-7,8.2500000000000023E-6,7.5285985973488832E-7,8.2500000000000023E-6,"Other control","Activated carbon injection","2009-07-01","PM control","Electrostatic precipitator, cold side, w/o flue gas conditioning","1966-03-01","","",null,"","",null,"","",null,"","",null,"","",null,"","",null,"","",null,"","",null,"","",null,"",""]
["6113_2","coal",148,null,6113,"Gibson","IN","2-2007-FGDIN","2","Conventional Boiler","Wall firing - opposed firing",661,6444,9.7488653555219358,"bituminous","bituminous",7.9200530887697529E-6,null,null,8.4633333333333335E-7,8.2507897125567317E-6,null,null,null,8.4633333333333335E-7,8.2507897125567317E-6,"NOx control","Selective Catalytic Reduction","2001-12-01","Other control","Other (specify): Soda Ash Injection for SO3 mitigation","2004-06-01","PM control","Electrostatic precipitator, cold side, w/o flue gas conditioning","1991-01-01","SO2 control","Wet FGD - Tray Type","2007-05-01","","",null,"","",null,"","",null,"","",null,"","",null,"","",null,"","",null,"",""]
["6113_1","coal",149,null,6113,"Gibson","IN","1-2007-FGDIN","1","Conventional Boiler","Wall firing - opposed firing",661,6368,9.6338880484114977,"bituminous","bituminous",7.7955658033662995E-6,null,null,8.8316666666666656E-7,8.50832879475542E-6,null,null,null,8.8316666666666656E-7,8.50832879475542E-6,"NOx control","Selective Catalytic Reduction","2005-04-01","Other control","Other (specify): Soda Ash Injection for SO3 mitigation","2004-06-01","PM control","Electrostatic precipitator, cold side, w/o flue gas conditioning","1990-01-01","SO2 control","Wet FGD - Tray Type","2007-10-01","","",null,"","",null,"","",null,"","",null,"","",null,"","",null,"","",null,"",""]
["990_70","coal",150,null,990,"Harding Street","IN","70ss","70","Conventional Boiler","Tangential firing",463,4123,8.9049676025917925,"bituminous","bituminous",5.1919080423921063E-6,null,null,9.8860392026999999E-7,8.8034858817995894E-6,null,null,null,9.8860392026999999E-7,8.8034858817995894E-6,"NOx control","Selective Catalytic Reduction","2005-12-01","PM control","Electrostatic precipitator, cold side, w/ flue gas conditioning","1978-12-01","SO2 control","Wet FGD - Spray Type","2007-12-01","","",null,"","",null,"","",null,"","",null,"","",null,"","",null,"","",null,"","",null,"",""]
["641_5","coal",151,null,641,"Crist","FL","Unit 5","5","Conventional Boiler","Tangential firing",82,817.82999999999993,9.9735365853658529,"bituminous","bituminous",7.2486742114908627E-6,null,null,8.906666666666667E-7,8.8830965853658525E-6,null,null,null,8.906666666666667E-7,8.8830965853658525E-6,"NOx control","Selective Noncatalytic Reduction","2006-04-01","PM control","Electrostatic precipitator, hot side, w/ flue gas conditioning","2008-03-01","PM control","Electrostatic precipitator, cold side, w/o flue gas conditioning","1976-01-01","SO2 control","Wet FGD - Spray Type","2009-12-01","","",null,"","",null,"","",null,"","",null,"","",null,"","",null,"","",null,"",""]
["641_6","coal",152,null,641,"Crist","FL","Unit 6","6","Conventional Boiler","Wall firing - front firing",320,3193.348,9.9792124999999992,"bituminous","bituminous",7.2486742114908627E-6,null,null,8.906666666666667E-7,8.8881519333333328E-6,null,null,null,8.906666666666667E-7,8.8881519333333328E-6,"NOx control","Selective Noncatalytic Reduction","2005-11-01","PM control","Electrostatic precipitator, cold side, w/o flue gas conditioning","1994-01-01","SO2 control","Wet FGD - Spray Type","2009-12-01","","",null,"","",null,"","",null,"","",null,"","",null,"","",null,"","",null,"","",null,"",""]
["2535_2","coal",153,null,2535,"AES Cayuga, LLC","NY","Unit_2","2","Conventional Boiler","Tangential firing",168,1450,8.6309523809523814,"bituminous","bituminous",null,null,null,null,null,null,1.0300000000000001E-6,8.8898809523809536E-6,1.0300000000000001E-6,8.8898809523809536E-6,"PM control","Electrostatic precipitator, cold side, w/o flue gas conditioning",null,"SO2 control","Wet FGD - Spray Type","1995-01-01","","",null,"","",null,"","",null,"","",null,"","",null,"","",null,"","",null,"","",null,"","",null,"",""]
["4078_3","coal",154,null,4078,"Weston","WI","W3","3","Conventional Boiler","Tangential firing",365.6,3423.48,9.364004376367614,"subbituminous","subbituminous",6.3288239341468112E-6,null,null,9.9133333333333334E-7,9.2828496717724277E-6,null,7.3766666666666666E-6,6.9075138949671768E-5,9.9133333333333334E-7,9.2828496717724277E-6,"PM control","Fabric Filter, pulse","2001-05-01","Other control","Activated carbon injection",null,"","",null,"","",null,"","",null,"","",null,"","",null,"","",null,"","",null,"","",null,"","",null,"",""]
["641_7","coal",155,null,641,"Crist","FL","Unit 7","7","Conventional Boiler","Wall firing - front firing",500,5279.7920000000004,10.559584000000001,"bituminous","bituminous",7.2486742114908627E-6,null,null,8.906666666666667E-7,9.4050694826666674E-6,null,null,null,8.906666666666667E-7,9.4050694826666674E-6,"NOx control","Selective Catalytic Reduction","2005-04-01","PM control","Electrostatic precipitator, cold side, w/o flue gas conditioning","2004-04-01","SO2 control","Wet FGD - Spray Type","2009-12-01","","",null,"","",null,"","",null,"","",null,"","",null,"","",null,"","",null,"","",null,"",""]
["641_4","coal",156,null,641,"Crist","FL","Unit 4","4","Conventional Boiler","Tangential firing",82,868.84199999999998,10.595634146341464,"bituminous","bituminous",7.2486742114908627E-6,null,null,8.906666666666667E-7,9.4371781463414637E-6,null,null,null,8.906666666666667E-7,9.4371781463414637E-6,"NOx control","Selective Noncatalytic Reduction","2006-04-01","PM control","Electrostatic precipitator, hot side, w/o flue gas conditioning","2008-03-01","PM control","Electrostatic precipitator, cold side, w/o flue gas conditioning","1976-01-01","SO2 control","Wet FGD - Spray Type","2009-12-01","","",null,"","",null,"","",null,"","",null,"","",null,"","",null,"","",null,"",""]
["136_1","coal",157,null,136,"Seminole Generating Station","FL","Unit 1","1","Conventional Boiler","Wall firing - opposed firing",694,7172,10.334293948126801,"coal - bituminous","bituminous",null,null,null,null,null,null,9.3333333333333333E-7,9.6453410182516807E-6,9.3333333333333333E-7,9.6453410182516807E-6,"NOx control","Selective Catalytic Reduction","2009-02-01","PM control","Electrostatic precipitator, cold side, w/o flue gas conditioning","1984-01-01","Other control","Dry sorbent injection","2009-02-01","SO2 control","Wet FGD - Spray Type","1984-01-01","","",null,"","",null,"","",null,"","",null,"","",null,"","",null,"","",null,"",""]
["55749_PC1","coal",158,null,55749,"Hardin Generator Project","MT","PC1","PC1","Conventional Boiler","Wall firing - unspecified",119,1304,10.957983193277311,"bituminous","bituminous",2.6314616385453864E-6,null,null,null,null,8.8293333333333335E-7,null,null,8.8293333333333335E-7,9.6751686274509815E-6,"NOx control","Selective Catalytic Reduction","2006-04-01","Other control","Activated carbon injection",null,"SO2 control","Dry FGD - Spray Dryer","2006-04-01","PM control","Fabric Filter, pulse","2006-04-01","","",null,"","",null,"","",null,"","",null,"","",null,"","",null,"","",null,"",""]
["6076_3","coal",159,null,6076,"Colstrip","MT","Unit3","3","Conventional Boiler","Tangential firing",805,7573,9.4074534161490675,"subbituminous","subbituminous",3.3620122557206258E-6,null,null,1.0501816885833334E-6,9.8795353138404758E-6,null,null,null,1.0501816885833334E-6,9.8795353138404758E-6,"Other control","Activated carbon injection","2009-12-01","SO2 control","Wet FGD - Venturi Type","1984-01-01","PM control","PM scrubber - Venturi","1984-01-01","","",null,"","",null,"","",null,"","",null,"","",null,"","",null,"","",null,"","",null,"",""]
["10151_BLR1A","coal",160,null,10151,"Grant Town Power Plant","WV","GEN1","BLR1A","Fluidized bed firing","Fluidized bed firing",47.5,675,14.210526315789474,"coal refuse (culm or gob)","coal refuse (culm or gob)",3.0701048392459984E-5,null,null,7.1166666666666681E-7,1.0113157894736844E-5,null,null,null,7.1166666666666681E-7,1.0113157894736844E-5,"NOx control","Selective Noncatalytic Reduction","2005-05-01","NOx control","Selective Noncatalytic Reduction","2005-05-01","SO2 control","Dry FGD - Circulating Dry Scrubber","1992-07-01","SO2 control","Dry FGD - Circulating Dry Scrubber","1992-07-01","PM control","Fabric Filter, pulse","1992-07-01","PM control","Fabric Filter, pulse","2005-05-01","","",null,"","",null,"","",null,"","",null,"","",null,"",""]
["10151_BLR1B","coal",161,null,10151,"Grant Town Power Plant","WV","GEN1","BLR1B","Fluidized bed firing","Fluidized bed firing",47.5,675,14.210526315789474,"coal refuse (culm or gob)","coal refuse (culm or gob)",3.0701048392459984E-5,null,null,7.1166666666666681E-7,1.0113157894736844E-5,null,null,null,7.1166666666666681E-7,1.0113157894736844E-5,"NOx control","Selective Noncatalytic Reduction","2005-05-01","NOx control","Selective Noncatalytic Reduction","2005-05-01","SO2 control","Dry FGD - Circulating Dry Scrubber","1992-07-01","SO2 control","Dry FGD - Circulating Dry Scrubber","1992-07-01","PM control","Fabric Filter, pulse","1992-07-01","PM control","Fabric Filter, pulse","2005-05-01","","",null,"","",null,"","",null,"","",null,"","",null,"",""]
["6019_1","coal",162,null,6019,"W H Zimmer","OH","1","1","Conventional Boiler","Wall firing - opposed firing",1408,12656,8.9886363636363633,"bituminous,  bituminous,  bituminous","bituminous,  bituminous,  bituminous",9.0605181305720549E-6,null,null,1.1516666666666667E-6,1.0351912878787878E-5,null,null,null,1.1516666666666667E-6,1.0351912878787878E-5,"Other control","Other (specify): Magnesium Hydroxide Injection",null,"NOx control","Selective Catalytic Reduction","2004-01-01","Other control","Dry sorbent injection","2004-05-01","PM control","Electrostatic precipitator, cold side, w/o flue gas conditioning","1991-03-01","SO2 control","Wet FGD - Spray Type","2004-06-01","","",null,"","",null,"","",null,"","",null,"","",null,"","",null,"",""]
["136_2","coal",163,null,136,"Seminole Generating Station","FL","Unit 2","2","Conventional Boiler","Wall firing - opposed firing",694,7172,10.334293948126801,"coal - bituminous","bituminous",null,null,null,null,null,null,1.0133333333333333E-6,1.0472084534101824E-5,1.0133333333333333E-6,1.0472084534101824E-5,"NOx control","Selective Catalytic Reduction","2009-04-01","PM control","Electrostatic precipitator, cold side, w/o flue gas conditioning","1984-12-01","Other control","Dry sorbent injection","2009-04-01","SO2 control","Wet FGD - Spray Type","1984-12-01","","",null,"","",null,"","",null,"","",null,"","",null,"","",null,"","",null,"",""]
["3297_WAT1","coal",164,null,3297,"Wateree","SC","WAT001","WAT1","Conventional Boiler","Wall firing - unspecified",383,3329.7,8.69373368146214,"","Bituminous",null,null,null,null,null,null,1.2300000000000001E-6,1.0693292428198433E-5,1.2300000000000001E-6,1.0693292428198433E-5,"NOx control","Selective Catalytic Reduction","2003-06-01","PM control","Fabric Filter, unspecified","2001-05-01","SO2 control","Wet FGD - Unspecified",null,"","",null,"","",null,"","",null,"","",null,"","",null,"","",null,"","",null,"","",null,"",""]
["963_33","coal",165,null,963,"Dallman","IL","33","33","Conventional Boiler","Tangential firing",208,2089.8000000000002,10.047115384615385,"coal - bituminous","bituminous",null,null,null,null,null,null,1.0649822949564551E-6,1.0699999999999999E-5,1.0649822949564551E-6,1.0699999999999999E-5,"NOx control","Selective Catalytic Reduction","2003-05-01","PM control","Electrostatic precipitator, cold side, w/o flue gas conditioning","1978-06-01","SO2 control","Wet FGD - Spray Type","1980-01-01","","",null,"","",null,"","",null,"","",null,"","",null,"","",null,"","",null,"","",null,"",""]
["2554_1","coal",166,null,2554,"Dunkirk Generating Plant","NY","1","1","Conventional Boiler","Tangential firing",85,922.2,10.849411764705883,"subbituminous","subbituminous",6.3088495027820061E-6,null,null,1.0072666666666667E-6,1.0928250823529413E-5,null,null,null,1.0072666666666667E-6,1.0928250823529413E-5,"NOx control","Selective Noncatalytic Reduction",null,"Other control","Dry sorbent injection",null,"PM control","Fabric Filter, unspecified","2009-12-01","","",null,"","",null,"","",null,"","",null,"","",null,"","",null,"","",null,"","",null,"",""]
["8223_1","coal",167,null,8223,"Springerville","AZ","1","1","Conventional Boiler","Tangential firing",427,3830,8.9695550351288063,"coal - subbituminous","subbituminous",null,null,null,null,null,null,1.2333333333333333E-6,1.1062451209992194E-5,1.2333333333333333E-6,1.1062451209992194E-5,"SO2 control","Dry FGD - Spray Dryer","1985-06-01","PM control","Fabric Filter, reverse air","1985-06-01","","",null,"","",null,"","",null,"","",null,"","",null,"","",null,"","",null,"","",null,"","",null,"",""]
["8224_1","coal",168,null,8224,"North Valmy","NV","1","1","Conventional Boiler","Wall firing - opposed firing",243.5,2560,10.513347022587268,"","subbituminous, bituminous",null,null,null,null,null,null,1.0699999999999999E-6,1.1249281314168376E-5,1.0699999999999999E-6,1.1249281314168376E-5,"PM control","Fabric Filter, reverse air","1981-12-01","","",null,"","",null,"","",null,"","",null,"","",null,"","",null,"","",null,"","",null,"","",null,"","",null,"",""]
["728_Y6BR","coal",169,null,728,"Yates","GA","Y6BR","Y6BR","Conventional Boiler","Tangential firing",363,3492.8960000000002,9.6223030303030317,"coal - bituminous","bituminous",null,null,null,null,null,null,1.1702976164963144E-6,1.1260958301568901E-5,1.1702976164963144E-6,1.1260958301568901E-5,"PM control","Electrostatic precipitator, cold side, w/o flue gas conditioning","1974-07-01","","",null,"","",null,"","",null,"","",null,"","",null,"","",null,"","",null,"","",null,"","",null,"","",null,"",""]
["3140_2","coal",170,null,3140,"PPL Brunner Island","PA","U2","2","Conventional Boiler","Tangential firing",393,3790,9.6437659033078873,"bituminous","bituminous",9.0981823469061005E-6,1.1768378347290564E-6,1.1349148584282757E-5,null,null,null,null,null,1.1768378347290564E-6,1.1349148584282757E-5,"PM control","Electrostatic precipitator, cold side, w/o flue gas conditioning","2009-10-01","SO2 control","Wet FGD - Tray Type","2009-11-01","","",null,"","",null,"","",null,"","",null,"","",null,"","",null,"","",null,"","",null,"","",null,"",""]
["3098_4","coal",171,null,3098,"Elrama Power Plant","PA","ELR4-2","4","Conventional Boiler","Wall firing - front firing",185,1921,10.383783783783784,"bituminous","bituminous",9.2799761209515872E-6,1.113215305668746E-6,1.1559387038863033E-5,null,null,null,1.5433333333333333E-6,1.6025639639639638E-5,1.113215305668746E-6,1.1559387038863033E-5,"NOx control","Selective Noncatalytic Reduction","2001-07-01","PM control","Multiple cyclone","1960-11-01","PM control","Electrostatic precipitator, cold side, w/o flue gas conditioning","1960-11-01","SO2 control","Wet FGD - Venturi Type","1975-06-01","","",null,"","",null,"","",null,"","",null,"","",null,"","",null,"","",null,"",""]
["3098_3","coal",172,null,3098,"Elrama Power Plant","PA","ELR3-2","3","Conventional Boiler","Vertical firing",125,1303,10.423999999999999,"bituminous","bituminous",9.2799761209515872E-6,1.113215305668746E-6,1.1604156346291007E-5,null,null,null,1.5433333333333333E-6,1.6087706666666664E-5,1.113215305668746E-6,1.1604156346291007E-5,"NOx control","Selective Noncatalytic Reduction","2001-07-01","PM control","Multiple cyclone","1954-11-01","PM control","Electrostatic precipitator, cold side, w/o flue gas conditioning","1954-11-01","SO2 control","Wet FGD - Venturi Type","1975-06-01","","",null,"","",null,"","",null,"","",null,"","",null,"","",null,"","",null,"",""]
["1047_3","coal",173,null,1047,"Lansing","IA","Unit 3","3","Conventional Boiler","Wall firing - front firing",31.9,452.9,14.197492163009404,"coal - bituminous","subbituminous",null,null,null,null,null,null,8.3699999999999999E-7,1.188330094043887E-5,8.3699999999999999E-7,1.188330094043887E-5,"PM control","Electrostatic precipitator, cold side, w/o flue gas conditioning","1975-06-01","","",null,"","",null,"","",null,"","",null,"","",null,"","",null,"","",null,"","",null,"","",null,"","",null,"",""]
["2706_2","coal",174,null,2706,"Asheville Steam Electric Plant","NC","Ash_Cfg_2","2","Conventional Boiler","Wall firing - front firing",204,1902,9.3235294117647065,"bituminous","bituminous",5.4622887125753623E-6,null,null,1.2766666666666666E-6,1.1903039215686275E-5,null,null,null,1.2766666666666666E-6,1.1903039215686275E-5,"NOx control","Selective Catalytic Reduction","2006-06-14","PM control","Electrostatic precipitator, cold side, w/o flue gas conditioning","1971-05-01","SO2 control","Wet FGD - Spray/Tray Type","2006-05-15","","",null,"","",null,"","",null,"","",null,"","",null,"","",null,"","",null,"","",null,"",""]
["3140_1","coal",175,null,3140,"PPL Brunner Island","PA","U1","1","Conventional Boiler","Tangential firing",330,3345,10.136363636363637,"bituminous","bituminous",9.0981823469061005E-6,1.1768378347290564E-6,1.1928856233844528E-5,null,null,null,null,null,1.1768378347290564E-6,1.1928856233844528E-5,"PM control","Fabric Filter, pulse","1965-01-01","SO2 control","Wet FGD - Tray Type","2009-11-01","","",null,"","",null,"","",null,"","",null,"","",null,"","",null,"","",null,"","",null,"","",null,"",""]
["3161_2","coal",176,null,3161,"Eddystone Generating Station","PA","Unit 2","2","Conventional Boiler","Tangential firing",339,2808,8.283185840707965,"bituminous","bituminous",5.3489737988226104E-6,null,null,1.4609715566800002E-6,1.2101498911968852E-5,null,null,null,1.4609715566800002E-6,1.2101498911968852E-5,"NOx control","Selective Noncatalytic Reduction","2003-06-01","PM control","Multiple cyclone","1960-11-01","PM control","Electrostatic precipitator, hot side, w/o flue gas conditioning","1960-11-01","PM control","PM scrubber - Venturi","1982-12-01","SO2 control","Wet FGD - Spray Type","1982-12-01","","",null,"","",null,"","",null,"","",null,"","",null,"","",null,"",""]
["6085_14","coal",177,null,6085,"R.M. Schahfer","IN","R.M.0014","14","Conventional Boiler","Cyclone firing",468,4650,9.9358974358974361,"subbituminous","subbituminous",5.9720657683552129E-6,null,null,1.2266666666666666E-6,1.2188034188034188E-5,null,null,null,1.2266666666666666E-6,1.2188034188034188E-5,"NOx control","Selective Catalytic Reduction","2004-05-01","PM control","Electrostatic precipitator, cold side, w/o flue gas conditioning","1990-06-01","","",null,"","",null,"","",null,"","",null,"","",null,"","",null,"","",null,"","",null,"","",null,"",""]
["2094_3","coal",178,null,2094,"Sibley","MO","3","3","Conventional Boiler","Cyclone firing",419,4094.1,9.7711217183770884,"subbituminous,  bituminous","subbituminous,  bituminous",6.937957001052835E-6,null,null,1.2966666666666666E-6,1.2669887828162291E-5,null,null,null,1.2966666666666666E-6,1.2669887828162291E-5,"NOx control","Selective Catalytic Reduction","2009-01-01","PM control","Electrostatic precipitator, cold side, w/o flue gas conditioning","1993-04-01","","",null,"","",null,"","",null,"","",null,"","",null,"","",null,"","",null,"","",null,"","",null,"",""]
["68029_BLR1","coal",179,null,68029,"AES Puerto Rico Cogeneration Facility","PR","Unit_1","BLR1","Fluidized bed firing","Fluidized bed firing",255,2461.4,9.652549019607843,"bituminous","bituminous",5.6302388014114195E-6,null,null,1.33E-6,1.2837890196078431E-5,null,null,null,1.33E-6,1.2837890196078431E-5,"NOx control","Selective Noncatalytic Reduction",null,"SO2 control","Dry FGD - Spray Dryer",null,"PM control","Electrostatic precipitator, cold side, w/o flue gas conditioning",null,"","",null,"","",null,"","",null,"","",null,"","",null,"","",null,"","",null,"","",null,"",""]
["2837_3","coal",180,null,2837,"Eastlake","OH","Unit 3","3","Conventional Boiler","Tangential firing",144,1205,8.3680555555555554,"subbituminous,  bituminous","subbituminous,  bituminous",1.3143086774785344E-5,null,null,1.5700000000000002E-6,1.3137847222222224E-5,null,null,null,1.5700000000000002E-6,1.3137847222222224E-5,"NOx control","Selective Noncatalytic Reduction","1999-10-01","PM control","Electrostatic precipitator, cold side, w/o flue gas conditioning","1980-01-01","","",null,"","",null,"","",null,"","",null,"","",null,"","",null,"","",null,"","",null,"","",null,"",""]
["10743_CFB1","coal",181,null,10743,"Morgantown Energy Facility","WV","Unit 1&2","CFB1","Fluidized bed firing","Fluidized bed firing",29,457,15.758620689655173,"bituminous","bituminous",1.4509409411854187E-5,null,null,8.5800000000000009E-7,1.3461724137931036E-5,null,null,null,8.5800000000000009E-7,1.3461724137931036E-5,"PM control","Fabric Filter, pulse","1992-01-01","PM control","Fabric Filter, pulse","1992-01-01","","",null,"","",null,"","",null,"","",null,"","",null,"","",null,"","",null,"","",null,"","",null,"",""]
["10743_CFB2","coal",182,null,10743,"Morgantown Energy Facility","WV","Unit 1&2","CFB2","Fluidized bed firing","Fluidized bed firing",29,453,15.620689655172415,"bituminous","bituminous",1.4509409411854187E-5,null,null,8.5800000000000009E-7,1.3461724137931036E-5,null,null,null,8.5800000000000009E-7,1.3461724137931036E-5,"PM control","Fabric Filter, pulse","1992-01-01","PM control","Fabric Filter, pulse","1992-01-01","","",null,"","",null,"","",null,"","",null,"","",null,"","",null,"","",null,"","",null,"","",null,"",""]
["6016_1","coal",183,null,6016,"Duck Creek","IL","001","1","Conventional Boiler","Wall firing - unspecified",400,4500,11.25,"subbituminous","subbituminous",4.0045479146674792E-6,null,null,3.0833333333333332E-6,3.4687499999999996E-5,null,1.1999999999999999E-6,1.3499999999999999E-5,1.1999999999999999E-6,1.3499999999999999E-5,"NOx control","Selective Catalytic Reduction","2003-06-01","PM control","Electrostatic precipitator, cold side, unspecified","2009-03-01","SO2 control","Wet FGD - Venturi Type","2009-03-01","","",null,"","",null,"","",null,"","",null,"","",null,"","",null,"","",null,"","",null,"",""]
["2107_2","coal",184,null,2107,"Sioux","MO","002","2","Conventional Boiler","Cyclone firing",524,4920,9.3893129770992374,"subbituminous,  bituminous","subbituminous,  bituminous",4.5504905425116686E-6,null,null,1.4399999999999998E-6,1.35206106870229E-5,null,null,null,1.4399999999999998E-6,1.35206106870229E-5,"NOx control","Selective Noncatalytic Reduction","2007-05-01","PM control","Electrostatic precipitator, cold side, w/ flue gas conditioning","1997-12-01","SO2 control","Wet FGD - Unspecified",null,"","",null,"","",null,"","",null,"","",null,"","",null,"","",null,"","",null,"","",null,"",""]
["642_1","coal",185,null,642,"Scholz","FL","Unit 1","1","Conventional Boiler","Wall firing - front firing",49,581.09100000000001,11.859,"bituminous","bituminous",5.4614533048575228E-6,null,null,1.1523333333333334E-6,1.3665521000000001E-5,null,null,null,1.1523333333333334E-6,1.3665521000000001E-5,"PM control","Electrostatic precipitator, cold side, w/o flue gas conditioning","1974-01-01","","",null,"","",null,"","",null,"","",null,"","",null,"","",null,"","",null,"","",null,"","",null,"","",null,"",""]
["3098_2","coal",186,null,3098,"Elrama Power Plant","PA","ELR2-2","2","Conventional Boiler","Vertical firing",100,1254,12.54,"bituminous","bituminous",9.2799761209515872E-6,1.113215305668746E-6,1.3959719933086074E-5,null,null,null,1.5433333333333333E-6,1.93534E-5,1.113215305668746E-6,1.3959719933086074E-5,"NOx control","Selective Noncatalytic Reduction","2001-07-01","PM control","Multiple cyclone","1953-03-01","PM control","Electrostatic precipitator, cold side, w/o flue gas conditioning","1953-03-01","SO2 control","Wet FGD - Venturi Type","1975-06-01","","",null,"","",null,"","",null,"","",null,"","",null,"","",null,"","",null,"",""]
["3098_1","coal",187,null,3098,"Elrama Power Plant","PA","ELR1-2","1","Conventional Boiler","Vertical firing",100,1254,12.54,"bituminous","bituminous",9.2799761209515872E-6,1.113215305668746E-6,1.3959719933086074E-5,null,null,null,1.5433333333333333E-6,1.93534E-5,1.113215305668746E-6,1.3959719933086074E-5,"NOx control","Selective Noncatalytic Reduction","2001-07-01","PM control","Multiple cyclone","1952-06-01","PM control","Electrostatic precipitator, cold side, w/o flue gas conditioning","1952-06-01","SO2 control","Wet FGD - Venturi Type","1975-06-01","","",null,"","",null,"","",null,"","",null,"","",null,"","",null,"","",null,"",""]
["2403_U2","coal",188,null,2403,"PSEG Hudson Generating Station","NJ","HUDU2E2PT2OS1-Coal","U2","Conventional Boiler","Wall firing - opposed firing",659.7,6600,10.004547521600728,"natural gas","subbituminous",null,null,null,null,null,null,1.4163333333333331E-6,1.4169774139760494E-5,1.4163333333333331E-6,1.4169774139760494E-5,"NOx control","Selective Noncatalytic Reduction","1999-03-01","PM control","Electrostatic precipitator, cold side, w/ flue gas conditioning","1968-12-01","","",null,"","",null,"","",null,"","",null,"","",null,"","",null,"","",null,"","",null,"","",null,"",""]
["2094_1","coal",189,null,2094,"Sibley","MO","1","1","Conventional Boiler","Cyclone firing",55,609.6,11.083636363636364,"subbituminous,  bituminous","subbituminous,  bituminous",6.937957001052835E-6,null,null,1.2966666666666666E-6,1.4371781818181817E-5,null,3.0608441588417888E-6,3.392528362236281E-5,1.2966666666666666E-6,1.4371781818181817E-5,"NOx control","Selective Noncatalytic Reduction","2008-05-01","PM control","Electrostatic precipitator, cold side, w/o flue gas conditioning","1990-01-01","","",null,"","",null,"","",null,"","",null,"","",null,"","",null,"","",null,"","",null,"","",null,"",""]
["867_7","coal",190,null,867,"Crawford","IL","CRA7 CONFIG","7","Conventional Boiler","Tangential firing",234,2378.5709999999999,10.164833333333332,"coal - subbituminous","subbituminous",null,null,null,null,null,null,1.4245191755890408E-6,1.448E-5,1.4245191755890408E-6,1.448E-5,"Other control","Activated carbon injection","2008-07-01","PM control","Electrostatic precipitator, cold side, w/o flue gas conditioning","1958-05-01","","",null,"","",null,"","",null,"","",null,"","",null,"","",null,"","",null,"","",null,"","",null,"",""]
["3297_WAT2","coal",191,null,3297,"Wateree","SC","WAT002","WAT2","Conventional Boiler","Wall firing - unspecified",380,3305.1,8.6976315789473677,"","Bituminous",null,null,null,null,null,null,1.6700000000000001E-6,1.4525044736842105E-5,1.6700000000000001E-6,1.4525044736842105E-5,"NOx control","Selective Catalytic Reduction","2004-04-01","PM control","Fabric Filter, unspecified","2001-07-01","SO2 control","Wet FGD - Unspecified",null,"","",null,"","",null,"","",null,"","",null,"","",null,"","",null,"","",null,"","",null,"",""]
["8223_2","coal",192,null,8223,"Springerville","AZ","2","2","Conventional Boiler","Tangential firing",430,3830,8.9069767441860463,"bituminous","bituminous",null,null,null,null,null,null,1.6699999999999999E-6,1.4874651162790696E-5,1.6699999999999999E-6,1.4874651162790696E-5,"SO2 control","Dry FGD - Spray Dryer","1990-06-01","PM control","Fabric Filter, reverse air","1990-06-01","","",null,"","",null,"","",null,"","",null,"","",null,"","",null,"","",null,"","",null,"","",null,"",""]
[{"$f":"E194&\"_\"&I194","v":"994_1"},"coal",193,null,994,"AES Petersburg","IN","1s","1","Conventional Boiler","Tangential firing",255,2200,8.6274509803921564,"bituminous","bituminous",null,null,null,null,null,null,1.7393333333333332E-6,1.5006013071895424E-5,1.7393333333333332E-6,1.5006013071895424E-5,"PM control","Electrostatic precipitator, cold side, w/ flue gas conditioning","1967-12-01","SO2 control","Wet FGD - Spray Type","1996-12-01","","",null,"","",null,"","",null,"","",null,"","",null,"","",null,"","",null,"","",null,"","",null,"",""]
["1008_2","coal",194,null,1008,"R. Gallagher","IN","2-2007","2","Conventional Boiler","Wall firing - front firing",150,1460,9.7333333333333325,"coal - bituminous","bituminous",null,null,null,null,null,null,1.5472032135267466E-6,1.5059444611660332E-5,1.5472032135267466E-6,1.5059444611660332E-5,"PM control","Fabric Filter, shake and deflate","2007-12-01","","",null,"","",null,"","",null,"","",null,"","",null,"","",null,"","",null,"","",null,"","",null,"","",null,"",""]
["642_2","coal",195,null,642,"Scholz","FL","Unit 2","2","Conventional Boiler","Wall firing - front firing",49,644.74199999999996,13.157999999999999,"bituminous","bituminous",5.4614533048575228E-6,null,null,1.1523333333333334E-6,1.5162402E-5,null,null,null,1.1523333333333334E-6,1.5162402E-5,"PM control","Electrostatic precipitator, cold side, w/o flue gas conditioning","2007-12-01","","",null,"","",null,"","",null,"","",null,"","",null,"","",null,"","",null,"","",null,"","",null,"","",null,"",""]
["1043_2SG1","coal",196,null,1043,"Frank E. Ratts","IN","2SG1conf1","2SG1","Conventional Boiler","Wall firing - front firing",131,1142,8.7175572519083975,"coal - bituminous","bituminous",null,null,null,null,null,null,1.8229861474794852E-6,1.5891986110088338E-5,1.8229861474794852E-6,1.5891986110088338E-5,"PM control","Electrostatic precipitator, cold side, w/o flue gas conditioning","1976-12-01","","",null,"","",null,"","",null,"","",null,"","",null,"","",null,"","",null,"","",null,"","",null,"","",null,"",""]
["2094_2","coal",197,null,2094,"Sibley","MO","2","2","Conventional Boiler","Cyclone firing",51,627.29999999999995,12.299999999999999,"subbituminous,  bituminous","subbituminous,  bituminous",6.937957001052835E-6,null,null,1.2966666666666666E-6,1.5948999999999999E-5,null,3.0608441588417888E-6,3.7648383153754E-5,1.2966666666666666E-6,1.5948999999999999E-5,"NOx control","Selective Noncatalytic Reduction","2008-05-01","PM control","Electrostatic precipitator, cold side, w/o flue gas conditioning","1990-01-01","","",null,"","",null,"","",null,"","",null,"","",null,"","",null,"","",null,"","",null,"","",null,"",""]
["6017_2","coal",198,null,6017,"Newton","IL","002","2","Conventional Boiler","Tangential firing",620,5500,8.870967741935484,"subbituminous","subbituminous",5.4687523270683772E-6,null,null,3.7233333333333334E-6,3.3029569892473122E-5,null,1.8200000000000002E-6,1.6145161290322581E-5,1.8200000000000002E-6,1.6145161290322581E-5,"Other control","Other (specify): Flue gas conditioning","2001-04-01","Other control","Activated carbon injection",null,"PM control","Electrostatic precipitator, cold side, w/ flue gas conditioning",null,"","",null,"","",null,"","",null,"","",null,"","",null,"","",null,"","",null,"","",null,"",""]
["384_81","coal",199,null,384,"Joliet 29","IL","JOL8CONFIG","81","Conventional Boiler","Tangential firing",271,2758.0909999999999,10.177457564575645,"coal - subbituminous","subbituminous",null,null,null,null,null,null,1.6424876264660718E-6,1.6466666666666666E-5,1.6424876264660718E-6,1.6466666666666666E-5,"Other control","Activated carbon injection","2009-07-01","Other control","Activated carbon injection","2009-07-01","PM control","Electrostatic precipitator, cold side, w/o flue gas conditioning","1966-03-01","PM control","Electrostatic precipitator, cold side, w/o flue gas conditioning","1966-03-01","","",null,"","",null,"","",null,"","",null,"","",null,"","",null,"","",null,"",""]
["384_82","coal",200,null,384,"Joliet 29","IL","JOL8CONFIG","82","Conventional Boiler","Tangential firing",271,2675.6993004699998,9.87342915302583,"coal - subbituminous","subbituminous",null,null,null,null,null,null,1.6424876264660718E-6,1.6466666666666666E-5,1.6424876264660718E-6,1.6466666666666666E-5,"Other control","Activated carbon injection","2009-07-01","Other control","Activated carbon injection","2009-07-01","PM control","Electrostatic precipitator, cold side, w/o flue gas conditioning","1966-03-01","PM control","Electrostatic precipitator, cold side, w/o flue gas conditioning","1966-03-01","","",null,"","",null,"","",null,"","",null,"","",null,"","",null,"","",null,"",""]
["6249_3","coal",201,null,6249,"Winyah","SC","W3","3","Conventional Boiler","Wall firing - opposed firing",305,2877,9.4327868852459016,"coal - bituminous","bituminous",null,null,null,null,null,null,1.7549271417866014E-6,1.6553853727606728E-5,1.7549271417866014E-6,1.6553853727606728E-5,"NOx control","Selective Catalytic Reduction","2005-04-01","PM control","Electrostatic precipitator, cold side, w/ flue gas conditioning","1980-05-01","SO2 control","Wet FGD - Spray Type","1980-05-01","","",null,"","",null,"","",null,"","",null,"","",null,"","",null,"","",null,"","",null,"",""]
["2169_2","coal",202,null,2169,"Chamois Power Plant","MO","Unit 2","2","Conventional Boiler","Cyclone firing",50,563,11.26,"coal - subbituminous","subbituminous",null,null,null,null,null,null,1.4866666666666665E-6,1.6739866666666665E-5,1.4866666666666665E-6,1.6739866666666665E-5,"PM control","Electrostatic precipitator, cold side, w/o flue gas conditioning","1976-06-01","","",null,"","",null,"","",null,"","",null,"","",null,"","",null,"","",null,"","",null,"","",null,"","",null,"",""]
["113_4","coal",203,null,113,"Cholla","AZ","004","4","Conventional Boiler","Tangential firing",425,4268,10.042352941176471,"bituminous","bituminous",9.4958990142048397E-6,null,null,1.7309768447999998E-6,1.7383080408485645E-5,null,null,null,1.7309768447999998E-6,1.7383080408485645E-5,"PM control","Fabric Filter, unspecified","2008-01-01","SO2 control","Wet FGD - Packed Type","2008-01-01","","",null,"","",null,"","",null,"","",null,"","",null,"","",null,"","",null,"","",null,"","",null,"",""]
["8223_3","coal",204,null,8223,"Springerville","AZ","3","3","Conventional Boiler","Wall firing - opposed firing",450,4200,9.3333333333333339,"subbituminous","subbituminous",4.1530867446473656E-6,null,null,3.1045943376E-6,2.8976213817600004E-5,null,1.9E-6,1.7733333333333335E-5,1.9E-6,1.7733333333333335E-5,"NOx control","Selective Catalytic Reduction","2006-08-01","SO2 control","Dry FGD - Spray Dryer","2006-08-01","PM control","Fabric Filter, pulse","2006-08-01","","",null,"","",null,"","",null,"","",null,"","",null,"","",null,"","",null,"","",null,"",""]
["994_2","coal",205,null,994,"AES Petersburg","IN","2ss","2","Conventional Boiler","Tangential firing",445,4144,9.3123595505617978,"bituminous","bituminous",null,null,null,null,null,null,1.9143333333333334E-6,1.7826960299625468E-5,1.9143333333333334E-6,1.7826960299625468E-5,"NOx control","Selective Catalytic Reduction","2004-12-01","PM control","Electrostatic precipitator, cold side, w/ flue gas conditioning","1969-12-01","SO2 control","Wet FGD - Spray Type","1996-12-01","","",null,"","",null,"","",null,"","",null,"","",null,"","",null,"","",null,"","",null,"",""]
["6113_4","coal",206,null,6113,"Gibson","IN","4","4","Conventional Boiler","Wall firing - opposed firing",661,6265,9.4780635400907709,"bituminous","bituminous",null,null,null,null,null,null,1.9110137131773658E-6,1.8112709399479872E-5,1.9110137131773658E-6,1.8112709399479872E-5,"NOx control","Selective Catalytic Reduction","2003-04-01","Other control","Other (specify): Soda Ash Injection for SO3 mitigation","2004-06-01","PM control","Electrostatic precipitator, cold side, w/o flue gas conditioning","1978-01-01","SO2 control","Wet FGD - Tray Type","1994-12-01","","",null,"","",null,"","",null,"","",null,"","",null,"","",null,"","",null,"",""]
["1385_3","coal",207,null,1385,"Dale Station","KY","03","3","Conventional Boiler","Wall firing - front firing",80,944,11.8,"bituminous","bituminous",3.8214867945300003E-6,null,null,1.59E-6,1.8762000000000001E-5,null,null,null,1.59E-6,1.8762000000000001E-5,"PM control","Electrostatic precipitator, cold side, w/ flue gas conditioning",null,"","",null,"","",null,"","",null,"","",null,"","",null,"","",null,"","",null,"","",null,"","",null,"","",null,"",""]
["3181_33","coal",208,null,3181,"Mitchell Power Station","PA","033","33","Conventional Boiler","Tangential firing",289,2563,8.8685121107266429,"coal - bituminous","bituminous",null,null,null,null,null,null,2.1319999999999997E-6,1.89076678200692E-5,2.1319999999999997E-6,1.89076678200692E-5,"PM control","Electrostatic precipitator, cold side, unspecified","1971-01-01","SO2 control","Wet FGD - Spray Type","1983-01-01","","",null,"","",null,"","",null,"","",null,"","",null,"","",null,"","",null,"","",null,"","",null,"",""]
["6249_4","coal",209,null,6249,"Winyah","SC","W4","4","Conventional Boiler","Wall firing - opposed firing",305,3051,10.00327868852459,"coal - bituminous","bituminous",null,null,null,null,null,null,1.9061645469663879E-6,1.9067895189489999E-5,1.9061645469663879E-6,1.9067895189489999E-5,"NOx control","Selective Catalytic Reduction","2005-05-01","PM control","Electrostatic precipitator, cold side, w/ flue gas conditioning","1981-11-01","SO2 control","Wet FGD - Spray Type","1981-11-01","","",null,"","",null,"","",null,"","",null,"","",null,"","",null,"","",null,"","",null,"",""]
["6179_3","coal",210,null,6179,"Fayette Power Project","TX","3","3","Conventional Boiler","Tangential firing",470,4660,9.914893617021276,"subbituminous","subbituminous",null,null,null,null,null,null,1.9299999999999997E-6,1.913574468085106E-5,1.9299999999999997E-6,1.913574468085106E-5,"PM control","Electrostatic precipitator, cold side, w/o flue gas conditioning","1988-04-01","SO2 control","Wet FGD - Spray Type","1988-04-01","","",null,"","",null,"","",null,"","",null,"","",null,"","",null,"","",null,"","",null,"","",null,"",""]
["994_3","coal",211,null,994,"AES Petersburg","IN","3ss","3","Conventional Boiler","Tangential firing",580,5540,9.5517241379310338,"coal - bituminous","bituminous",null,null,null,null,null,null,2.0420000000000001E-6,1.9504620689655172E-5,2.0420000000000001E-6,1.9504620689655172E-5,"NOx control","Selective Catalytic Reduction","2004-12-01","PM control","Electrostatic precipitator, cold side, w/ flue gas conditioning","1977-12-01","SO2 control","Wet FGD - Spray Type","1977-12-01","","",null,"","",null,"","",null,"","",null,"","",null,"","",null,"","",null,"","",null,"",""]
["1363_5","coal",212,null,1363,"Cane Run","KY","CR5","5","Conventional Boiler","Wall firing - front firing",181,2182,12.05524861878453,"bituminous","bituminous",6.9615509357721417E-6,1.64343842457395E-6,1.9812058797902534E-5,null,null,null,null,null,1.64343842457395E-6,1.9812058797902534E-5,"PM control","Electrostatic precipitator, cold side, w/o flue gas conditioning","1966-03-01","SO2 control","Wet FGD - Spray Type","1978-05-01","","",null,"","",null,"","",null,"","",null,"","",null,"","",null,"","",null,"","",null,"","",null,"",""]
["887_1","coal",213,null,887,"Joppa Steam","IL","1","1","Conventional Boiler","Tangential firing",183.3,1800,9.8199672667757767,"subbituminous","subbituminous",5.6721922984759092E-6,null,null,2.03E-6,1.9934533551554828E-5,null,null,null,2.03E-6,1.9934533551554828E-5,"Other control","Activated carbon injection","2009-07-01","PM control","Electrostatic precipitator, cold side, w/ flue gas conditioning","1971-01-01","","",null,"","",null,"","",null,"","",null,"","",null,"","",null,"","",null,"","",null,"","",null,"",""]
["3280_CAN1","coal",214,null,3280,"Canadys Steam","SC","CAN001","CAN1","Conventional Boiler","Tangential firing",121,1141.5,9.4338842975206614,"","Bituminous",null,null,null,null,null,null,2.1500000000000002E-6,2.0282851239669424E-5,2.1500000000000002E-6,2.0282851239669424E-5,"PM control","Electrostatic precipitator, cold side, w/ flue gas conditioning","1972-06-01","","",null,"","",null,"","",null,"","",null,"","",null,"","",null,"","",null,"","",null,"","",null,"","",null,"",""]
["4041_5","coal",215,null,4041,"South Oak Creek","WI","OCPP-B5","5","Conventional Boiler","Wall firing - front firing",273,2488,9.1135531135531131,"","subbituminous",null,null,null,null,null,null,2.2320333333333334E-6,2.0341754334554334E-5,2.2320333333333334E-6,2.0341754334554334E-5,"PM control","Electrostatic precipitator, cold side, w/o flue gas conditioning","1972-03-01","","",null,"","",null,"","",null,"","",null,"","",null,"","",null,"","",null,"","",null,"","",null,"","",null,"",""]
["6249_1","coal",216,null,6249,"Winyah","SC","W1","1","Conventional Boiler","Wall firing - rear firing",295,2904,9.8440677966101688,"bituminous","bituminous",null,null,null,null,null,null,2.0668257469573148E-6,2.034597277682726E-5,2.0668257469573148E-6,2.034597277682726E-5,"NOx control","Selective Catalytic Reduction","2004-05-01","PM control","Electrostatic precipitator, cold side, w/o flue gas conditioning","1975-03-01","SO2 control","Wet FGD - Spray Type","2007-04-01","","",null,"","",null,"","",null,"","",null,"","",null,"","",null,"","",null,"","",null,"",""]
["68029_BLR2","coal",217,null,68029,"AES Puerto Rico Cogeneration Facility","PR","Unit_2","BLR2","Fluidized bed firing","Fluidized bed firing",255,2461.4,9.652549019607843,"bituminous","bituminous",5.650835103020993E-6,null,null,2.1333333333333334E-6,2.0592104575163398E-5,null,null,null,2.1333333333333334E-6,2.0592104575163398E-5,"NOx control","Selective Noncatalytic Reduction",null,"SO2 control","Dry FGD - Spray Dryer",null,"PM control","Electrostatic precipitator, cold side, w/o flue gas conditioning",null,"","",null,"","",null,"","",null,"","",null,"","",null,"","",null,"","",null,"","",null,"",""]
["4041_8","coal",218,null,4041,"South Oak Creek","WI","OCPP-B8","8","Conventional Boiler","Tangential firing",336,3009,8.9553571428571423,"subbituminous","subbituminous",4.5962402208961879E-6,null,null,4.4633333333333335E-6,3.9970744047619047E-5,null,2.3E-6,2.0597321428571428E-5,2.3E-6,2.0597321428571428E-5,"PM control","Electrostatic precipitator, cold side, w/o flue gas conditioning","1991-07-01","","",null,"","",null,"","",null,"","",null,"","",null,"","",null,"","",null,"","",null,"","",null,"","",null,"",""]
["4140_B5","coal",219,null,4140,"Alma","WI","B5","B5","Conventional Boiler","Wall firing - unspecified",83.5,862.65,10.331137724550898,"","Bituminous, Subbituminous",null,null,null,null,null,null,2.0246666666666665E-6,2.0917110179640713E-5,2.0246666666666665E-6,2.0917110179640713E-5,"NOx control","Selective Noncatalytic Reduction",null,"PM control","Electrostatic precipitator, cold side, unspecified","1974-06-01","","",null,"","",null,"","",null,"","",null,"","",null,"","",null,"","",null,"","",null,"","",null,"",""]
["2161_5","coal",220,null,2161,"James River Power Station","MO","Unit_5_JRPS","5","Conventional Boiler","Wall firing - front firing",105,1010,9.6190476190476186,"subbituminous","subbituminous",7.0319017562369037E-6,2.1931527773258427E-6,2.109604100094382E-5,null,null,null,null,null,2.1931527773258427E-6,2.109604100094382E-5,"NOx control","Selective Noncatalytic Reduction","2009-03-01","PM control","Electrostatic precipitator, cold side, w/o flue gas conditioning","1970-05-01","PM control","Electrostatic precipitator, cold side, w/o flue gas conditioning","1994-05-01","","",null,"","",null,"","",null,"","",null,"","",null,"","",null,"","",null,"","",null,"",""]
["2161_4","coal",221,null,2161,"James River Power Station","MO","Unit_4_JRPS","4","Conventional Boiler","Wall firing - front firing",60,600,10,"subbituminous","subbituminous",4.7833447356312417E-6,2.7242533571051943E-6,2.7242533571051943E-5,null,null,null,2.1099999999999997E-6,2.1099999999999998E-5,2.1099999999999997E-6,2.1099999999999998E-5,"NOx control","Selective Noncatalytic Reduction","2007-05-01","PM control","Electrostatic precipitator, cold side, w/o flue gas conditioning","1976-08-01","","",null,"","",null,"","",null,"","",null,"","",null,"","",null,"","",null,"","",null,"","",null,"",""]
["994_4","coal",222,null,994,"AES Petersburg","IN","4s","4","Conventional Boiler","Tangential firing",584,5550,9.5034246575342465,"bituminous,  No.2 Fuel Oil (distillate)","bituminous,  No.2 Fuel Oil (distillate)",null,null,null,null,null,null,2.249E-6,2.137320205479452E-5,2.249E-6,2.137320205479452E-5,"PM control","Electrostatic precipitator, cold side, w/ flue gas conditioning","1986-12-01","SO2 control","Wet FGD - Spray Type","1986-12-01","","",null,"","",null,"","",null,"","",null,"","",null,"","",null,"","",null,"","",null,"","",null,"",""]
["1043_1SG1","coal",223,null,1043,"Frank E. Ratts","IN","1SG1conf1","1SG1","Conventional Boiler","Wall firing - front firing",130,1142,8.7846153846153854,"coal - bituminous","bituminous",null,null,null,null,null,null,2.4481859150713032E-6,2.1506371653934066E-5,2.4481859150713032E-6,2.1506371653934066E-5,"PM control","Electrostatic precipitator, cold side, w/o flue gas conditioning","1976-12-01","","",null,"","",null,"","",null,"","",null,"","",null,"","",null,"","",null,"","",null,"","",null,"","",null,"",""]
["2167_2","coal",224,null,2167,"New Madrid","MO","con2","2","Conventional Boiler","Cyclone firing",600,6000,10,"coal - subbituminous","subbituminous",null,null,null,null,null,null,2.1899999999999998E-6,2.1899999999999997E-5,2.1899999999999998E-6,2.1899999999999997E-5,"NOx control","Selective Catalytic Reduction","2000-02-01","PM control","Electrostatic precipitator, cold side, w/o flue gas conditioning","1982-05-01","","",null,"","",null,"","",null,"","",null,"","",null,"","",null,"","",null,"","",null,"","",null,"",""]
["2167_1","coal",225,null,2167,"New Madrid","MO","con1","1","Conventional Boiler","Cyclone firing",600,6000,10,"coal - subbituminous","subbituminous",null,null,null,null,null,null,2.2266666666666668E-6,2.2266666666666668E-5,2.2266666666666668E-6,2.2266666666666668E-5,"NOx control","Selective Catalytic Reduction","2002-02-01","PM control","Electrostatic precipitator, cold side, w/o flue gas conditioning","1982-04-01","","",null,"","",null,"","",null,"","",null,"","",null,"","",null,"","",null,"","",null,"","",null,"",""]
["6096_NC2","coal",226,null,6096,"Nebraska City","NE","NC2","NC2","Conventional Boiler","Wall firing - front firing",682,6920.2539999999999,10.147,"bituminous","bituminous",7.0116340208485501E-6,null,null,2.2200000000000003E-6,2.2526340000000004E-5,null,null,null,2.2200000000000003E-6,2.2526340000000004E-5,"NOx control","Selective Catalytic Reduction","2009-05-01","Other control","Activated carbon injection","2009-05-01","SO2 control","Dry FGD - Spray Dryer","2009-05-01","PM control","Fabric Filter, pulse","2009-05-01","","",null,"","",null,"","",null,"","",null,"","",null,"","",null,"","",null,"",""]
["2837_1","coal",227,null,2837,"Eastlake","OH","Unit 1","1","Conventional Boiler","Tangential firing",144,1205,8.3680555555555554,"subbituminous,  bituminous","subbituminous,  bituminous",1.0221771933595256E-5,null,null,2.7866666666666665E-6,2.3318981481481479E-5,null,null,null,2.7866666666666665E-6,2.3318981481481479E-5,"PM control","Electrostatic precipitator, cold side, w/o flue gas conditioning","1979-01-01","","",null,"","",null,"","",null,"","",null,"","",null,"","",null,"","",null,"","",null,"","",null,"","",null,"",""]
["50611_031","coal",228,null,50611,"WPS Westwood Generation, LLC","PA","001","031","Fluidized bed firing","Fluidized bed firing",36,615,17.083333333333332,"coal refuse (culm or gob)","coal refuse (culm or gob)",null,null,null,null,null,null,1.3986666666666666E-6,2.3893888888888886E-5,1.3986666666666666E-6,2.3893888888888886E-5,"PM control","Fabric Filter, pulse","1987-12-01","","",null,"","",null,"","",null,"","",null,"","",null,"","",null,"","",null,"","",null,"","",null,"","",null,"",""]
["6017_1","coal",229,null,6017,"Newton","IL","001","1","Conventional Boiler","Tangential firing",629,5500,8.7440381558028619,"","Bituminous, Subbituminous",null,null,null,null,null,null,2.7499999999999999E-6,2.404610492845787E-5,2.7499999999999999E-6,2.404610492845787E-5,"Other control","Other (specify): Flue gas conditioning","2001-04-01","Other control","Activated carbon injection",null,"PM control","Electrostatic precipitator, cold side, w/ flue gas conditioning",null,"","",null,"","",null,"","",null,"","",null,"","",null,"","",null,"","",null,"","",null,"",""]
["728_Y1BR","coal",230,null,728,"Yates","GA","Y1BR","Y1BR","Conventional Boiler","Tangential firing",107,1094.742,10.231233644859813,"bituminous","bituminous",null,null,null,null,null,null,2.3702982181828919E-6,2.4251074878224069E-5,2.3702982181828919E-6,2.4251074878224069E-5,"PM control","Electrostatic precipitator, cold side, w/o flue gas conditioning","1971-05-01","SO2 control","Wet FGD - Spray Type","1992-10-01","","",null,"","",null,"","",null,"","",null,"","",null,"","",null,"","",null,"","",null,"","",null,"",""]
["1832_EU001","coal",231,null,1832,"Erickson Station","MI","001","EU001","Conventional Boiler","Wall firing - front firing",165,1668,10.109090909090909,"bituminous","bituminous",5.633917657647535E-6,2.416708760917895E-6,2.4430728564915447E-5,null,null,null,3.5233333333333328E-6,3.5617696969696964E-5,2.416708760917895E-6,2.4430728564915447E-5,"PM control","Electrostatic precipitator, unspecified","1998-01-01","","",null,"","",null,"","",null,"","",null,"","",null,"","",null,"","",null,"","",null,"","",null,"","",null,"",""]
["864_5","coal",232,null,864,"Meredosia","IL","005","5","Conventional Boiler","Tangential firing",204,2784,13.647058823529411,"subbituminous","subbituminous",3.3093844812406302E-6,null,null,1.7972248056333335E-6,2.4526832641584314E-5,null,null,null,1.7972248056333335E-6,2.4526832641584314E-5,"Other control","Activated carbon injection","2009-08-01","PM control","Electrostatic precipitator, cold side, w/ flue gas conditioning","1992-11-01","","",null,"","",null,"","",null,"","",null,"","",null,"","",null,"","",null,"","",null,"","",null,"",""]
["3115_1","coal",233,null,3115,"Titus","PA","TI-1-2","1","Conventional Boiler","Tangential firing",86.2,900,10.440835266821345,"coal - bituminous","bituminous",null,null,null,null,null,null,2.3877187500000001E-6,2.4929778132250581E-5,2.3877187500000001E-6,2.4929778132250581E-5,"PM control","Electrostatic precipitator, cold side, w/o flue gas conditioning","1975-02-01","","",null,"","",null,"","",null,"","",null,"","",null,"","",null,"","",null,"","",null,"","",null,"","",null,"",""]
["3295_URQ3","coal",234,null,3295,"Urquhart","SC","URQ003","URQ3","Conventional Boiler","Tangential firing",103,1048,10.174757281553399,"bituminous","bituminous",1.5132145943858613E-5,5.4768988464175028E-6,5.5726116417917896E-5,null,null,null,2.4600000000000002E-6,2.5029902912621362E-5,2.4600000000000002E-6,2.5029902912621362E-5,"PM control","Electrostatic precipitator, cold side, unspecified","1969-11-01","","",null,"","",null,"","",null,"","",null,"","",null,"","",null,"","",null,"","",null,"","",null,"","",null,"",""]
["2708_5","coal",235,null,2708,"Cape Fear Steam Electric Plant","NC","Cap_Cfg_5b","5","Conventional Boiler","Tangential firing",153,1242,8.117647058823529,"bituminous","bituminous",5.7259670248877775E-6,null,null,3.0994088050799997E-6,2.5159906770649409E-5,null,null,null,3.0994088050799997E-6,2.5159906770649409E-5,"NOx control","Selective Noncatalytic Reduction","2006-05-01","PM control","Electrostatic precipitator, cold side, w/o flue gas conditioning","1973-11-01","","",null,"","",null,"","",null,"","",null,"","",null,"","",null,"","",null,"","",null,"","",null,"",""]
["1943_003","coal",236,null,1943,"Hoot Lake","MN","3","003","Conventional Boiler","Wall firing - front firing",83.5,978.7,11.720958083832336,"coal - subbituminous","subbituminous",null,null,null,null,null,null,2.1733333333333334E-6,2.5473548902195613E-5,2.1733333333333334E-6,2.5473548902195613E-5,"PM control","Electrostatic precipitator, cold side, w/o flue gas conditioning","1972-05-01","","",null,"","",null,"","",null,"","",null,"","",null,"","",null,"","",null,"","",null,"","",null,"","",null,"",""]
["2480_4","coal",237,null,2480,"Danskammer Generating Station","NY","4","4","Conventional Boiler","Tangential firing",242.3,2535,10.46223689640941,"bituminous","bituminous",null,null,null,null,null,null,2.4496266666666668E-6,2.5628574494428394E-5,2.4496266666666668E-6,2.5628574494428394E-5,"PM control","Electrostatic precipitator, cold side, w/o flue gas conditioning","1987-09-01","","",null,"","",null,"","",null,"","",null,"","",null,"","",null,"","",null,"","",null,"","",null,"","",null,"",""]
["1122_Boiler 7","coal",238,null,1122,"Ames Electric Services Power Plant","IA","007","Boiler 7","Conventional Boiler","Tangential firing",43.9,381,8.6788154897494305,"","Subbituminous",null,null,null,null,null,null,2.9900000000000002E-6,2.5949658314350798E-5,2.9900000000000002E-6,2.5949658314350798E-5,"PM control","Electrostatic precipitator, cold side, unspecified","2003-03-05","","",null,"","",null,"","",null,"","",null,"","",null,"","",null,"","",null,"","",null,"","",null,"","",null,"",""]
["384_71","coal",239,null,384,"Joliet 29","IL","JOL7CONFIG","71","Conventional Boiler","Tangential firing",273,2889.663,10.584846153846154,"coal - subbituminous","subbituminous",null,null,null,null,null,null,2.5547016047453528E-6,2.6039999999999998E-5,2.5547016047453528E-6,2.6039999999999998E-5,"Other control","Activated carbon injection","2009-07-01","Other control","Activated carbon injection","2009-07-01","PM control","Electrostatic precipitator, cold side, w/o flue gas conditioning","1965-04-01","PM control","Electrostatic precipitator, cold side, w/o flue gas conditioning","1965-04-01","","",null,"","",null,"","",null,"","",null,"","",null,"","",null,"","",null,"",""]
["384_72","coal",240,null,384,"Joliet 29","IL","JOL7CONFIG","72","Conventional Boiler","Tangential firing",273,2675.6993004699998,9.8010963387179473,"coal - subbituminous","subbituminous",null,null,null,null,null,null,2.5547016047453528E-6,2.6039999999999998E-5,2.5547016047453528E-6,2.6039999999999998E-5,"Other control","Activated carbon injection","2009-07-01","Other control","Activated carbon injection","2009-07-01","PM control","Electrostatic precipitator, cold side, w/o flue gas conditioning","1965-04-01","PM control","Electrostatic precipitator, cold side, w/o flue gas conditioning","1965-04-01","","",null,"","",null,"","",null,"","",null,"","",null,"","",null,"","",null,"",""]
["1250_3","coal",241,null,1250,"Lawrence Energy Center","KS","3","3","Conventional Boiler","Tangential firing",58,645,11.120689655172415,"bituminous","bituminous",6.1874017804338871E-6,null,null,4.3266666666666662E-6,4.8115517241379308E-5,null,2.3485200052821324E-6,2.6117162127706474E-5,2.3485200052821324E-6,2.6117162127706474E-5,"PM control","Electrostatic precipitator, cold side, w/o flue gas conditioning","1977-06-01","","",null,"","",null,"","",null,"","",null,"","",null,"","",null,"","",null,"","",null,"","",null,"","",null,"",""]
["3280_CAN2","coal",242,null,3280,"Canadys Steam","SC","CAN002","CAN2","Conventional Boiler","Tangential firing",123,1175.7,9.5585365853658537,"","Bituminous",null,null,null,null,null,null,2.74E-6,2.6190390243902441E-5,2.74E-6,2.6190390243902441E-5,"PM control","Electrostatic precipitator, cold side, w/ flue gas conditioning","1971-12-01","","",null,"","",null,"","",null,"","",null,"","",null,"","",null,"","",null,"","",null,"","",null,"","",null,"",""]
["884_3","coal",243,null,884,"Will County","IL","WC3CONFIG","3","Conventional Boiler","Tangential firing",278,2582.0370000000003,9.2879028776978423,"coal - subbituminous","subbituminous",null,null,null,null,null,null,2.8477903298829569E-6,2.6450000000000003E-5,2.8477903298829569E-6,2.6450000000000003E-5,"Other control","Activated carbon injection","2009-07-01","PM control","Electrostatic precipitator, hot side, w/o flue gas conditioning","1957-06-01","","",null,"","",null,"","",null,"","",null,"","",null,"","",null,"","",null,"","",null,"","",null,"",""]
["54634_1","coal",244,null,54634,"St. Nicholas Cogen Project","PA","1","1","Fluidized bed firing","Fluidized bed firing",99.2,1300,13.104838709677418,"coal refuse (culm or gob)","coal refuse (culm or gob)",null,null,null,null,null,null,2.0603076923076927E-6,2.7000000000000002E-5,2.0603076923076927E-6,2.7000000000000002E-5,"PM control","Fabric Filter, pulse","1990-09-01","","",null,"","",null,"","",null,"","",null,"","",null,"","",null,"","",null,"","",null,"","",null,"","",null,"",""]
["6639_G2","coal",245,null,6639,"R D Green","KY","2","G2","Conventional Boiler","Wall firing - opposed firing",239,2726.6,11.40836820083682,"bituminous,  Petroleum coke","bituminous,  Petroleum coke",6.6138708062623757E-6,null,null,2.3966666666666664E-6,2.7342055788005576E-5,null,null,null,2.3966666666666664E-6,2.7342055788005576E-5,"PM control","Electrostatic precipitator, cold side, w/o flue gas conditioning","1981-01-01","SO2 control","Wet FGD - Spray Type","1981-01-01","","",null,"","",null,"","",null,"","",null,"","",null,"","",null,"","",null,"","",null,"","",null,"",""]
["2848_H-6","coal",246,null,2848,"O H Hutchings","OH","H-6","H-6","Conventional Boiler","Tangential firing",60.5,646,10.677685950413224,"coal - bituminous","bituminous",null,null,null,null,null,null,2.5966666666666667E-6,2.7726391184573004E-5,2.5966666666666667E-6,2.7726391184573004E-5,"PM control","Electrostatic precipitator, hot side, w/o flue gas conditioning","1973-01-01","","",null,"","",null,"","",null,"","",null,"","",null,"","",null,"","",null,"","",null,"","",null,"","",null,"",""]
["2824_1","coal",247,null,2824,"Stanton","ND","u1","1","Conventional Boiler","Wall firing - front firing",132,1800,13.636363636363637,"subbituminous","subbituminous",null,null,null,null,null,null,2.0701228415176761E-6,2.8228947838877401E-5,2.0701228415176761E-6,2.8228947838877401E-5,"PM control","Electrostatic precipitator, cold side, w/o flue gas conditioning","2000-01-01","PM control","Electrostatic precipitator, cold side, w/o flue gas conditioning","2000-01-01","","",null,"","",null,"","",null,"","",null,"","",null,"","",null,"","",null,"","",null,"","",null,"",""]
["856_3","coal",248,null,856,"ED Edwards","IL","003","3","Conventional Boiler","Wall firing - unspecified",366,4594,12.551912568306012,"","Bituminous, Subbituminous",null,null,null,null,null,null,2.2699999999999999E-6,2.8492841530054646E-5,2.2699999999999999E-6,2.8492841530054646E-5,"NOx control","Selective Catalytic Reduction","2003-05-01","PM control","Electrostatic precipitator, cold side, unspecified","1972-06-01","Other control","Activated carbon injection",null,"Other control","Other (specify): Flue Gas Conditioning",null,"","",null,"","",null,"","",null,"","",null,"","",null,"","",null,"","",null,"",""]
["3113_1","coal",249,null,3113,"Portland","PA","POR-1","1","Conventional Boiler","Tangential firing",172,1719,9.9941860465116275,"coal - bituminous","bituminous",null,null,null,null,null,null,2.9269999999999997E-6,2.925298255813953E-5,2.9269999999999997E-6,2.925298255813953E-5,"PM control","Electrostatic precipitator, cold side, w/o flue gas conditioning","1989-01-01","","",null,"","",null,"","",null,"","",null,"","",null,"","",null,"","",null,"","",null,"","",null,"","",null,"",""]
["1893_2","coal",250,null,1893,"Boswell Energy Center","MN","BEC2","2","Conventional Boiler","Wall firing - front firing",72,750,10.416666666666666,"","Subbituminous",null,null,null,null,null,null,2.8200000000000001E-6,2.9374999999999999E-5,2.8200000000000001E-6,2.9374999999999999E-5,"NOx control","Selective Noncatalytic Reduction",null,"PM control","Fabric Filter, unspecified","1977-01-01","","",null,"","",null,"","",null,"","",null,"","",null,"","",null,"","",null,"","",null,"","",null,"",""]
["469_2","coal",251,null,469,"Cherokee","CO","Unit 2","2","Conventional Boiler","Vertical firing",114,1392,12.210526315789474,"bituminous","bituminous",null,null,null,null,null,null,2.4399999999999999E-6,2.9793684210526317E-5,2.4399999999999999E-6,2.9793684210526317E-5,"SO2 control","Dry FGD - Sorbent Injection","2002-12-01","PM control","Fabric Filter, reverse air","1985-05-01","","",null,"","",null,"","",null,"","",null,"","",null,"","",null,"","",null,"","",null,"","",null,"",""]
["3115_3","coal",252,null,3115,"Titus","PA","TI-3-2","3","Conventional Boiler","Tangential firing",86.2,900,10.440835266821345,"coal - bituminous","bituminous",null,null,null,null,null,null,2.8600499999999998E-6,2.9861310904872388E-5,2.8600499999999998E-6,2.9861310904872388E-5,"PM control","Electrostatic precipitator, cold side, w/o flue gas conditioning","1975-02-01","","",null,"","",null,"","",null,"","",null,"","",null,"","",null,"","",null,"","",null,"","",null,"","",null,"",""]
["1374_1374","coal",253,null,1374,"Elmer Smith Station","KY","Unit001","1374","Conventional Boiler","Cyclone firing",153,1370,8.9542483660130721,"bituminous,  petroleum coke","bituminous,  petroleum coke",1.0323808728435888E-5,null,null,3.6100000000000002E-6,2.9943914510686167E-5,null,null,null,3.6100000000000002E-6,2.9943914510686167E-5,"NOx control","Selective Catalytic Reduction","2004-05-01","PM control","Electrostatic precipitator, cold side, w/o flue gas conditioning","1993-12-01","SO2 control","Wet FGD - Spray Type","1995-01-01","","",null,"","",null,"","",null,"","",null,"","",null,"","",null,"","",null,"","",null,"",""]
["1374_1374-2","coal",254,null,1374,"Elmer Smith Station","KY","Unit001","1374-2","Conventional Boiler","Tangential firing",291.5,2317,7.9485420240137223,"bituminous,  petroleum coke","bituminous,  petroleum coke",1.0323808728435888E-5,null,null,3.6100000000000002E-6,2.9943914510686167E-5,null,null,null,3.6100000000000002E-6,2.9943914510686167E-5,"NOx control","Selective Catalytic Reduction","2004-05-01","PM control","Electrostatic precipitator, cold side, w/o flue gas conditioning","1993-12-01","SO2 control","Wet FGD - Spray Type","1995-01-01","","",null,"","",null,"","",null,"","",null,"","",null,"","",null,"","",null,"","",null,"",""]
["3179_1","coal",255,null,3179,"Hatfield's Ferry Power Station","PA","001","1","Conventional Boiler","Wall firing - opposed firing",590,5700,9.6610169491525415,"bituminous","bituminous",4.4941563601172456E-6,null,null,3.1566666666666664E-6,3.0496610169491519E-5,null,3.1633333333333328E-6,3.0561016949152532E-5,3.1566666666666664E-6,3.0496610169491519E-5,"PM control","Electrostatic precipitator, cold side, unspecified","1969-01-01","SO2 control","Wet FGD - Spray Type","2009-06-01","","",null,"","",null,"","",null,"","",null,"","",null,"","",null,"","",null,"","",null,"","",null,"",""]
["1046_1","coal",256,null,1046,"Dubuque","IA","Unit 1","1","Conventional Boiler","Wall firing - front firing",37.6,605.79999999999995,16.111702127659573,"coal - bituminous","subbituminous",null,null,null,null,null,null,1.9E-6,3.0612234042553191E-5,1.9E-6,3.0612234042553191E-5,"PM control","Electrostatic precipitator, cold side, w/o flue gas conditioning","1974-01-01","","",null,"","",null,"","",null,"","",null,"","",null,"","",null,"","",null,"","",null,"","",null,"","",null,"",""]
[{"$f":"E258&\"_\"&I258","v":"4041_7"},"coal",257,null,4041,"South Oak Creek","WI","OCPP-B7","7","Conventional Boiler","Tangential firing",320,2856,8.9250000000000007,"subbituminous","subbituminous",4.5155531787074705E-6,null,null,3.4733333333333333E-6,3.09995E-5,null,3.9999999999999998E-6,3.57E-5,3.4733333333333333E-6,3.09995E-5,"PM control","Electrostatic precipitator, cold side, w/o flue gas conditioning","1992-07-01","","",null,"","",null,"","",null,"","",null,"","",null,"","",null,"","",null,"","",null,"","",null,"","",null,"",""]
["113_3","coal",258,null,113,"Cholla","AZ","003","3","Conventional Boiler","Tangential firing",305,2929,9.6032786885245898,"bituminous","bituminous",1.3500505715723578E-5,null,null,3.2773891007666669E-6,3.1473680905395301E-5,null,null,null,3.2773891007666669E-6,3.1473680905395301E-5,"PM control","Fabric Filter, unspecified","2009-01-01","SO2 control","Wet FGD - Unspecified","2009-01-01","","",null,"","",null,"","",null,"","",null,"","",null,"","",null,"","",null,"","",null,"","",null,"",""]
["628_1","coal",259,null,628,"Crystal River Power Plant","FL","CryR_Cfg_1","1","Conventional Boiler","Tangential firing",400,3837,9.5924999999999994,"bituminous","bituminous",3.7638274636635838E-9,null,null,3.3699999999999999E-6,3.2326724999999998E-5,null,null,null,3.3699999999999999E-6,3.2326724999999998E-5,"PM control","Electrostatic precipitator, cold side, w/o flue gas conditioning","1979-01-01","","",null,"","",null,"","",null,"","",null,"","",null,"","",null,"","",null,"","",null,"","",null,"","",null,"",""]
["10075_2","coal",260,null,10075,"Taconite Harbor Energy Center","MN","THEC2","2","Conventional Boiler","Tangential firing",79.2,913,11.527777777777777,"bituminous","bituminous",6.8171764727256081E-6,2.8658244823811291E-6,3.3036587783004682E-5,null,null,null,null,null,2.8658244823811291E-6,3.3036587783004682E-5,"NOx control","","2007-01-01","Other control","Dry sorbent injection","2007-01-01","PM control","Electrostatic precipitator, cold side, unspecified","2007-01-01","","",null,"","",null,"","",null,"","",null,"","",null,"","",null,"","",null,"","",null,"",""]
["3138_5","coal",261,null,3138,"New Castle Plant","PA","NC5-2","5","Conventional Boiler","Wall firing - front firing",143.30000000000001,1441,10.055826936496858,"coal - bituminous","bituminous",null,null,null,null,null,null,3.3775000000000003E-6,3.3963555478018143E-5,3.3775000000000003E-6,3.3963555478018143E-5,"NOx control","Selective Noncatalytic Reduction","2005-04-01","PM control","Electrostatic precipitator, cold side, w/o flue gas conditioning","1978-01-01","","",null,"","",null,"","",null,"","",null,"","",null,"","",null,"","",null,"","",null,"","",null,"",""]
["2277_1","coal",262,null,2277,"Sheldon Station","NE","U1","1","Conventional Boiler","Cyclone firing",128,1374,10.734375,"subbituminous","subbituminous",5.2976245398116677E-6,3.173435164018487E-6,3.4064843088760946E-5,null,null,null,null,null,3.173435164018487E-6,3.4064843088760946E-5,"PM control","Fabric Filter, pulse","1999-12-01","","",null,"","",null,"","",null,"","",null,"","",null,"","",null,"","",null,"","",null,"","",null,"","",null,"",""]
["1217_1","coal",263,null,1217,"Earl F Wisdom","IA","1","1","Conventional Boiler","Wall firing - front firing",40,477,11.925000000000001,"coal - bituminous","bituminous",null,null,null,null,null,null,2.8759300536660698E-6,3.4295465889967883E-5,2.8759300536660698E-6,3.4295465889967883E-5,"PM control","Multiple cyclone","1960-04-01","PM control","Electrostatic precipitator, cold side, w/o flue gas conditioning","1975-07-01","","",null,"","",null,"","",null,"","",null,"","",null,"","",null,"","",null,"","",null,"","",null,"",""]
["990_60","coal",264,null,990,"Harding Street","IN","60s","60","Conventional Boiler","Tangential firing",112,1017,9.0803571428571423,"bituminous","bituminous",4.8556621490249974E-6,null,null,3.8033744110999998E-6,3.4535998000791959E-5,null,null,null,3.8033744110999998E-6,3.4535998000791959E-5,"NOx control","Selective Noncatalytic Reduction","2004-12-01","PM control","Electrostatic precipitator, cold side, w/o flue gas conditioning","1975-12-01","","",null,"","",null,"","",null,"","",null,"","",null,"","",null,"","",null,"","",null,"","",null,"",""]
["7097_BLR1","coal",265,null,7097,"J K Spruce","TX","1","BLR1","Conventional Boiler","Tangential firing",580,6361,10.967241379310344,"bituminous","bituminous",5.6538461538461537E-6,null,null,3.1733333333333336E-6,3.4802712643678162E-5,null,3.9999999999999998E-6,4.3868965517241375E-5,3.1733333333333336E-6,3.4802712643678162E-5,"PM control","Fabric Filter, reverse air","1992-07-01","SO2 control","Wet FGD - Spray Type","1992-12-01","","",null,"","",null,"","",null,"","",null,"","",null,"","",null,"","",null,"","",null,"","",null,"",""]
["997_12","coal",266,null,997,"Michigan City","IN","12","12","Conventional Boiler","Cyclone firing",495,4650,9.3939393939393945,"subbituminous","subbituminous",3.7625121611649414E-6,null,null,3.7366666666666663E-6,3.5102020202020202E-5,null,null,null,3.7366666666666663E-6,3.5102020202020202E-5,"NOx control","Selective Catalytic Reduction","2003-05-01","PM control","Electrostatic precipitator, cold side, w/o flue gas conditioning","1992-05-01","","",null,"","",null,"","",null,"","",null,"","",null,"","",null,"","",null,"","",null,"","",null,"",""]
["6002_4","coal",267,null,6002,"James H. Miller Jr.","AL","Unit 4","4","Conventional Boiler","Wall firing - front firing",723,6976.5291176000001,9.649417866666667,"subbituminous","subbituminous",3.6934134545107934E-6,null,null,3.67E-6,3.541336357066667E-5,null,3.8117666171220663E-6,3.6781328898821229E-5,3.67E-6,3.541336357066667E-5,"NOx control","Selective Catalytic Reduction","2003-03-01","PM control","Electrostatic precipitator, cold side, w/o flue gas conditioning","1991-03-01","SO2 control","Wet FGD - Spray Type",null,"","",null,"","",null,"","",null,"","",null,"","",null,"","",null,"","",null,"","",null,"",""]
["886_19","coal",268,null,886,"Fisk","IL","FISK19 CONFIG","19","Conventional Boiler","Tangential firing",348,3584.0439999999999,10.298977011494253,"coal - subbituminous","subbituminous",null,null,null,null,null,null,3.4404711549300173E-6,3.5433333333333332E-5,3.4404711549300173E-6,3.5433333333333332E-5,"Other control","Activated carbon injection","2008-07-01","PM control","Electrostatic precipitator, cold side, w/o flue gas conditioning","1959-03-01","","",null,"","",null,"","",null,"","",null,"","",null,"","",null,"","",null,"","",null,"","",null,"",""]
["1073_4","coal",269,null,1073,"Prairie Creek","IA","Unit 4","4","Conventional Boiler","Wall firing - front firing",148.30000000000001,1611,10.863115306810519,"subbituminous","subbituminous",null,null,null,null,null,null,3.3000000000000002E-6,3.5848280512474712E-5,3.3000000000000002E-6,3.5848280512474712E-5,"PM control","Electrostatic precipitator, cold side, w/ flue gas conditioning","1974-06-01","","",null,"","",null,"","",null,"","",null,"","",null,"","",null,"","",null,"","",null,"","",null,"","",null,"",""]
["2848_H-4","coal",270,null,2848,"O H Hutchings","OH","H-4","H-4","Conventional Boiler","Tangential firing",64,696,10.875,"coal - bituminous","bituminous",null,null,null,null,null,null,3.3000000000000002E-6,3.5887500000000005E-5,3.3000000000000002E-6,3.5887500000000005E-5,"PM control","Electrostatic precipitator, hot side, w/o flue gas conditioning","1973-01-01","","",null,"","",null,"","",null,"","",null,"","",null,"","",null,"","",null,"","",null,"","",null,"","",null,"",""]
["1218_2","coal",271,null,1218,"Fair Station","IA","U2","2","Conventional Boiler","Wall firing - front firing",44,465,10.568181818181818,"bituminous","bituminous",6.338401503611835E-6,null,null,5.4700000000000001E-6,5.7807954545454551E-5,null,3.4000000000000001E-6,3.593181818181818E-5,3.4000000000000001E-6,3.593181818181818E-5,"Other control","Other (specify): Flue gas conditioning for opacity control","2006-04-01","PM control","Electrostatic precipitator, cold side, w/ flue gas conditioning","1974-10-01","","",null,"","",null,"","",null,"","",null,"","",null,"","",null,"","",null,"","",null,"","",null,"",""]
["2824_10","coal",272,null,2824,"Stanton","ND","u10","10","Conventional Boiler","Tangential firing",60,642,10.7,"coal - subbituminous","subbituminous",null,null,null,null,null,null,3.3599333037493146E-6,3.5951286350117665E-5,3.3599333037493146E-6,3.5951286350117665E-5,"SO2 control","Dry FGD - Spray Dryer","2000-01-01","PM control","Fabric Filter, reverse air","2000-01-01","","",null,"","",null,"","",null,"","",null,"","",null,"","",null,"","",null,"","",null,"","",null,"",""]
["1363_4","coal",273,null,1363,"Cane Run","KY","CR4","4","Conventional Boiler","Wall firing - front firing",168,2310,13.75,"bituminous","bituminous",6.8006906682690621E-6,2.6250063194587077E-6,3.6093836892557229E-5,null,null,null,null,null,2.6250063194587077E-6,3.6093836892557229E-5,"PM control","Electrostatic precipitator, cold side, w/o flue gas conditioning","1963-06-01","SO2 control","Wet FGD - Spray Type","1976-12-01","","",null,"","",null,"","",null,"","",null,"","",null,"","",null,"","",null,"","",null,"","",null,"",""]
["1077_2","coal",274,null,1077,"Sutherland","IA","Unit 2","2","Conventional Boiler","Wall firing - front firing",30.9,375.6,12.155339805825244,"coal - subbituminous","subbituminous",null,null,null,null,null,null,2.9799999999999998E-6,3.6222912621359228E-5,2.9799999999999998E-6,3.6222912621359228E-5,"PM control","Electrostatic precipitator, cold side, w/o flue gas conditioning","1976-11-01","","",null,"","",null,"","",null,"","",null,"","",null,"","",null,"","",null,"","",null,"","",null,"","",null,"",""]
["1077_1","coal",275,null,1077,"Sutherland","IA","Unit 1","1","Conventional Boiler","Wall firing - front firing",31,401.5,12.951612903225806,"coal - subbituminous","subbituminous",null,null,null,null,null,null,2.83E-6,3.6653064516129028E-5,2.83E-6,3.6653064516129028E-5,"PM control","Electrostatic precipitator, cold side, w/o flue gas conditioning","1976-11-01","","",null,"","",null,"","",null,"","",null,"","",null,"","",null,"","",null,"","",null,"","",null,"","",null,"",""]
["991_6","coal",276,null,991,"Eagle Valley","IN","6","6","Conventional Boiler","Tangential firing",105,1017,9.6857142857142851,"bituminous","bituminous",8.1363928351721485E-6,null,null,3.8124783944333337E-6,3.6926576448939999E-5,null,4.1300000000000003E-6,4.0002000000000001E-5,3.8124783944333337E-6,3.6926576448939999E-5,"PM control","Electrostatic precipitator, cold side, w/o flue gas conditioning","1971-12-01","","",null,"","",null,"","",null,"","",null,"","",null,"","",null,"","",null,"","",null,"","",null,"","",null,"",""]
["8066_BW74","coal",277,null,8066,"Jim Bridger Plant Units 1-4","WY","JB4","BW74","Conventional Boiler","Tangential firing",560,5239.8999999999996,9.3569642857142856,"coal - subbituminous","subbituminous",null,null,null,null,null,null,3.96601237145584E-6,3.7109836116413315E-5,3.96601237145584E-6,3.7109836116413315E-5,"PM control","Electrostatic precipitator, cold side, w/ flue gas conditioning","1979-12-01","SO2 control","Wet FGD - Tray Type","1979-12-01","","",null,"","",null,"","",null,"","",null,"","",null,"","",null,"","",null,"","",null,"","",null,"",""]
["3113_2","coal",278,null,3113,"Portland","PA","POR-2","2","Conventional Boiler","Tangential firing",255,2542,9.9686274509803923,"coal - bituminous","bituminous",null,null,null,null,null,null,3.8283333333333328E-6,3.8163228758169932E-5,3.8283333333333328E-6,3.8163228758169932E-5,"PM control","Electrostatic precipitator, cold side, w/o flue gas conditioning","1987-05-01","","",null,"","",null,"","",null,"","",null,"","",null,"","",null,"","",null,"","",null,"","",null,"","",null,"",""]
["2848_H-1","coal",279,null,2848,"O H Hutchings","OH","H-1","H-1","Conventional Boiler","Tangential firing",53,607,11.452830188679245,"coal - bituminous","bituminous",null,null,null,null,null,null,3.3466666666666667E-6,3.8328805031446544E-5,3.3466666666666667E-6,3.8328805031446544E-5,"PM control","Electrostatic precipitator, hot side, w/o flue gas conditioning","1973-01-01","","",null,"","",null,"","",null,"","",null,"","",null,"","",null,"","",null,"","",null,"","",null,"","",null,"",""]
["990_50","coal",280,null,990,"Harding Street","IN","50s","50","Conventional Boiler","Tangential firing",112,1017,9.0803571428571423,"coal - bituminous","bituminous",null,null,null,null,null,null,4.2216666666666672E-6,3.8334241071428576E-5,4.2216666666666672E-6,3.8334241071428576E-5,"NOx control","Selective Noncatalytic Reduction","2004-12-01","PM control","Electrostatic precipitator, cold side, w/o flue gas conditioning","1968-12-01","","",null,"","",null,"","",null,"","",null,"","",null,"","",null,"","",null,"","",null,"","",null,"",""]
["2716_1","coal",281,null,2716,"W.H. Weatherspoon Plant","NC","Wea_Cfg_1","1","Conventional Boiler","Wall firing - front firing",53,472,8.9056603773584904,"bituminous","bituminous",4.3478933907724105E-6,null,null,4.3333333333333339E-6,3.8591194968553465E-5,null,null,null,4.3333333333333339E-6,3.8591194968553465E-5,"PM control","Electrostatic precipitator, cold side, w/o flue gas conditioning","1975-06-01","PM control","Electrostatic precipitator, cold side, w/o flue gas conditioning","1975-04-01","","",null,"","",null,"","",null,"","",null,"","",null,"","",null,"","",null,"","",null,"","",null,"",""]
["2716_2","coal",282,null,2716,"W.H. Weatherspoon Plant","NC","Wea_Cfg_1","2","Conventional Boiler","Wall firing - front firing",53,472,8.9056603773584904,"bituminous","bituminous",4.3478933907724105E-6,null,null,4.3333333333333339E-6,3.8591194968553465E-5,null,null,null,4.3333333333333339E-6,3.8591194968553465E-5,"PM control","Electrostatic precipitator, cold side, w/o flue gas conditioning","1975-06-01","PM control","Electrostatic precipitator, cold side, w/o flue gas conditioning","1975-04-01","","",null,"","",null,"","",null,"","",null,"","",null,"","",null,"","",null,"","",null,"","",null,"",""]
["1831_EUBoiler1","coal",283,null,1831,"Otto E. Eckert Station","MI","001","EUBoiler1","Conventional Boiler","Wall firing - front firing",40,509,12.725,"","Bituminous, Subbituminous",null,null,null,null,null,null,3.0599999999999999E-6,3.89385E-5,3.0599999999999999E-6,3.89385E-5,"PM control","Electrostatic precipitator, unspecified","1978-01-01","","",null,"","",null,"","",null,"","",null,"","",null,"","",null,"","",null,"","",null,"","",null,"","",null,"",""]
["1252_9","coal",284,null,1252,"Tecumseh Energy Center","KS","9","9","Conventional Boiler","Tangential firing",82,846,10.317073170731707,"subbituminous","subbituminous",null,null,null,null,null,null,3.787320749083932E-6,3.9074065289329348E-5,3.787320749083932E-6,3.9074065289329348E-5,"PM control","Electrostatic precipitator, cold side, w/o flue gas conditioning","1977-08-01","","",null,"","",null,"","",null,"","",null,"","",null,"","",null,"","",null,"","",null,"","",null,"","",null,"",""]
["6249_2","coal",285,null,6249,"Winyah","SC","W2","2","Conventional Boiler","Wall firing - opposed firing",305,2908,9.5344262295081972,"bituminous","bituminous",null,null,null,null,null,null,4.131065537396696E-6,3.9387339615572434E-5,4.131065537396696E-6,3.9387339615572434E-5,"NOx control","Selective Catalytic Reduction","2004-05-01","PM control","Electrostatic precipitator, cold side, w/o flue gas conditioning","1977-07-01","SO2 control","Wet FGD - Spray Type","2007-05-01","","",null,"","",null,"","",null,"","",null,"","",null,"","",null,"","",null,"","",null,"",""]
["1167_8","coal",286,null,1167,"Muscatine #1","IA","8","8","Conventional Boiler","Cyclone firing",75,823,10.973333333333333,"subbituminous","subbituminous",5.8484205561908749E-6,3.6005887799150009E-6,3.9510460878267271E-5,null,null,null,null,null,3.6005887799150009E-6,3.9510460878267271E-5,"PM control","Electrostatic precipitator, cold side, w/o flue gas conditioning","1999-03-01","","",null,"","",null,"","",null,"","",null,"","",null,"","",null,"","",null,"","",null,"","",null,"","",null,"",""]
["856_2","coal",287,null,856,"ED Edwards","IL","002","2","Conventional Boiler","Wall firing - unspecified",278,3321,11.946043165467627,"","Bituminous, Subbituminous",null,null,null,null,null,null,3.3799999999999998E-6,4.0377625899280575E-5,3.3799999999999998E-6,4.0377625899280575E-5,"PM control","Electrostatic precipitator, cold side, unspecified","2003-01-01","Other control","Activated carbon injection",null,"Other control","Other (specify): Flue Gas Conditioning",null,"","",null,"","",null,"","",null,"","",null,"","",null,"","",null,"","",null,"","",null,"",""]
["1058_4","coal",288,null,1058,"Sixth Street","IA","Unit 4","4","Conventional Boiler","Wall firing - front firing",14.8,304,20.54054054054054,"coal - subbituminous","natural gas, subbituminous",null,null,null,null,null,null,1.9806999999999999E-6,4.0684648648648647E-5,1.9806999999999999E-6,4.0684648648648647E-5,"PM control","Electrostatic precipitator, cold side, w/o flue gas conditioning","1969-08-01","","",null,"","",null,"","",null,"","",null,"","",null,"","",null,"","",null,"","",null,"","",null,"","",null,"",""]
["1252_10","coal",289,null,1252,"Tecumseh Energy Center","KS","10","10","Conventional Boiler","Tangential firing",145,1423,9.8137931034482762,"coal - subbituminous","subbituminous",null,null,null,null,null,null,4.1946281813437354E-6,4.1165213117600935E-5,4.1946281813437354E-6,4.1165213117600935E-5,"PM control","Electrostatic precipitator, cold side, w/o flue gas conditioning","1977-08-01","","",null,"","",null,"","",null,"","",null,"","",null,"","",null,"","",null,"","",null,"","",null,"","",null,"",""]
["3845_BD21","coal",290,null,3845,"TransAlta Centralia Generation","WA","BW21CONFIG","BD21","Conventional Boiler","Tangential firing",603,7743,12.840796019900498,"subbituminous","subbituminous",6.7178823837886722E-6,null,null,null,null,3.2483333333333329E-6,null,null,3.2483333333333329E-6,4.1711185737976778E-5,"PM control","Electrostatic precipitator, hot side, w/o flue gas conditioning","1972-01-01","SO2 control","Wet FGD - Spray Type","2002-06-01","","",null,"","",null,"","",null,"","",null,"","",null,"","",null,"","",null,"","",null,"","",null,"",""]
["856_1","coal",291,null,856,"ED Edwards","IL","001","1","Conventional Boiler","Wall firing - unspecified",123,1523,12.382113821138212,"","Bituminous, Subbituminous",null,null,null,null,null,null,3.3799999999999998E-6,4.1851544715447156E-5,3.3799999999999998E-6,4.1851544715447156E-5,"PM control","Electrostatic precipitator, cold side, unspecified","2003-01-01","Other control","Activated carbon injection",null,"Other control","Other (specify): Flue Gas Conditioning",null,"","",null,"","",null,"","",null,"","",null,"","",null,"","",null,"","",null,"","",null,"",""]
["10849_BLR1","coal",292,null,10849,"Silver Bay Power","MN","GEN1","BLR1","Conventional Boiler","Wall firing - front firing",45,371.91187187999998,8.2647082639999994,"subbituminous","subbituminous",6.0213675213675207E-6,5.0955396376465634E-6,4.2113148552797113E-5,null,null,null,null,null,5.0955396376465634E-6,4.2113148552797113E-5,"PM control","Fabric Filter, reverse air","1980-01-01","","",null,"","",null,"","",null,"","",null,"","",null,"","",null,"","",null,"","",null,"","",null,"","",null,"",""]
["879_51","coal",293,null,879,"Powerton","IL","Pow5CONFIG","51","Conventional Boiler","Cyclone firing",405,4107.6135000000004,10.142255555555556,"coal - subbituminous","subbituminous",null,null,null,null,null,null,4.2271882376674412E-6,4.2166666666666671E-5,4.2271882376674412E-6,4.2166666666666671E-5,"Other control","Activated carbon injection","2009-07-01","Other control","Activated carbon injection","2009-07-01","PM control","Electrostatic precipitator, cold side, w/o flue gas conditioning","1973-07-01","PM control","Electrostatic precipitator, cold side, w/o flue gas conditioning","1973-07-01","","",null,"","",null,"","",null,"","",null,"","",null,"","",null,"","",null,"",""]
["879_52","coal",294,null,879,"Powerton","IL","Pow5CONFIG","52","Conventional Boiler","Cyclone firing",405,3972.2254093849997,9.8079639737901232,"coal - subbituminous","subbituminous",null,null,null,null,null,null,4.2271882376674412E-6,4.2166666666666671E-5,4.2271882376674412E-6,4.2166666666666671E-5,"Other control","Activated carbon injection","2009-07-01","Other control","Activated carbon injection","2009-07-01","PM control","Electrostatic precipitator, cold side, w/o flue gas conditioning","1973-07-01","PM control","Electrostatic precipitator, cold side, w/o flue gas conditioning","1973-07-01","","",null,"","",null,"","",null,"","",null,"","",null,"","",null,"","",null,"",""]
["879_61","coal",295,null,879,"Powerton","IL","Pow6CONFIG","61","Conventional Boiler","Cyclone firing",406,4086.0815000000002,10.064240147783252,"coal - subbituminous","subbituminous",null,null,null,null,null,null,4.2489487827097961E-6,4.2166666666666671E-5,4.2489487827097961E-6,4.2166666666666671E-5,"Other control","Activated carbon injection","2009-07-01","Other control","Activated carbon injection","2009-07-01","PM control","Electrostatic precipitator, cold side, w/o flue gas conditioning","1976-09-01","PM control","Electrostatic precipitator, cold side, w/o flue gas conditioning","1976-09-01","","",null,"","",null,"","",null,"","",null,"","",null,"","",null,"","",null,"",""]
["879_62","coal",296,null,879,"Powerton","IL","Pow6CONFIG","62","Conventional Boiler","Cyclone firing",406,3972.2254093849997,9.7838064270566498,"coal - subbituminous","subbituminous",null,null,null,null,null,null,4.2489487827097961E-6,4.2166666666666671E-5,4.2489487827097961E-6,4.2166666666666671E-5,"Other control","Activated carbon injection","2009-07-01","Other control","Activated carbon injection","2009-07-01","PM control","Electrostatic precipitator, cold side, w/o flue gas conditioning","1976-09-01","PM control","Electrostatic precipitator, cold side, w/o flue gas conditioning","1976-09-01","","",null,"","",null,"","",null,"","",null,"","",null,"","",null,"","",null,"",""]
["3982_5","coal",297,null,3982,"Bay Front","WI","5","5","Conventional Boiler","Cyclone firing",32,389,12.15625,"coal - subbituminous","natural gas, subbituminous",null,null,null,null,null,null,3.5720000000000003E-6,4.3422125000000001E-5,3.5720000000000003E-6,4.3422125000000001E-5,"PM control","Multiple cyclone","1976-08-01","","",null,"","",null,"","",null,"","",null,"","",null,"","",null,"","",null,"","",null,"","",null,"","",null,"",""]
["2836_10","coal",298,null,2836,"Avon Lake","OH","AL10","10","Conventional Boiler","Tangential firing",101,1447,14.326732673267326,"coal - bituminous","bituminous",null,null,null,null,null,null,3.0345125578111006E-6,4.34746502094323E-5,3.0345125578111006E-6,4.34746502094323E-5,"PM control","Electrostatic precipitator, cold side, w/o flue gas conditioning","1978-01-01","","",null,"","",null,"","",null,"","",null,"","",null,"","",null,"","",null,"","",null,"","",null,"","",null,"",""]
["1046_5","coal",299,null,1046,"Dubuque","IA","Unit 5","5","Conventional Boiler","Wall firing - front firing",29.2,337.3,11.551369863013699,"coal - subbituminous","subbituminous",null,null,null,null,null,null,3.8E-6,4.3895205479452056E-5,3.8E-6,4.3895205479452056E-5,"PM control","Electrostatic precipitator, cold side, w/o flue gas conditioning","1974-08-01","","",null,"","",null,"","",null,"","",null,"","",null,"","",null,"","",null,"","",null,"","",null,"","",null,"",""]
["1122_Boiler 8","coal",300,null,1122,"Ames Electric Services Power Plant","IA","008","Boiler 8","Conventional Boiler","Wall firing - unspecified",72.7,672,9.2434662998624475,"","Subbituminous",null,null,null,null,null,null,4.78E-6,4.4183768913342496E-5,4.78E-6,4.4183768913342496E-5,"PM control","Electrostatic precipitator, hot side, unspecified","1982-02-01","","",null,"","",null,"","",null,"","",null,"","",null,"","",null,"","",null,"","",null,"","",null,"","",null,"",""]
["3845_BD22","coal",301,null,3845,"TransAlta Centralia Generation","WA","BW22CONFIG","BD22","Conventional Boiler","Tangential firing",567,7743,13.656084656084657,"subbituminous","subbituminous",6.0665201140786794E-6,null,null,null,null,3.2596551724137933E-6,null,null,3.2596551724137933E-6,4.4514126984126991E-5,"PM control","Electrostatic precipitator, hot side, w/o flue gas conditioning","1971-12-01","SO2 control","Wet FGD - Spray Type","2001-10-01","","",null,"","",null,"","",null,"","",null,"","",null,"","",null,"","",null,"","",null,"","",null,"",""]
["1082_3","coal",302,null,1082,"Walter Scott Jr. Energy Center","IA","3","3","Conventional Boiler","Wall firing - unspecified",765,7700,10.065359477124183,"","Subbituminous",null,null,null,null,null,null,4.4599999999999996E-6,4.4891503267973852E-5,4.4599999999999996E-6,4.4891503267973852E-5,"SO2 control","Dry FGD - Circulating Dry Scrubber","2009-05-01","PM control","Fabric Filter, pulse","2009-05-01","","",null,"","",null,"","",null,"","",null,"","",null,"","",null,"","",null,"","",null,"","",null,"",""]
["991_5","coal",303,null,991,"Eagle Valley","IN","5","5","Conventional Boiler","Tangential firing",66,741,11.227272727272727,"coal - bituminous","bituminous",null,null,null,null,null,null,4.1300000000000003E-6,4.6368636363636361E-5,4.1300000000000003E-6,4.6368636363636361E-5,"PM control","Electrostatic precipitator, cold side, w/ flue gas conditioning","1972-12-01","","",null,"","",null,"","",null,"","",null,"","",null,"","",null,"","",null,"","",null,"","",null,"","",null,"",""]
["3115_2","coal",304,null,3115,"Titus","PA","TI-2","2","Conventional Boiler","Tangential firing",86.2,900,10.440835266821345,"coal - bituminous","bituminous",null,null,null,null,null,null,4.5000000000000001E-6,4.6983758700696053E-5,4.5000000000000001E-6,4.6983758700696053E-5,"PM control","Electrostatic precipitator, cold side, w/o flue gas conditioning","1975-02-01","","",null,"","",null,"","",null,"","",null,"","",null,"","",null,"","",null,"","",null,"","",null,"","",null,"",""]
["1250_5","coal",305,null,1250,"Lawrence Energy Center","KS","5","5","Conventional Boiler","Tangential firing",396,3848,9.717171717171718,"coal - subbituminous","subbituminous",null,null,null,null,null,null,4.8655759528058134E-6,4.7279637036355482E-5,4.8655759528058134E-6,4.7279637036355482E-5,"PM control","PM scrubber - Venturi","1977-06-01","SO2 control","Wet FGD - Spray Type","1977-06-01","","",null,"","",null,"","",null,"","",null,"","",null,"","",null,"","",null,"","",null,"","",null,"",""]
["991_3","coal",306,null,991,"Eagle Valley","IN","3","3","Conventional Boiler","Tangential firing",46,524,11.391304347826088,"coal - bituminous","bituminous",null,null,null,null,null,null,4.1999999999999996E-6,4.7843478260869563E-5,4.1999999999999996E-6,4.7843478260869563E-5,"PM control","Electrostatic precipitator, cold side, w/ flue gas conditioning","1975-12-01","","",null,"","",null,"","",null,"","",null,"","",null,"","",null,"","",null,"","",null,"","",null,"","",null,"",""]
["4041_6","coal",307,null,4041,"South Oak Creek","WI","OCPP-B6","6","Conventional Boiler","Wall firing - front firing",278,2516,9.0503597122302164,"","subbituminous",null,null,null,null,null,null,5.2892666666666669E-6,4.7869765947242215E-5,5.2892666666666669E-6,4.7869765947242215E-5,"PM control","Electrostatic precipitator, cold side, w/o flue gas conditioning","1972-04-01","","",null,"","",null,"","",null,"","",null,"","",null,"","",null,"","",null,"","",null,"","",null,"","",null,"",""]
["1250_4","coal",308,null,1250,"Lawrence Energy Center","KS","4","4","Conventional Boiler","Tangential firing",126,1276,10.126984126984127,"coal - subbituminous","subbituminous",null,null,null,null,null,null,4.7860316735648537E-6,4.8468066789434549E-5,4.7860316735648537E-6,4.8468066789434549E-5,"PM control","PM scrubber - Venturi","1976-01-01","PM control","PM scrubber - Venturi","1976-01-01","SO2 control","Wet FGD - Spray Type","1976-01-01","SO2 control","Wet FGD - Spray Type","1976-01-01","","",null,"","",null,"","",null,"","",null,"","",null,"","",null,"","",null,"",""]
["6139_1","coal",309,null,6139,"Welsh","TX","WE-1","1","Conventional Boiler","Wall firing - opposed firing",558,5156,9.2401433691756267,"subbituminous","subbituminous",7.1332149817134793E-6,null,null,5.2533333333333336E-6,4.8541553166069294E-5,null,null,null,5.2533333333333336E-6,4.8541553166069294E-5,"PM control","Electrostatic precipitator, hot side, w/o flue gas conditioning","1977-03-01","","",null,"","",null,"","",null,"","",null,"","",null,"","",null,"","",null,"","",null,"","",null,"","",null,"",""]
["1295_2","coal",310,null,1295,"Quindaro","KS","Unit 2","2","Conventional Boiler","Wall firing - front firing",119.8,1394,11.636060100166945,"bituminous","bituminous",1.0853458521026334E-5,null,null,4.2733333333333328E-6,4.9724763494713409E-5,null,null,null,4.2733333333333328E-6,4.9724763494713409E-5,"PM control","Electrostatic precipitator, cold side, w/o flue gas conditioning","1986-05-01","","",null,"","",null,"","",null,"","",null,"","",null,"","",null,"","",null,"","",null,"","",null,"","",null,"",""]
["55479_3","coal",311,null,55479,"Wygen 1","WY","WYG1Cfg","3","Conventional Boiler","Wall firing - front firing",91,1053,11.571428571428571,"subbituminous","subbituminous",6.4818763326226012E-6,null,null,4.3200000000000001E-6,4.9988571428571429E-5,6.7466666666666667E-6,null,null,4.3200000000000001E-6,4.9988571428571429E-5,"NOx control","Selective Catalytic Reduction","2003-04-01","SO2 control","Dry FGD - Spray Dryer","2003-04-01","PM control","Fabric Filter, pulse","2003-04-01","","",null,"","",null,"","",null,"","",null,"","",null,"","",null,"","",null,"","",null,"",""]
["8066_BW71","coal",312,null,8066,"Jim Bridger Plant Units 1-4","WY","JB1","BW71","Conventional Boiler","Tangential firing",566,5460.2,9.6469964664310943,"coal - subbituminous","subbituminous",null,null,null,null,null,null,5.3046904211604527E-6,5.1174329748445761E-5,5.3046904211604527E-6,5.1174329748445761E-5,"PM control","Electrostatic precipitator, cold side, w/ flue gas conditioning","1974-11-01","SO2 control","Wet FGD - Tray Type","1990-09-01","","",null,"","",null,"","",null,"","",null,"","",null,"","",null,"","",null,"","",null,"","",null,"",""]
["6761_101","coal",313,null,6761,"Rawhide","CO","Rawhide101","101","Conventional Boiler","Tangential firing",305,2800,9.1803278688524586,"subbituminous","subbituminous",6.0943386392165197E-6,null,null,5.6333333333333325E-6,5.1715846994535512E-5,null,null,null,5.6333333333333325E-6,5.1715846994535512E-5,"SO2 control","Dry FGD - Spray Dryer","1984-04-01","PM control","Fabric Filter, reverse air","1984-04-01","","",null,"","",null,"","",null,"","",null,"","",null,"","",null,"","",null,"","",null,"","",null,"",""]
["1831_EUBoiler4","coal",314,null,1831,"Otto E. Eckert Station","MI","004","EUBoiler4","Conventional Boiler","Wall firing - front firing",72,807,11.208333333333334,"","Bituminous, Subbituminous",null,null,null,null,null,null,4.6199999999999998E-6,5.1782500000000001E-5,4.6199999999999998E-6,5.1782500000000001E-5,"PM control","Electrostatic precipitator, unspecified","1976-01-01","","",null,"","",null,"","",null,"","",null,"","",null,"","",null,"","",null,"","",null,"","",null,"","",null,"",""]
["991_4","coal",315,null,991,"Eagle Valley","IN","4","4","Conventional Boiler","Tangential firing",60,741,12.35,"coal - bituminous","bituminous",null,null,null,null,null,null,4.1999999999999996E-6,5.1869999999999996E-5,4.1999999999999996E-6,5.1869999999999996E-5,"PM control","Electrostatic precipitator, cold side, w/ flue gas conditioning","1973-12-01","","",null,"","",null,"","",null,"","",null,"","",null,"","",null,"","",null,"","",null,"","",null,"","",null,"",""]
["1048_2","coal",316,null,1048,"ML Kapp","IA","Unit 2","2","Conventional Boiler","Tangential firing",229,2332,10.183406113537117,"coal - subbituminous","subbituminous",null,null,null,null,null,null,5.1749999999999996E-6,5.269912663755458E-5,5.1749999999999996E-6,5.269912663755458E-5,"PM control","Electrostatic precipitator, cold side, w/ flue gas conditioning","1979-07-01","","",null,"","",null,"","",null,"","",null,"","",null,"","",null,"","",null,"","",null,"","",null,"","",null,"",""]
["1047_4","coal",317,null,1047,"Lansing","IA","Unit 4","4","Conventional Boiler","Turbo",264.2,2626,9.939439818319455,"coal - subbituminous","subbituminous",null,null,null,null,null,null,5.524E-6,5.4905465556396667E-5,5.524E-6,5.4905465556396667E-5,"PM control","Electrostatic precipitator, hot side, w/o flue gas conditioning","1977-04-01","","",null,"","",null,"","",null,"","",null,"","",null,"","",null,"","",null,"","",null,"","",null,"","",null,"",""]
["3319_4","coal",318,null,3319,"Jefferies","SC","J4","4","Conventional Boiler","Wall firing - front firing",162,1602,9.8888888888888893,"coal - bituminous","bituminous",null,null,null,null,null,null,5.5619651997282806E-6,5.5001655863979667E-5,5.5619651997282806E-6,5.5001655863979667E-5,"PM control","Electrostatic precipitator, cold side, w/o flue gas conditioning","1977-04-01","PM control","Electrostatic precipitator, cold side, w/o flue gas conditioning","1970-07-01","","",null,"","",null,"","",null,"","",null,"","",null,"","",null,"","",null,"","",null,"","",null,"",""]
["883_7","coal",319,null,883,"Waukegan","IL","WK7CONFIG","7","Conventional Boiler","Tangential firing",345,3483.0320000000002,10.095744927536233,"coal - subbituminous","subbituminous",null,null,null,null,null,null,5.5072706768126152E-6,5.5599999999999996E-5,5.5072706768126152E-6,5.5599999999999996E-5,"Other control","Activated carbon injection","2008-07-01","PM control","Electrostatic precipitator, hot side, w/o flue gas conditioning","1958-06-01","","",null,"","",null,"","",null,"","",null,"","",null,"","",null,"","",null,"","",null,"","",null,"",""]
["3403_2","coal",320,null,3403,"Gallatin","TN","2","2","Conventional Boiler","Tangential firing",300,2750,9.1666666666666661,"subbituminous","subbituminous",6.5593358995328878E-6,null,null,6.1999999999999991E-6,5.6833333333333323E-5,null,null,null,6.1999999999999991E-6,5.6833333333333323E-5,"PM control","Electrostatic precipitator, cold side, w/o flue gas conditioning","1978-09-01","","",null,"","",null,"","",null,"","",null,"","",null,"","",null,"","",null,"","",null,"","",null,"","",null,"",""]
[{"$f":"E322&\"_\"&I322","v":"1010_6"},"coal",321,null,1010,"Wabash River","IN","6","6","Conventional Boiler","Tangential firing",342,3059.0605,8.9446213450292404,"bituminous","bituminous",6.7471310232283632E-6,null,null,6.3755750240333329E-6,5.7027104446803861E-5,null,null,null,6.3755750240333329E-6,5.7027104446803861E-5,"PM control","Electrostatic precipitator, cold side, w/o flue gas conditioning","1993-05-01","","",null,"","",null,"","",null,"","",null,"","",null,"","",null,"","",null,"","",null,"","",null,"","",null,"",""]
["3317_2","coal",322,null,3317,"Dolphus M Grainger","SC","G2","2","Conventional Boiler","Wall firing - front firing",87,972,11.172413793103448,"coal - bituminous","bituminous",null,null,null,null,null,null,5.1520152306924566E-6,5.7560446025667447E-5,5.1520152306924566E-6,5.7560446025667447E-5,"PM control","Electrostatic precipitator, cold side, w/o flue gas conditioning","1966-06-01","","",null,"","",null,"","",null,"","",null,"","",null,"","",null,"","",null,"","",null,"","",null,"","",null,"",""]
["10075_1","coal",323,null,10075,"Taconite Harbor Energy Center","MN","THEC1","1","Conventional Boiler","Tangential firing",83,847,10.204819277108435,"bituminous","bituminous",6.4428501024062686E-6,5.7177814904421793E-6,5.8348926775958146E-5,null,null,null,null,null,5.7177814904421793E-6,5.8348926775958146E-5,"NOx control","Selective Noncatalytic Reduction","2008-01-01","Other control","Dry sorbent injection","2008-01-01","PM control","Electrostatic precipitator, cold side, unspecified","2008-01-01","","",null,"","",null,"","",null,"","",null,"","",null,"","",null,"","",null,"","",null,"",""]
["6106_1SG","coal",324,null,6106,"Boardman","OR","1SG","1SG","Conventional Boiler","Wall firing - opposed firing",610,5650,9.2622950819672134,"coal - subbituminous","subbituminous",null,null,null,null,null,null,6.3433333333333333E-6,5.8753825136612023E-5,6.3433333333333333E-6,5.8753825136612023E-5,"PM control","Electrostatic precipitator, cold side, w/o flue gas conditioning","1980-08-01","","",null,"","",null,"","",null,"","",null,"","",null,"","",null,"","",null,"","",null,"","",null,"","",null,"",""]
["2079_5A","coal",325,null,2079,"Hawthorn","MO","5A","5A","Conventional Boiler","Wall firing - opposed firing",594,6600,11.111111111111111,"subbituminous,  bituminous","subbituminous,  bituminous",6.8513083975247647E-6,null,null,5.3000000000000001E-6,5.8888888888888889E-5,null,null,null,5.3000000000000001E-6,5.8888888888888889E-5,"NOx control","Selective Catalytic Reduction","2001-05-01","SO2 control","Dry FGD - Spray Dryer","2001-05-01","PM control","Fabric Filter, pulse","2001-05-01","","",null,"","",null,"","",null,"","",null,"","",null,"","",null,"","",null,"","",null,"",""]
["8066_BW72","coal",326,null,8066,"Jim Bridger Plant Units 1-4","WY","JB2","BW72","Conventional Boiler","Tangential firing",560,5569.1,9.94482142857143,"coal - subbituminous","subbituminous",null,null,null,null,null,null,5.9323446312977581E-6,5.8996108011000625E-5,5.9323446312977581E-6,5.8996108011000625E-5,"PM control","Electrostatic precipitator, cold side, w/ flue gas conditioning","1975-12-01","SO2 control","Wet FGD - Tray Type","1986-09-01","","",null,"","",null,"","",null,"","",null,"","",null,"","",null,"","",null,"","",null,"","",null,"",""]
["6068_3","coal",327,null,6068,"Jeffrey Energy Center","KS","3","3","Conventional Boiler","Tangential firing",783,7815,9.980842911877394,"coal - subbituminous","subbituminous",null,null,null,null,null,null,5.9310258546589497E-6,5.9196637361634343E-5,5.9310258546589497E-6,5.9196637361634343E-5,"PM control","Electrostatic precipitator, cold side, w/o flue gas conditioning","1983-05-01","SO2 control","Wet FGD - Spray Type","1983-05-01","","",null,"","",null,"","",null,"","",null,"","",null,"","",null,"","",null,"","",null,"","",null,"",""]
["6098_001","coal",328,null,6098,"Big Stone","SD","001","001","Conventional Boiler","Cyclone firing",495,5309,10.725252525252525,"subbituminous","subbituminous",5.2844572211884984E-6,5.5331091179039743E-6,5.9343992539297371E-5,null,null,null,null,null,5.5331091179039743E-6,5.9343992539297371E-5,"PM control","Fabric Filter, pulse","2007-12-01","","",null,"","",null,"","",null,"","",null,"","",null,"","",null,"","",null,"","",null,"","",null,"","",null,"",""]
["6077_1","coal",329,null,6077,"Gerald Gentleman","NE","U1","1","Conventional Boiler","Wall firing - opposed firing",715,7538,10.542657342657343,"bituminous","bituminous",6.6287312945050146E-6,null,null,5.7666666666666668E-6,6.0795990675990674E-5,null,null,null,5.7666666666666668E-6,6.0795990675990674E-5,"PM control","Fabric Filter, reverse air","2000-12-01","","",null,"","",null,"","",null,"","",null,"","",null,"","",null,"","",null,"","",null,"","",null,"","",null,"",""]
["6181_1","coal",330,null,6181,"J T Deely","TX","1","1","Conventional Boiler","Tangential firing",450,4251,9.4466666666666672,"subbituminous","subbituminous",8.6917726703532404E-6,6.4449388976603874E-6,6.0883189453231796E-5,null,null,null,8.6006666666666671E-6,8.1247631111111115E-5,6.4449388976603874E-6,6.0883189453231796E-5,"PM control","Fabric Filter, reverse air","2007-05-01","","",null,"","",null,"","",null,"","",null,"","",null,"","",null,"","",null,"","",null,"","",null,"","",null,"",""]
["6181_2","coal",331,null,6181,"J T Deely","TX","2","2","Conventional Boiler","Tangential firing",450,4251,9.4466666666666672,"subbituminous","subbituminous",8.6917726703532404E-6,6.4449388976603874E-6,6.0883189453231796E-5,null,null,null,8.6006666666666671E-6,8.1247631111111115E-5,6.4449388976603874E-6,6.0883189453231796E-5,"PM control","Fabric Filter, reverse air","2006-04-01","","",null,"","",null,"","",null,"","",null,"","",null,"","",null,"","",null,"","",null,"","",null,"","",null,"",""]
["6077_2","coal",332,null,6077,"Gerald Gentleman","NE","U2","2","Conventional Boiler","Wall firing - opposed firing",750,7538,10.050666666666666,"bituminous","bituminous",5.8060825979338645E-6,null,null,6.0633333333333334E-6,6.0940542222222223E-5,null,null,null,6.0633333333333334E-6,6.0940542222222223E-5,"PM control","Fabric Filter, reverse air","2001-05-01","","",null,"","",null,"","",null,"","",null,"","",null,"","",null,"","",null,"","",null,"","",null,"","",null,"",""]
["2828_3","coal",333,null,2828,"Cardinal","OH","CD-U3","3","Conventional Boiler","Wall firing - opposed firing",650,5275,8.115384615384615,"bituminous","bituminous",9.2957447803307647E-6,null,null,7.6487011217333335E-6,6.2072151410989742E-5,null,null,null,7.6487011217333335E-6,6.2072151410989742E-5,"PM control","Electrostatic precipitator, hot side, w/o flue gas conditioning","1977-09-01","NOx control","Selective Catalytic Reduction","2003-01-01","","",null,"","",null,"","",null,"","",null,"","",null,"","",null,"","",null,"","",null,"","",null,"",""]
["8066_BW73","coal",334,null,8066,"Jim Bridger Plant Units 1-4","WY","JB3","BW73","Conventional Boiler","Tangential firing",560,5459.4,9.7489285714285714,"coal - subbituminous","subbituminous",null,null,null,null,null,null,6.4123264244302823E-6,6.2513312288454796E-5,6.4123264244302823E-6,6.2513312288454796E-5,"PM control","Electrostatic precipitator, cold side, w/ flue gas conditioning","1976-09-01","SO2 control","Wet FGD - Tray Type","1988-09-01","","",null,"","",null,"","",null,"","",null,"","",null,"","",null,"","",null,"","",null,"","",null,"",""]
["3317_1","coal",335,null,3317,"Dolphus M Grainger","SC","G1","1","Conventional Boiler","Wall firing - front firing",87,940,10.804597701149426,"coal - bituminous","bituminous",null,null,null,null,null,null,5.8268303990045423E-6,6.2956558334072076E-5,5.8268303990045423E-6,6.2956558334072076E-5,"PM control","Electrostatic precipitator, cold side, w/o flue gas conditioning","1966-06-01","","",null,"","",null,"","",null,"","",null,"","",null,"","",null,"","",null,"","",null,"","",null,"","",null,"",""]
["1058_3","coal",336,null,1058,"Sixth Street","IA","Unit 3","3","Conventional Boiler","Wall firing - front firing",13.9,304,21.870503597122301,"coal - subbituminous","natural gas, subbituminous",null,null,null,null,null,null,2.8849999999999999E-6,6.309640287769783E-5,2.8849999999999999E-6,6.309640287769783E-5,"PM control","Electrostatic precipitator, cold side, w/o flue gas conditioning","1969-12-01","","",null,"","",null,"","",null,"","",null,"","",null,"","",null,"","",null,"","",null,"","",null,"","",null,"",""]
["1241_2","coal",337,null,1241,"La Cygne","KS","2","2","Conventional Boiler","Wall firing - opposed firing",685,7700,11.240875912408759,"subbituminous","subbituminous",6.0281184046105314E-6,null,null,5.9599999999999997E-6,6.6995620437956197E-5,null,5.6434E-6,6.3436759124087586E-5,5.6434E-6,6.3436759124087586E-5,"PM control","Electrostatic precipitator, cold side, w/o flue gas conditioning","1977-03-01","","",null,"","",null,"","",null,"","",null,"","",null,"","",null,"","",null,"","",null,"","",null,"","",null,"",""]
["6768_1","coal",338,null,6768,"Sikeston Power Station","MO","1","1","Conventional Boiler","Wall firing - opposed firing",233,2780,11.931330472103005,"coal - subbituminous","subbituminous",null,null,null,null,null,null,5.4040000000000003E-6,6.4476909871244643E-5,5.4040000000000003E-6,6.4476909871244643E-5,"PM control","Electrostatic precipitator, cold side, w/o flue gas conditioning","1981-09-01","","",null,"","",null,"","",null,"","",null,"","",null,"","",null,"","",null,"","",null,"","",null,"","",null,"",""]
["6248_1","coal",339,null,6248,"Pawnee","CO","Unit 1","1","Conventional Boiler","Wall firing - opposed firing",536,5346,9.9738805970149258,"coal - subbituminous","subbituminous",null,null,null,null,null,null,6.4699999999999999E-6,6.4531007462686565E-5,6.4699999999999999E-6,6.4531007462686565E-5,"PM control","Fabric Filter, reverse air","1981-11-01","","",null,"","",null,"","",null,"","",null,"","",null,"","",null,"","",null,"","",null,"","",null,"","",null,"",""]
["1010_4","coal",340,null,1010,"Wabash River","IN","4","4","Conventional Boiler","Wall firing - front firing",90,923.69500000000005,10.263277777777779,"bituminous","bituminous",6.7471310232283632E-6,null,null,6.3755750240333329E-6,6.5434297464716335E-5,null,null,null,6.3755750240333329E-6,6.5434297464716335E-5,"PM control","Electrostatic precipitator, cold side, w/o flue gas conditioning","1993-10-01","","",null,"","",null,"","",null,"","",null,"","",null,"","",null,"","",null,"","",null,"","",null,"","",null,"",""]
["2364_2","coal",341,null,2364,"Merrimack Station","NH","mk2","2","Conventional Boiler","Cyclone firing",337,3017,8.9525222551928785,"bituminous","bituminous",4.3558787985914006E-6,null,null,7.5799999999999986E-6,6.7860118694362001E-5,null,null,null,7.5799999999999986E-6,6.7860118694362001E-5,"NOx control","Selective Catalytic Reduction","1995-05-01","Other control","Activated carbon injection",null,"PM control","Electrostatic precipitator, cold side, w/o flue gas conditioning","1999-11-01","PM control","Electrostatic precipitator, cold side, w/o flue gas conditioning","1968-05-01","","",null,"","",null,"","",null,"","",null,"","",null,"","",null,"","",null,"",""]
["8023_1","coal",342,null,8023,"Columbia","WI","Unit 1","1","Conventional Boiler","Tangential firing",590.29999999999995,6090,10.316788073860749,"coal - subbituminous","subbituminous",null,null,null,null,null,null,6.6900000000000003E-6,6.9019312214128423E-5,6.6900000000000003E-6,6.9019312214128423E-5,"PM control","Electrostatic precipitator, hot side, w/ flue gas conditioning","1975-03-01","","",null,"","",null,"","",null,"","",null,"","",null,"","",null,"","",null,"","",null,"","",null,"","",null,"",""]
["4072_8","coal",343,null,4072,"Pulliam","WI","8","8","Conventional Boiler","Wall firing - rear firing",137.9,1510,10.949963741841914,"subbituminous","subbituminous",6.218252900114557E-6,null,null,6.3125000000000001E-6,6.9121646120377082E-5,null,6.7933333333333324E-6,7.4386753686246065E-5,6.3125000000000001E-6,6.9121646120377082E-5,"Other control","Activated carbon injection",null,"PM control","Electrostatic precipitator, cold side, w/ flue gas conditioning","1964-12-01","","",null,"","",null,"","",null,"","",null,"","",null,"","",null,"","",null,"","",null,"","",null,"",""]
["3319_3","coal",344,null,3319,"Jefferies","SC","J3","3","Conventional Boiler","Wall firing - front firing",164,1780,10.853658536585366,"coal - bituminous","bituminous",null,null,null,null,null,null,6.5152319324950722E-6,7.0714102681958708E-5,6.5152319324950722E-6,7.0714102681958708E-5,"PM control","Electrostatic precipitator, cold side, w/o flue gas conditioning","1977-04-01","PM control","Electrostatic precipitator, cold side, w/o flue gas conditioning","1970-01-01","","",null,"","",null,"","",null,"","",null,"","",null,"","",null,"","",null,"","",null,"","",null,"",""]
["1831_EUBoiler2","coal",345,null,1831,"Otto E. Eckert Station","MI","002","EUBoiler2","Conventional Boiler","Tangential firing",38,522,13.736842105263158,"","Bituminous, Subbituminous",null,null,null,null,null,null,5.1900000000000003E-6,7.1294210526315794E-5,5.1900000000000003E-6,7.1294210526315794E-5,"PM control","Electrostatic precipitator, unspecified","1978-01-01","","",null,"","",null,"","",null,"","",null,"","",null,"","",null,"","",null,"","",null,"","",null,"","",null,"",""]
["6254_1","coal",346,null,6254,"Ottumwa","IA","Unit 1","1","Conventional Boiler","Tangential firing",765.1,7990,10.443079336034504,"coal - subbituminous","subbituminous",null,null,null,null,null,null,6.8399999999999997E-6,7.143066265847601E-5,6.8399999999999997E-6,7.143066265847601E-5,"PM control","Electrostatic precipitator, hot side, w/ flue gas conditioning","1981-05-01","","",null,"","",null,"","",null,"","",null,"","",null,"","",null,"","",null,"","",null,"","",null,"","",null,"",""]
["1393_6","coal",347,null,1393,"RS Nelson","LA","001","6","Conventional Boiler","Tangential firing",580,5761,9.9327586206896559,"bituminous","bituminous",7.5793908860522416E-6,7.2666407084090982E-6,7.2177788139904858E-5,null,null,null,null,null,7.2666407084090982E-6,7.2177788139904858E-5,"PM control","Electrostatic precipitator, unspecified","1982-05-01","","",null,"","",null,"","",null,"","",null,"","",null,"","",null,"","",null,"","",null,"","",null,"","",null,"",""]
["165_1","coal",348,null,165,"GRDA","OK","1","1","Conventional Boiler","Wall firing - opposed firing",540,5131,9.5018518518518515,"coal - subbituminous","subbituminous",null,null,null,null,null,null,7.6151583200111156E-6,7.2358106185142656E-5,7.6151583200111156E-6,7.2358106185142656E-5,"PM control","Electrostatic precipitator, cold side, w/o flue gas conditioning","1981-06-01","","",null,"","",null,"","",null,"","",null,"","",null,"","",null,"","",null,"","",null,"","",null,"","",null,"",""]
["56319_0001","coal",349,null,56319,"Wygen 2","WY","WYG2Cfg","0001","Conventional Boiler","Wall firing - front firing",96,1300,13.541666666666666,"subbituminous","subbituminous",5.6222846920521343E-6,null,null,5.913333333333334E-6,8.0076388888888889E-5,5.3633333333333334E-6,null,null,5.3633333333333334E-6,7.2628472222222219E-5,"NOx control","Selective Catalytic Reduction","2008-01-01","SO2 control","Dry FGD - Spray Dryer","2008-01-01","PM control","Fabric Filter, pulse","2008-01-01","","",null,"","",null,"","",null,"","",null,"","",null,"","",null,"","",null,"","",null,"",""]
["1943_002","coal",350,null,1943,"Hoot Lake","MN","2","002","Conventional Boiler","Tangential firing",60.7,747.2,12.309719934102143,"subbituminous","subbituminous",3.3561680547958989E-6,5.9106752847536981E-6,7.2758757376737454E-5,null,null,null,null,null,5.9106752847536981E-6,7.2758757376737454E-5,"PM control","Electrostatic precipitator, cold side, w/o flue gas conditioning","1972-06-01","","",null,"","",null,"","",null,"","",null,"","",null,"","",null,"","",null,"","",null,"","",null,"","",null,"",""]
["6664_101","coal",351,null,6664,"Louisa","IA","101","101","Conventional Boiler","Wall firing - unspecified",805,8624,10.71304347826087,"subbituminous","subbituminous",1.4321819713563607E-6,6.9049068737298125E-6,7.3972567551609824E-5,null,null,null,null,null,6.9049068737298125E-6,7.3972567551609824E-5,"SO2 control","Dry FGD - Circulating Dry Scrubber","2007-12-01","PM control","Fabric Filter, pulse","2007-12-01","","",null,"","",null,"","",null,"","",null,"","",null,"","",null,"","",null,"","",null,"","",null,"",""]
["165_2","coal",352,null,165,"GRDA","OK","2","2","Conventional Boiler","Wall firing - opposed firing",580,5296,9.1310344827586203,"subbituminous","subbituminous",null,null,null,null,null,null,8.3082314880504681E-6,7.5862748208129784E-5,8.3082314880504681E-6,7.5862748208129784E-5,"SO2 control","Dry FGD - Spray Dryer","1986-10-01","PM control","Electrostatic precipitator, cold side, w/o flue gas conditioning","1986-10-01","","",null,"","",null,"","",null,"","",null,"","",null,"","",null,"","",null,"","",null,"","",null,"",""]
["3942_2","coal",353,null,3942,"Albright Power Station","WV","Unit_2","2","Conventional Boiler","Wall firing - unspecified",81,643,7.9382716049382713,"bituminous","bituminous",2.6696583046319649E-5,null,null,9.5833333333333336E-6,7.6075102880658439E-5,null,null,null,9.5833333333333336E-6,7.6075102880658439E-5,"PM control","Electrostatic precipitator, cold side, w/o flue gas conditioning",null,"","",null,"","",null,"","",null,"","",null,"","",null,"","",null,"","",null,"","",null,"","",null,"","",null,"",""]
["2836_12","coal",354,null,2836,"Avon Lake","OH","AL12-2","12","Conventional Boiler","Wall firing - opposed firing",680,6581,9.677941176470588,"","subbituminous, bituminous",null,null,null,null,null,null,8.2662209390670126E-6,8.0000000000000007E-5,8.2662209390670126E-6,8.0000000000000007E-5,"NOx control","Selective Noncatalytic Reduction","2004-06-01","PM control","Electrostatic precipitator, cold side, w/o flue gas conditioning","1985-01-01","","",null,"","",null,"","",null,"","",null,"","",null,"","",null,"","",null,"","",null,"","",null,"",""]
["1831_EUBoiler3","coal",355,null,1831,"Otto E. Eckert Station","MI","003","EUBoiler3","Conventional Boiler","Tangential firing",40,522,13.05,"","Bituminous, Subbituminous",null,null,null,null,null,null,6.2299999999999996E-6,8.1301499999999994E-5,6.2299999999999996E-6,8.1301499999999994E-5,"PM control","Electrostatic precipitator, unspecified","1978-01-01","","",null,"","",null,"","",null,"","",null,"","",null,"","",null,"","",null,"","",null,"","",null,"","",null,"",""]
["465_4","coal",356,null,465,"Arapahoe","CO","Unit 4","4","Conventional Boiler","Vertical firing",118,1709.4,14.486440677966103,"subbituminous","subbituminous",null,null,null,null,null,null,5.6900000000000006E-6,8.2427847457627133E-5,5.6900000000000006E-6,8.2427847457627133E-5,"SO2 control","Dry FGD - Sorbent Injection","1993-06-01","PM control","Fabric Filter, reverse air","1985-04-01","","",null,"","",null,"","",null,"","",null,"","",null,"","",null,"","",null,"","",null,"","",null,"",""]
["4078_2","coal",357,null,4078,"Weston","WI","W2","2","Conventional Boiler","Wall firing - front firing",88.9,1000,11.248593925759279,"coal - subbituminous","subbituminous",null,null,null,null,null,null,7.3999999999999995E-6,8.323959505061865E-5,7.3999999999999995E-6,8.323959505061865E-5,"PM control","Electrostatic precipitator, cold side, w/ flue gas conditioning","1972-01-01","","",null,"","",null,"","",null,"","",null,"","",null,"","",null,"","",null,"","",null,"","",null,"","",null,"",""]
["981_3","coal",358,null,981,"State Line","IN","Unit 3","3","Conventional Boiler","Tangential firing",216,2380,11.018518518518519,"bituminous","bituminous",7.0588235294117641E-6,null,null,7.7032833333333329E-6,8.4878770061728396E-5,null,null,null,7.7032833333333329E-6,8.4878770061728396E-5,"PM control","Fabric Filter, pulse","1999-01-01","","",null,"","",null,"","",null,"","",null,"","",null,"","",null,"","",null,"","",null,"","",null,"","",null,"",""]
["2080_2","coal",359,null,2080,"Montrose","MO","2","2","Conventional Boiler","Tangential firing",188,2130,11.329787234042554,"coal - subbituminous","subbituminous",null,null,null,null,null,null,7.5650000000000004E-6,8.5709840425531931E-5,7.5650000000000004E-6,8.5709840425531931E-5,"Other control","Other (specify): SO3 injection for Opacity control.","1993-05-01","PM control","Electrostatic precipitator, cold side, w/o flue gas conditioning","1960-03-01","","",null,"","",null,"","",null,"","",null,"","",null,"","",null,"","",null,"","",null,"","",null,"",""]
["60_1","coal",360,null,60,"Whelan Energy Center Unit 1 (WEC1)","NE","1","1","Conventional Boiler","Tangential firing",83.6,845.1,10.10885167464115,"subbituminous","subbituminous",6.2489730043140948E-6,null,null,8.7666666666666669E-6,8.8620933014354079E-5,null,null,null,8.7666666666666669E-6,8.8620933014354079E-5,"PM control","Electrostatic precipitator, cold side, w/o flue gas conditioning",null,"","",null,"","",null,"","",null,"","",null,"","",null,"","",null,"","",null,"","",null,"","",null,"","",null,"",""]
["4078_1","coal",361,null,4078,"Weston","WI","W1","1","Conventional Boiler","Wall firing - front firing",63.6,858,13.490566037735849,"coal - subbituminous","subbituminous",null,null,null,null,null,null,6.7000000000000002E-6,9.0386792452830188E-5,6.7000000000000002E-6,9.0386792452830188E-5,"PM control","Electrostatic precipitator, cold side, w/ flue gas conditioning","1971-01-01","","",null,"","",null,"","",null,"","",null,"","",null,"","",null,"","",null,"","",null,"","",null,"","",null,"",""]
["3152_1A","coal",362,null,3152,"Sunbury Generation LP","PA","Boiler 1A","1A","Conventional Boiler","Arch firing",40,525,13.125,"coal - bituminous","bituminous, petroleum coke",null,null,null,null,null,null,6.8971458943690864E-6,9.0525039863594256E-5,6.8971458943690864E-6,9.0525039863594256E-5,"PM control","Fabric Filter, reverse air","1970-06-01","","",null,"","",null,"","",null,"","",null,"","",null,"","",null,"","",null,"","",null,"","",null,"","",null,"",""]
["3152_1B","coal",363,null,3152,"Sunbury Generation LP","PA","Boiler1B","1B","Conventional Boiler","Arch firing",40,525,13.125,"coal - bituminous","petroleum coke, bituminous",null,null,null,null,null,null,6.8971458943690864E-6,9.0525039863594256E-5,6.8971458943690864E-6,9.0525039863594256E-5,"PM control","Fabric Filter, reverse air","1970-06-01","","",null,"","",null,"","",null,"","",null,"","",null,"","",null,"","",null,"","",null,"","",null,"","",null,"",""]
["2080_3","coal",364,null,2080,"Montrose","MO","3","3","Conventional Boiler","Tangential firing",188,2250,11.968085106382979,"coal - subbituminous","subbituminous",null,null,null,null,null,null,7.5650000000000004E-6,9.0538563829787241E-5,7.5650000000000004E-6,9.0538563829787241E-5,"Other control","Other (specify): SO3 injection for opacity control.","1993-05-01","PM control","Electrostatic precipitator, cold side, w/o flue gas conditioning","1964-03-01","","",null,"","",null,"","",null,"","",null,"","",null,"","",null,"","",null,"","",null,"","",null,"",""]
["1104_1","coal",365,null,1104,"Burlington","IA","Unit 1","1","Conventional Boiler","Tangential firing",212.02,2228,10.508442599754739,"coal - subbituminous","subbituminous",null,null,null,null,null,null,9.0799999999999995E-6,9.5416658805773019E-5,9.0799999999999995E-6,9.5416658805773019E-5,"PM control","Electrostatic precipitator, cold side, w/ flue gas conditioning","1968-06-01","","",null,"","",null,"","",null,"","",null,"","",null,"","",null,"","",null,"","",null,"","",null,"","",null,"",""]
["3152_2A","coal",366,null,3152,"Sunbury Generation LP","PA","Boiler 2A","2A","Conventional Boiler","Arch firing",40,525,13.125,"coal - bituminous","petroleum coke, bituminous",null,null,null,null,null,null,7.3363225411259757E-6,9.6289233352278431E-5,7.3363225411259757E-6,9.6289233352278431E-5,"PM control","Fabric Filter, reverse air","1970-06-01","","",null,"","",null,"","",null,"","",null,"","",null,"","",null,"","",null,"","",null,"","",null,"","",null,"",""]
["4072_7","coal",367,null,4072,"Pulliam","WI","7","7","Conventional Boiler","Wall firing - rear firing",87.7,999,11.391106043329533,"coal - subbituminous","subbituminous",null,null,null,null,null,null,8.5733333333333331E-6,9.7659749144811853E-5,8.5733333333333331E-6,9.7659749144811853E-5,"PM control","Electrostatic precipitator, cold side, w/ flue gas conditioning","1958-11-01","","",null,"","",null,"","",null,"","",null,"","",null,"","",null,"","",null,"","",null,"","",null,"","",null,"",""]
["1058_2","coal",368,null,1058,"Sixth Street","IA","Unit 2","2","Conventional Boiler","Wall firing - front firing",13.3,304,22.857142857142858,"coal - subbituminous","natural gas, subbituminous",null,null,null,null,null,null,4.3000000000000003E-6,9.8285714285714301E-5,4.3000000000000003E-6,9.8285714285714301E-5,"PM control","Electrostatic precipitator, cold side, w/o flue gas conditioning","1968-06-01","","",null,"","",null,"","",null,"","",null,"","",null,"","",null,"","",null,"","",null,"","",null,"","",null,"",""]
["1218_1","coal",369,null,1218,"Fair Station","IA","U1","1","Conventional Boiler","Wall firing - front firing",24.5,330,13.469387755102041,"coal - bituminous","bituminous",null,null,null,null,null,null,7.3000000000000004E-6,9.8326530612244904E-5,7.3000000000000004E-6,9.8326530612244904E-5,"PM control","Electrostatic precipitator, cold side, w/o flue gas conditioning","1974-11-01","","",null,"","",null,"","",null,"","",null,"","",null,"","",null,"","",null,"","",null,"","",null,"","",null,"",""]
["4072_6","coal",370,null,4072,"Pulliam","WI","6","6","Conventional Boiler","Wall firing - rear firing",73.7,875,11.872455902306648,"coal - subbituminous","subbituminous",null,null,null,null,null,null,8.6066666666666667E-6,1.0218227046585255E-4,8.6066666666666667E-6,1.0218227046585255E-4,"PM control","Electrostatic precipitator, cold side, w/ flue gas conditioning","1951-11-01","","",null,"","",null,"","",null,"","",null,"","",null,"","",null,"","",null,"","",null,"","",null,"","",null,"",""]
["7253_3","coal",371,null,7253,"Richard Gorsuch","OH","UNIT3","3","Conventional Boiler","Radiant",53.3,553,10.375234521575985,"bituminous","bituminous",1.6561818940172653E-5,null,null,1.0053333333333334E-5,1.0430569105691057E-4,null,null,null,1.0053333333333334E-5,1.0430569105691057E-4,"PM control","Electrostatic precipitator, hot side, w/o flue gas conditioning","1972-06-01","","",null,"","",null,"","",null,"","",null,"","",null,"","",null,"","",null,"","",null,"","",null,"","",null,"",""]
["8_10","coal",372,null,8,"Gorgas","AL","Unit 10","10","Conventional Boiler","Tangential firing",720,6523.7939999700002,9.0608249999583332,"coal - bituminous","bituminous",null,null,null,null,null,null,1.1512877059745476E-5,1.0431616428438859E-4,1.1512877059745476E-5,1.0431616428438859E-4,"NOx control","Selective Catalytic Reduction","2002-05-01","PM control","Electrostatic precipitator, cold side, w/ flue gas conditioning","1972-10-01","SO2 control","Wet FGD - Spray Type","2007-12-01","","",null,"","",null,"","",null,"","",null,"","",null,"","",null,"","",null,"","",null,"",""]
["2080_1","coal",373,null,2080,"Montrose","MO","1","1","Conventional Boiler","Tangential firing",188,2140,11.382978723404255,"coal - subbituminous","subbituminous",null,null,null,null,null,null,9.1679999999999993E-6,1.0435914893617021E-4,9.1679999999999993E-6,1.0435914893617021E-4,"Other control","Other (specify): SO3 injection for Opacity control.","1993-05-01","PM control","Electrostatic precipitator, cold side, w/o flue gas conditioning","1958-06-01","","",null,"","",null,"","",null,"","",null,"","",null,"","",null,"","",null,"","",null,"","",null,"",""]
["8_8","coal",374,null,8,"Gorgas","AL","Unit 8","8","Conventional Boiler","Tangential firing",175,1600.8972500399998,9.1479842859428562,"coal - bituminous","bituminous",null,null,null,null,null,null,1.1512877059745476E-5,1.053196184285436E-4,1.1512877059745476E-5,1.053196184285436E-4,"PM control","Electrostatic precipitator, hot side, w/ flue gas conditioning","1972-06-01","SO2 control","Wet FGD - Spray Type","2007-12-01","","",null,"","",null,"","",null,"","",null,"","",null,"","",null,"","",null,"","",null,"","",null,"",""]
["8_9","coal",375,null,8,"Gorgas","AL","Unit 9","9","Conventional Boiler","Tangential firing",185,1738.6247499249998,9.3979716212162145,"coal - bituminous","bituminous",null,null,null,null,null,null,1.1512877059745476E-5,1.0819769188603915E-4,1.1512877059745476E-5,1.0819769188603915E-4,"PM control","Electrostatic precipitator, hot side, w/ flue gas conditioning","1972-06-01","SO2 control","Wet FGD - Spray Type","2007-12-01","","",null,"","",null,"","",null,"","",null,"","",null,"","",null,"","",null,"","",null,"","",null,"",""]
["4072_5","coal",376,null,4072,"Pulliam","WI","5","5","Conventional Boiler","Wall firing - rear firing",53.63,693,12.921872086518739,"coal - subbituminous","subbituminous",null,null,null,null,null,null,8.6066666666666667E-6,1.1121424575797129E-4,8.6066666666666667E-6,1.1121424575797129E-4,"PM control","Electrostatic precipitator, cold side, w/ flue gas conditioning","1953-01-01","","",null,"","",null,"","",null,"","",null,"","",null,"","",null,"","",null,"","",null,"","",null,"","",null,"",""]
["3942_1","coal",377,null,3942,"Albright Power Station","WV","Unit_1","1","Conventional Boiler","Wall firing - unspecified",81,786,9.7037037037037042,"bituminous","bituminous",1.6985303490355809E-5,null,null,1.1466666666666668E-5,1.1126913580246916E-4,null,null,null,1.1466666666666668E-5,1.1126913580246916E-4,"PM control","Electrostatic precipitator, cold side, w/o flue gas conditioning",null,"","",null,"","",null,"","",null,"","",null,"","",null,"","",null,"","",null,"","",null,"","",null,"","",null,"",""]
["2840_3","coal",378,null,2840,"Conesville","OH","CV-3","3","Conventional Boiler","Wall firing - front firing",165,1862,11.284848484848485,"bituminous","bituminous",1.2138679315885681E-5,null,null,1.1625365328666668E-5,1.3119048631501416E-4,null,null,null,1.1625365328666668E-5,1.3119048631501416E-4,"PM control","Electrostatic precipitator, cold side, w/o flue gas conditioning","1977-01-01","","",null,"","",null,"","",null,"","",null,"","",null,"","",null,"","",null,"","",null,"","",null,"","",null,"",""]
["2848_H-5","coal",379,null,2848,"O H Hutchings","OH","H-5","H-5","Conventional Boiler","Tangential firing",63,641,10.174603174603174,"coal - bituminous","bituminous",null,null,null,null,null,null,1.395E-5,1.4193571428571428E-4,1.395E-5,1.4193571428571428E-4,"PM control","Electrostatic precipitator, hot side, w/o flue gas conditioning","1973-01-01","","",null,"","",null,"","",null,"","",null,"","",null,"","",null,"","",null,"","",null,"","",null,"","",null,"",""]
["2732_7","coal",380,null,2732,"Riverbend","NC","7","7","Conventional Boiler","Tangential firing",99.5,1059,10.643216080402009,"bituminous","bituminous",9.3637074517514502E-6,null,null,1.5445798474299997E-5,1.6439297069631854E-4,null,null,null,1.5445798474299997E-5,1.6439297069631854E-4,"NOx control","Selective Noncatalytic Reduction","2007-02-01","PM control","Electrostatic precipitator, hot side, w/o flue gas conditioning","1995-01-01","","",null,"","",null,"","",null,"","",null,"","",null,"","",null,"","",null,"","",null,"","",null,"",""]
["3138_3","coal",381,null,3138,"New Castle Plant","PA","NC3-2","3","Conventional Boiler","Wall firing - front firing",98,1025,10.459183673469388,"coal - bituminous","bituminous",null,null,null,null,null,null,1.6059999999999999E-5,1.6797448979591836E-4,1.6059999999999999E-5,1.6797448979591836E-4,"NOx control","Selective Noncatalytic Reduction","2005-04-01","PM control","Electrostatic precipitator, cold side, w/o flue gas conditioning","1978-01-01","","",null,"","",null,"","",null,"","",null,"","",null,"","",null,"","",null,"","",null,"","",null,"",""]
["3131_3","coal",382,null,3131,"Shawville","PA","SHAW3-2","3","Conventional Boiler","Tangential firing",188,1794,9.5425531914893611,"bituminous","bituminous",3.7182768519463309E-5,2.9938700257454531E-5,2.8569163969081608E-4,null,null,null,null,null,2.9938700257454531E-5,2.8569163969081608E-4,"NOx control","Selective Noncatalytic Reduction","2005-05-01","PM control","Electrostatic precipitator, cold side, w/o flue gas conditioning","1959-06-01","PM control","Electrostatic precipitator, cold side, w/o flue gas conditioning","1977-03-01","","",null,"","",null,"","",null,"","",null,"","",null,"","",null,"","",null,"","",null,"",""]
["3131_4","coal",383,null,3131,"Shawville","PA","SHAW4-2","4","Conventional Boiler","Tangential firing",188,1794,9.5425531914893611,"bituminous","bituminous",3.7182768519463309E-5,2.9938700257454531E-5,2.8569163969081608E-4,null,null,null,null,null,2.9938700257454531E-5,2.8569163969081608E-4,"NOx control","Selective Noncatalytic Reduction","2005-05-01","PM control","Electrostatic precipitator, cold side, w/o flue gas conditioning","1960-06-01","PM control","Electrostatic precipitator, cold side, w/o flue gas conditioning","1977-03-01","","",null,"","",null,"","",null,"","",null,"","",null,"","",null,"","",null,"","",null,"",""]
["3152_2B","coal",384,null,3152,"Sunbury Generation LP","PA","Boiler 2B","2B","Conventional Boiler","Arch firing",40,525,13.125,"coal - bituminous","anthracite, bituminous",null,null,null,null,null,null,2.8720929160206945E-5,3.7696219522771615E-4,2.8720929160206945E-5,3.7696219522771615E-4,"PM control","Fabric Filter, reverse air","1970-06-01","","",null,"","",null,"","",null,"","",null,"","",null,"","",null,"","",null,"","",null,"","",null,"","",null,"",""]

{"sheet":"Hg_Variability_Tests","index":1,"n_rows":676,"n_cols":23,"rows_kept":676,"cut":false,"hidden":false,"merged":[]}
["facility_name","facility_id","boiler_id","configuration_id","HAP","Final_EF","Final_EF_Units","Final_Output_EF","Final_Output_EF_Units","From","Report_id","Hg_Min_lb_per_MWh_Rank","New Souce MACT Floor Test_ID","New Source MACT Floor QA Calc","New Source Floor Agreement of QA Calc","lb/GWh",11,28,{"$f":"R1+3","v":31},{"$f":"S1+3","v":34},{"$f":"T1+3","v":37},{"$f":"U1+3","v":40},{"$f":"V1+3","v":43}]
[{"$f":"VLOOKUP(B2&\"_\"&C2,Hg_Min_Tests!$A:$AZ,6,FALSE)","v":"Spruance Genco, LLC"},54081,"2A","GEN2","Mercury",2.6333333333333338E-9,"lb/MMBtu",3.4407665505226488E-8,"lb/MW","ETTS","",1,null,null,null,{"$f":"H2*1000","v":3.4407665505226486E-5},{"$f":"VLOOKUP(B2&\"_\"&C2,Hg_Min_Tests!$A$1:AA$1000,11,FALSE)","v":"Stoker - underfeed"}]
[{"$f":"VLOOKUP(B3&\"_\"&C3,Hg_Min_Tests!$A:$AZ,6,FALSE)","v":"Spruance Genco, LLC"},54081,"2B","GEN2","Mercury",2.6333333333333338E-9,"lb/MMBtu",3.4407665505226488E-8,"lb/MW","ETTS","",2,null,null,null,3.4407665505226486E-5,{"$f":"VLOOKUP(B3&\"_\"&C3,Hg_Min_Tests!$A$1:AA$1000,11,FALSE)","v":"Stoker - underfeed"}]
[{"$f":"VLOOKUP(B4&\"_\"&C4,Hg_Min_Tests!$A:$AZ,6,FALSE)","v":"Logan Generating Plant"},10043,"B01","Unit1","Mercury",5.3333333333333339E-9,"lb/MMBtu",4.6691490828851201E-8,"lb/MW","ETTS","",3,null,null,null,4.66914908288512E-5,{"$f":"VLOOKUP($B4&\"_\"&$C4,Hg_Min_Tests!$A$1:AAA$1000,Q$1,FALSE)","v":"Wall firing - opposed firing"},{"$f":"VLOOKUP($B4&\"_\"&$C4,Hg_Min_Tests!$A$1:AAB$1000,R$1,FALSE)","v":"Selective Catalytic Reduction"},{"$f":"VLOOKUP($B4&\"_\"&$C4,Hg_Min_Tests!$A$1:AAC$1000,S$1,FALSE)","v":"Dry FGD - Spray Dryer"},{"$f":"VLOOKUP($B4&\"_\"&$C4,Hg_Min_Tests!$A$1:AAD$1000,T$1,FALSE)","v":"Fabric Filter, reverse air"},{"$f":"VLOOKUP($B4&\"_\"&$C4,Hg_Min_Tests!$A$1:AAE$1000,U$1,FALSE)","v":""},{"$f":"VLOOKUP($B4&\"_\"&$C4,Hg_Min_Tests!$A$1:AAF$1000,V$1,FALSE)","v":""},{"$f":"VLOOKUP($B4&\"_\"&$C4,Hg_Min_Tests!$A$1:AAG$1000,W$1,FALSE)","v":""}]
[{"$f":"VLOOKUP(B5&\"_\"&C5,Hg_Min_Tests!$A:$AZ,6,FALSE)","v":"Nucla"},527,"1","001","Mercury",5.3333333333333339E-9,"lb/MMBtu",5.0036363636363636E-8,"lb/MW","Part II","2009 HG",4,{"$f":"VLOOKUP(H5,Hg_QA_Calcs!B$202:M$230,12,TRUE)","v":"1_Hg_T3"},{"$f":"VLOOKUP(M5,Hg_QA_Calcs!$A$202:$B$204,2,FALSE)","v":5.0026666666666679E-8},{"$f":"N5/H5","v":0.9998062015503878},5.0036363636363635E-5,{"$f":"VLOOKUP(B5&\"_\"&C5,Hg_Min_Tests!$A$1:AA$1000,11,FALSE)","v":"Fluidized bed firing"},{"$f":"VLOOKUP($B5&\"_\"&$C5,Hg_Min_Tests!$A$1:AAB$1000,R$1,FALSE)","v":"Selective Noncatalytic Reduction"},{"$f":"VLOOKUP($B5&\"_\"&$C5,Hg_Min_Tests!$A$1:AAC$1000,S$1,FALSE)","v":"Fabric Filter, shake and deflate"},{"$f":"VLOOKUP($B5&\"_\"&$C5,Hg_Min_Tests!$A$1:AAD$1000,T$1,FALSE)","v":""},{"$f":"VLOOKUP($B5&\"_\"&$C5,Hg_Min_Tests!$A$1:AAE$1000,U$1,FALSE)","v":""},{"$f":"VLOOKUP($B5&\"_\"&$C5,Hg_Min_Tests!$A$1:AAF$1000,V$1,FALSE)","v":""},{"$f":"VLOOKUP($B5&\"_\"&$C5,Hg_Min_Tests!$A$1:AAG$1000,W$1,FALSE)","v":""}]
[{"$f":"VLOOKUP(B6&\"_\"&C6,Hg_Min_Tests!$A:$AZ,6,FALSE)","v":"Nucla"},527,"1","001","Mercury",6.0000000000000008E-9,"lb/MMBtu",5.6290909090909093E-8,"lb/MW","Part II","2008 Hg",4,{"$f":"VLOOKUP(H6,Hg_QA_Calcs!B$202:M$230,12,TRUE)","v":"1_Hg_T2"},{"$f":"VLOOKUP(M6,Hg_QA_Calcs!$A$202:$B$204,2,FALSE)","v":5.6280000000000005E-8},{"$f":"N6/H6","v":0.99980620155038769},5.6290909090909097E-5,{"$f":"VLOOKUP(B6&\"_\"&C6,Hg_Min_Tests!$A$1:AA$1000,11,FALSE)","v":"Fluidized bed firing"},{"$f":"VLOOKUP($B6&\"_\"&$C6,Hg_Min_Tests!$A$1:AAB$1000,R$1,FALSE)","v":"Selective Noncatalytic Reduction"},{"$f":"VLOOKUP($B6&\"_\"&$C6,Hg_Min_Tests!$A$1:AAC$1000,S$1,FALSE)","v":"Fabric Filter, shake and deflate"},{"$f":"VLOOKUP($B6&\"_\"&$C6,Hg_Min_Tests!$A$1:AAD$1000,T$1,FALSE)","v":""},{"$f":"VLOOKUP($B6&\"_\"&$C6,Hg_Min_Tests!$A$1:AAE$1000,U$1,FALSE)","v":""},{"$f":"VLOOKUP($B6&\"_\"&$C6,Hg_Min_Tests!$A$1:AAF$1000,V$1,FALSE)","v":""},{"$f":"VLOOKUP($B6&\"_\"&$C6,Hg_Min_Tests!$A$1:AAG$1000,W$1,FALSE)","v":""}]
[{"$f":"VLOOKUP(B7&\"_\"&C7,Hg_Min_Tests!$A:$AZ,6,FALSE)","v":"Nucla"},527,"1","001","Mercury",9.8533333333333332E-9,"lb/MMBtu",9.244218181818181E-8,"lb/MW","ETTS","",4,{"$f":"VLOOKUP(H7,Hg_QA_Calcs!B$202:M$230,12,TRUE)","v":"1_Hg_T1"},{"$f":"VLOOKUP(M7,Hg_QA_Calcs!$A$202:$B$204,2,FALSE)","v":9.2424266666666684E-8},{"$f":"N7/H7","v":0.99980620155038791},9.2442181818181815E-5,{"$f":"VLOOKUP(B7&\"_\"&C7,Hg_Min_Tests!$A$1:AA$1000,11,FALSE)","v":"Fluidized bed firing"},{"$f":"VLOOKUP($B7&\"_\"&$C7,Hg_Min_Tests!$A$1:AAB$1000,R$1,FALSE)","v":"Selective Noncatalytic Reduction"},{"$f":"VLOOKUP($B7&\"_\"&$C7,Hg_Min_Tests!$A$1:AAC$1000,S$1,FALSE)","v":"Fabric Filter, shake and deflate"},{"$f":"VLOOKUP($B7&\"_\"&$C7,Hg_Min_Tests!$A$1:AAD$1000,T$1,FALSE)","v":""},{"$f":"VLOOKUP($B7&\"_\"&$C7,Hg_Min_Tests!$A$1:AAE$1000,U$1,FALSE)","v":""},{"$f":"VLOOKUP($B7&\"_\"&$C7,Hg_Min_Tests!$A$1:AAF$1000,V$1,FALSE)","v":""},{"$f":"VLOOKUP($B7&\"_\"&$C7,Hg_Min_Tests!$A$1:AAG$1000,W$1,FALSE)","v":""}]
[{"$f":"VLOOKUP(B8&\"_\"&C8,Hg_Min_Tests!$A:$AZ,6,FALSE)","v":"Spruance Genco, LLC"},54081,"3A","GEN3","Mercury",4.6900000000000001E-9,"lb/MMBtu",6.1280487804878046E-8,"lb/MW","ETTS","",5,null,null,null,6.1280487804878044E-5,{"$f":"VLOOKUP(B8&\"_\"&C8,Hg_Min_Tests!$A$1:AA$1000,11,FALSE)","v":"Stoker - underfeed"}]
[{"$f":"VLOOKUP(B9&\"_\"&C9,Hg_Min_Tests!$A:$AZ,6,FALSE)","v":"Spruance Genco, LLC"},54081,"3B","GEN3","Mercury",4.6900000000000001E-9,"lb/MMBtu",6.1280487804878046E-8,"lb/MW","ETTS","",6,null,null,null,6.1280487804878044E-5,{"$f":"VLOOKUP(B9&\"_\"&C9,Hg_Min_Tests!$A$1:AA$1000,11,FALSE)","v":"Stoker - underfeed"}]
[{"$f":"VLOOKUP(B10&\"_\"&C10,Hg_Min_Tests!$A:$AZ,6,FALSE)","v":"AES Greenidge"},2527,"6","Unit 4","Mercury",6.4601660216679329E-9,"lb/MMBtu",6.4428620055384651E-8,"lb/MW","Part II","Hg July 2009",7,null,null,null,6.4428620055384655E-5,{"$f":"VLOOKUP(B10&\"_\"&C10,Hg_Min_Tests!$A$1:AA$1000,11,FALSE)","v":"Tangential firing"},{"$f":"VLOOKUP($B10&\"_\"&$C10,Hg_Min_Tests!$A$1:AAB$1000,R$1,FALSE)","v":"Selective Catalytic Reduction"},{"$f":"VLOOKUP($B10&\"_\"&$C10,Hg_Min_Tests!$A$1:AAC$1000,S$1,FALSE)","v":"Selective Noncatalytic Reduction"},{"$f":"VLOOKUP($B10&\"_\"&$C10,Hg_Min_Tests!$A$1:AAD$1000,T$1,FALSE)","v":"Activated carbon injection"},{"$f":"VLOOKUP($B10&\"_\"&$C10,Hg_Min_Tests!$A$1:AAE$1000,U$1,FALSE)","v":"Dry FGD - Circulating Dry Scrubber"},{"$f":"VLOOKUP($B10&\"_\"&$C10,Hg_Min_Tests!$A$1:AAF$1000,V$1,FALSE)","v":"Fabric Filter, pulse"},{"$f":"VLOOKUP($B10&\"_\"&$C10,Hg_Min_Tests!$A$1:AAG$1000,W$1,FALSE)","v":""}]
[{"$f":"VLOOKUP(B11&\"_\"&C11,Hg_Min_Tests!$A:$AZ,6,FALSE)","v":"AES Greenidge"},2527,"6","Unit 4","Mercury",7.6770981428520377E-8,"lb/MMBtu",7.6565344871122566E-7,"lb/MW","Part II","Hg June 2008",7,null,null,null,7.6565344871122566E-4,{"$f":"VLOOKUP(B11&\"_\"&C11,Hg_Min_Tests!$A$1:AA$1000,11,FALSE)","v":"Tangential firing"},{"$f":"VLOOKUP($B11&\"_\"&$C11,Hg_Min_Tests!$A$1:AAB$1000,R$1,FALSE)","v":"Selective Catalytic Reduction"},{"$f":"VLOOKUP($B11&\"_\"&$C11,Hg_Min_Tests!$A$1:AAC$1000,S$1,FALSE)","v":"Selective Noncatalytic Reduction"},{"$f":"VLOOKUP($B11&\"_\"&$C11,Hg_Min_Tests!$A$1:AAD$1000,T$1,FALSE)","v":"Activated carbon injection"},{"$f":"VLOOKUP($B11&\"_\"&$C11,Hg_Min_Tests!$A$1:AAE$1000,U$1,FALSE)","v":"Dry FGD - Circulating Dry Scrubber"},{"$f":"VLOOKUP($B11&\"_\"&$C11,Hg_Min_Tests!$A$1:AAF$1000,V$1,FALSE)","v":"Fabric Filter, pulse"},{"$f":"VLOOKUP($B11&\"_\"&$C11,Hg_Min_Tests!$A$1:AAG$1000,W$1,FALSE)","v":""}]
[{"$f":"VLOOKUP(B12&\"_\"&C12,Hg_Min_Tests!$A:$AZ,6,FALSE)","v":"Seward"},3130,"1","SEW-1","Mercury",6.3500000000000006E-9,"lb/MMBtu",6.7299145299145298E-8,"lb/MW","ETTS","",8,null,null,null,6.7299145299145295E-5,{"$f":"VLOOKUP(B12&\"_\"&C12,Hg_Min_Tests!$A$1:AA$1000,11,FALSE)","v":"Fluidized bed firing"},{"$f":"VLOOKUP($B12&\"_\"&$C12,Hg_Min_Tests!$A$1:AAB$1000,R$1,FALSE)","v":"Selective Noncatalytic Reduction"},{"$f":"VLOOKUP($B12&\"_\"&$C12,Hg_Min_Tests!$A$1:AAC$1000,S$1,FALSE)","v":"Fabric Filter, pulse"},{"$f":"VLOOKUP($B12&\"_\"&$C12,Hg_Min_Tests!$A$1:AAD$1000,T$1,FALSE)","v":""},{"$f":"VLOOKUP($B12&\"_\"&$C12,Hg_Min_Tests!$A$1:AAE$1000,U$1,FALSE)","v":""},{"$f":"VLOOKUP($B12&\"_\"&$C12,Hg_Min_Tests!$A$1:AAF$1000,V$1,FALSE)","v":""},{"$f":"VLOOKUP($B12&\"_\"&$C12,Hg_Min_Tests!$A$1:AAG$1000,W$1,FALSE)","v":""}]
[{"$f":"VLOOKUP(B13&\"_\"&C13,Hg_Min_Tests!$A:$AZ,6,FALSE)","v":"Seward"},3130,"1","SEW-1","Mercury",3.7999999999999996E-8,"lb/MMBtu",4.0273504273504268E-7,"lb/MW","Part II","ER 1",8,null,null,null,4.027350427350427E-4,{"$f":"VLOOKUP(B13&\"_\"&C13,Hg_Min_Tests!$A$1:AA$1000,11,FALSE)","v":"Fluidized bed firing"},{"$f":"VLOOKUP($B13&\"_\"&$C13,Hg_Min_Tests!$A$1:AAB$1000,R$1,FALSE)","v":"Selective Noncatalytic Reduction"},{"$f":"VLOOKUP($B13&\"_\"&$C13,Hg_Min_Tests!$A$1:AAC$1000,S$1,FALSE)","v":"Fabric Filter, pulse"},{"$f":"VLOOKUP($B13&\"_\"&$C13,Hg_Min_Tests!$A$1:AAD$1000,T$1,FALSE)","v":""},{"$f":"VLOOKUP($B13&\"_\"&$C13,Hg_Min_Tests!$A$1:AAE$1000,U$1,FALSE)","v":""},{"$f":"VLOOKUP($B13&\"_\"&$C13,Hg_Min_Tests!$A$1:AAF$1000,V$1,FALSE)","v":""},{"$f":"VLOOKUP($B13&\"_\"&$C13,Hg_Min_Tests!$A$1:AAG$1000,W$1,FALSE)","v":""}]
[{"$f":"VLOOKUP(B14&\"_\"&C14,Hg_Min_Tests!$A:$AZ,6,FALSE)","v":"Seward"},3130,"1","SEW-1","Mercury",5.5333333333333333E-8,"lb/MMBtu",5.864387464387464E-7,"lb/MW","Part II","ER 2",8,null,null,null,5.8643874643874642E-4,{"$f":"VLOOKUP(B14&\"_\"&C14,Hg_Min_Tests!$A$1:AA$1000,11,FALSE)","v":"Fluidized bed firing"},{"$f":"VLOOKUP($B14&\"_\"&$C14,Hg_Min_Tests!$A$1:AAB$1000,R$1,FALSE)","v":"Selective Noncatalytic Reduction"},{"$f":"VLOOKUP($B14&\"_\"&$C14,Hg_Min_Tests!$A$1:AAC$1000,S$1,FALSE)","v":"Fabric Filter, pulse"},{"$f":"VLOOKUP($B14&\"_\"&$C14,Hg_Min_Tests!$A$1:AAD$1000,T$1,FALSE)","v":""},{"$f":"VLOOKUP($B14&\"_\"&$C14,Hg_Min_Tests!$A$1:AAE$1000,U$1,FALSE)","v":""},{"$f":"VLOOKUP($B14&\"_\"&$C14,Hg_Min_Tests!$A$1:AAF$1000,V$1,FALSE)","v":""},{"$f":"VLOOKUP($B14&\"_\"&$C14,Hg_Min_Tests!$A$1:AAG$1000,W$1,FALSE)","v":""}]
[{"$f":"VLOOKUP(B15&\"_\"&C15,Hg_Min_Tests!$A:$AZ,6,FALSE)","v":"Seward"},3130,"2","SEW-1","Mercury",6.3500000000000006E-9,"lb/MMBtu",6.7299145299145298E-8,"lb/MW","ETTS","",9,null,null,null,6.7299145299145295E-5,{"$f":"VLOOKUP(B15&\"_\"&C15,Hg_Min_Tests!$A$1:AA$1000,11,FALSE)","v":"Fluidized bed firing"},{"$f":"VLOOKUP($B15&\"_\"&$C15,Hg_Min_Tests!$A$1:AAB$1000,R$1,FALSE)","v":"Selective Noncatalytic Reduction"},{"$f":"VLOOKUP($B15&\"_\"&$C15,Hg_Min_Tests!$A$1:AAC$1000,S$1,FALSE)","v":"Fabric Filter, pulse"},{"$f":"VLOOKUP($B15&\"_\"&$C15,Hg_Min_Tests!$A$1:AAD$1000,T$1,FALSE)","v":""},{"$f":"VLOOKUP($B15&\"_\"&$C15,Hg_Min_Tests!$A$1:AAE$1000,U$1,FALSE)","v":""},{"$f":"VLOOKUP($B15&\"_\"&$C15,Hg_Min_Tests!$A$1:AAF$1000,V$1,FALSE)","v":""},{"$f":"VLOOKUP($B15&\"_\"&$C15,Hg_Min_Tests!$A$1:AAG$1000,W$1,FALSE)","v":""}]
[{"$f":"VLOOKUP(B16&\"_\"&C16,Hg_Min_Tests!$A:$AZ,6,FALSE)","v":"Seward"},3130,"2","SEW-1","Mercury",3.7999999999999996E-8,"lb/MMBtu",4.0273504273504268E-7,"lb/MW","Part II","ER 1",9,null,null,null,4.027350427350427E-4,{"$f":"VLOOKUP(B16&\"_\"&C16,Hg_Min_Tests!$A$1:AA$1000,11,FALSE)","v":"Fluidized bed firing"},{"$f":"VLOOKUP($B16&\"_\"&$C16,Hg_Min_Tests!$A$1:AAB$1000,R$1,FALSE)","v":"Selective Noncatalytic Reduction"},{"$f":"VLOOKUP($B16&\"_\"&$C16,Hg_Min_Tests!$A$1:AAC$1000,S$1,FALSE)","v":"Fabric Filter, pulse"},{"$f":"VLOOKUP($B16&\"_\"&$C16,Hg_Min_Tests!$A$1:AAD$1000,T$1,FALSE)","v":""},{"$f":"VLOOKUP($B16&\"_\"&$C16,Hg_Min_Tests!$A$1:AAE$1000,U$1,FALSE)","v":""},{"$f":"VLOOKUP($B16&\"_\"&$C16,Hg_Min_Tests!$A$1:AAF$1000,V$1,FALSE)","v":""},{"$f":"VLOOKUP($B16&\"_\"&$C16,Hg_Min_Tests!$A$1:AAG$1000,W$1,FALSE)","v":""}]
[{"$f":"VLOOKUP(B17&\"_\"&C17,Hg_Min_Tests!$A:$AZ,6,FALSE)","v":"Seward"},3130,"2","SEW-1","Mercury",5.5333333333333333E-8,"lb/MMBtu",5.864387464387464E-7,"lb/MW","Part II","ER 2",9,null,null,null,5.8643874643874642E-4,{"$f":"VLOOKUP(B17&\"_\"&C17,Hg_Min_Tests!$A$1:AA$1000,11,FALSE)","v":"Fluidized bed firing"},{"$f":"VLOOKUP($B17&\"_\"&$C17,Hg_Min_Tests!$A$1:AAB$1000,R$1,FALSE)","v":"Selective Noncatalytic Reduction"},{"$f":"VLOOKUP($B17&\"_\"&$C17,Hg_Min_Tests!$A$1:AAC$1000,S$1,FALSE)","v":"Fabric Filter, pulse"},{"$f":"VLOOKUP($B17&\"_\"&$C17,Hg_Min_Tests!$A$1:AAD$1000,T$1,FALSE)","v":""},{"$f":"VLOOKUP($B17&\"_\"&$C17,Hg_Min_Tests!$A$1:AAE$1000,U$1,FALSE)","v":""},{"$f":"VLOOKUP($B17&\"_\"&$C17,Hg_Min_Tests!$A$1:AAF$1000,V$1,FALSE)","v":""},{"$f":"VLOOKUP($B17&\"_\"&$C17,Hg_Min_Tests!$A$1:AAG$1000,W$1,FALSE)","v":""}]
[{"$f":"VLOOKUP(B18&\"_\"&C18,Hg_Min_Tests!$A:$AZ,6,FALSE)","v":"Roanoke Valley I"},54035,"BLR1","Boiler 1","Mercury",7.2633333333333329E-9,"lb/MMBtu",6.7844322344322346E-8,"lb/MW","ETTS","",10,null,null,null,6.7844322344322346E-5,{"$f":"VLOOKUP(B18&\"_\"&C18,Hg_Min_Tests!$A$1:AA$1000,11,FALSE)","v":"Wall firing - front firing"},{"$f":"VLOOKUP($B18&\"_\"&$C18,Hg_Min_Tests!$A$1:AAB$1000,R$1,FALSE)","v":"Dry FGD - Spray Dryer"},{"$f":"VLOOKUP($B18&\"_\"&$C18,Hg_Min_Tests!$A$1:AAC$1000,S$1,FALSE)","v":"Fabric Filter, reverse air"},{"$f":"VLOOKUP($B18&\"_\"&$C18,Hg_Min_Tests!$A$1:AAD$1000,T$1,FALSE)","v":""},{"$f":"VLOOKUP($B18&\"_\"&$C18,Hg_Min_Tests!$A$1:AAE$1000,U$1,FALSE)","v":""},{"$f":"VLOOKUP($B18&\"_\"&$C18,Hg_Min_Tests!$A$1:AAF$1000,V$1,FALSE)","v":""},{"$f":"VLOOKUP($B18&\"_\"&$C18,Hg_Min_Tests!$A$1:AAG$1000,W$1,FALSE)","v":""}]
[{"$f":"VLOOKUP(B19&\"_\"&C19,Hg_Min_Tests!$A:$AZ,6,FALSE)","v":"INDIANTOWN COGENERATION L.P."},50976,"AABO1","001","Mercury",8.5384486838666669E-9,"lb/MMBtu",8.0937870903578218E-8,"lb/MW","ETTS","",11,null,null,null,8.0937870903578218E-5,{"$f":"VLOOKUP(B19&\"_\"&C19,Hg_Min_Tests!$A$1:AA$1000,11,FALSE)","v":"Wall firing - opposed firing"},{"$f":"VLOOKUP($B19&\"_\"&$C19,Hg_Min_Tests!$A$1:AAB$1000,R$1,FALSE)","v":"Selective Catalytic Reduction"},{"$f":"VLOOKUP($B19&\"_\"&$C19,Hg_Min_Tests!$A$1:AAC$1000,S$1,FALSE)","v":"Dry FGD - Spray Dryer"},{"$f":"VLOOKUP($B19&\"_\"&$C19,Hg_Min_Tests!$A$1:AAD$1000,T$1,FALSE)","v":"Fabric Filter, pulse"},{"$f":"VLOOKUP($B19&\"_\"&$C19,Hg_Min_Tests!$A$1:AAE$1000,U$1,FALSE)","v":""},{"$f":"VLOOKUP($B19&\"_\"&$C19,Hg_Min_Tests!$A$1:AAF$1000,V$1,FALSE)","v":""},{"$f":"VLOOKUP($B19&\"_\"&$C19,Hg_Min_Tests!$A$1:AAG$1000,W$1,FALSE)","v":""}]
[{"$f":"VLOOKUP(B20&\"_\"&C20,Hg_Min_Tests!$A:$AZ,6,FALSE)","v":"INDIANTOWN COGENERATION L.P."},50976,"AABO1","001","Mercury",5.4899999999999995E-7,"lb/MMBtu",5.2040941828254846E-6,"lb/MW","Part II","10669-3",11,null,null,null,{"$f":"H20*1000","v":5.2040941828254842E-3},{"$f":"VLOOKUP(B20&\"_\"&C20,Hg_Min_Tests!$A$1:AA$1000,11,FALSE)","v":"Wall firing - opposed firing"},{"$f":"VLOOKUP($B20&\"_\"&$C20,Hg_Min_Tests!$A$1:AAB$1000,R$1,FALSE)","v":"Selective Catalytic Reduction"},{"$f":"VLOOKUP($B20&\"_\"&$C20,Hg_Min_Tests!$A$1:AAC$1000,S$1,FALSE)","v":"Dry FGD - Spray Dryer"},{"$f":"VLOOKUP($B20&\"_\"&$C20,Hg_Min_Tests!$A$1:AAD$1000,T$1,FALSE)","v":"Fabric Filter, pulse"},{"$f":"VLOOKUP($B20&\"_\"&$C20,Hg_Min_Tests!$A$1:AAE$1000,U$1,FALSE)","v":""},{"$f":"VLOOKUP($B20&\"_\"&$C20,Hg_Min_Tests!$A$1:AAF$1000,V$1,FALSE)","v":""},{"$f":"VLOOKUP($B20&\"_\"&$C20,Hg_Min_Tests!$A$1:AAG$1000,W$1,FALSE)","v":""}]
[{"$f":"VLOOKUP(B21&\"_\"&C21,Hg_Min_Tests!$A:$AZ,6,FALSE)","v":"AES Westover, LLC"},2526,"13","8","Mercury",8.1455731092436972E-9,"lb/MMBtu",8.2876470588235283E-8,"lb/MW","Part II","Mercury2009PostMPC",12,null,null,null,8.2876470588235288E-5,{"$f":"VLOOKUP(B21&\"_\"&C21,Hg_Min_Tests!$A$1:AA$1000,11,FALSE)","v":"Tangential firing"},{"$f":"VLOOKUP($B21&\"_\"&$C21,Hg_Min_Tests!$A$1:AAB$1000,R$1,FALSE)","v":"Selective Catalytic Reduction"},{"$f":"VLOOKUP($B21&\"_\"&$C21,Hg_Min_Tests!$A$1:AAC$1000,S$1,FALSE)","v":"Dry FGD - Spray Dryer"},{"$f":"VLOOKUP($B21&\"_\"&$C21,Hg_Min_Tests!$A$1:AAD$1000,T$1,FALSE)","v":"Fabric Filter, pulse"},{"$f":"VLOOKUP($B21&\"_\"&$C21,Hg_Min_Tests!$A$1:AAE$1000,U$1,FALSE)","v":""},{"$f":"VLOOKUP($B21&\"_\"&$C21,Hg_Min_Tests!$A$1:AAF$1000,V$1,FALSE)","v":""},{"$f":"VLOOKUP($B21&\"_\"&$C21,Hg_Min_Tests!$A$1:AAG$1000,W$1,FALSE)","v":""}]
[{"$f":"VLOOKUP(B22&\"_\"&C22,Hg_Min_Tests!$A:$AZ,6,FALSE)","v":"Northampton Generating Company, L.P."},50888,"BLR1","GEN1","Mercury",1.0396666666666668E-8,"lb/MMBtu",9.8467603305785135E-8,"lb/MW","ETTS","",13,null,null,null,9.8467603305785135E-5,{"$f":"VLOOKUP(B22&\"_\"&C22,Hg_Min_Tests!$A$1:AA$1000,11,FALSE)","v":"Fluidized bed firing"},{"$f":"VLOOKUP($B22&\"_\"&$C22,Hg_Min_Tests!$A$1:AAB$1000,R$1,FALSE)","v":"Selective Noncatalytic Reduction"},{"$f":"VLOOKUP($B22&\"_\"&$C22,Hg_Min_Tests!$A$1:AAC$1000,S$1,FALSE)","v":"Fabric Filter, pulse"},{"$f":"VLOOKUP($B22&\"_\"&$C22,Hg_Min_Tests!$A$1:AAD$1000,T$1,FALSE)","v":""},{"$f":"VLOOKUP($B22&\"_\"&$C22,Hg_Min_Tests!$A$1:AAE$1000,U$1,FALSE)","v":""},{"$f":"VLOOKUP($B22&\"_\"&$C22,Hg_Min_Tests!$A$1:AAF$1000,V$1,FALSE)","v":""},{"$f":"VLOOKUP($B22&\"_\"&$C22,Hg_Min_Tests!$A$1:AAG$1000,W$1,FALSE)","v":""}]
[{"$f":"VLOOKUP(B23&\"_\"&C23,Hg_Min_Tests!$A:$AZ,6,FALSE)","v":"Northampton Generating Company, L.P."},50888,"BLR1","GEN1","Mercury",1.2872094908400804E-7,"lb/MMBtu",1.2191256830601093E-6,"lb/MW","Part II","TDF 2009 Stack Test - #226-013",13,null,null,null,1.2191256830601093E-3,{"$f":"VLOOKUP(B23&\"_\"&C23,Hg_Min_Tests!$A$1:AA$1000,11,FALSE)","v":"Fluidized bed firing"},{"$f":"VLOOKUP($B23&\"_\"&$C23,Hg_Min_Tests!$A$1:AAB$1000,R$1,FALSE)","v":"Selective Noncatalytic Reduction"},{"$f":"VLOOKUP($B23&\"_\"&$C23,Hg_Min_Tests!$A$1:AAC$1000,S$1,FALSE)","v":"Fabric Filter, pulse"},{"$f":"VLOOKUP($B23&\"_\"&$C23,Hg_Min_Tests!$A$1:AAD$1000,T$1,FALSE)","v":""},{"$f":"VLOOKUP($B23&\"_\"&$C23,Hg_Min_Tests!$A$1:AAE$1000,U$1,FALSE)","v":""},{"$f":"VLOOKUP($B23&\"_\"&$C23,Hg_Min_Tests!$A$1:AAF$1000,V$1,FALSE)","v":""},{"$f":"VLOOKUP($B23&\"_\"&$C23,Hg_Min_Tests!$A$1:AAG$1000,W$1,FALSE)","v":""}]
[{"$f":"VLOOKUP(B24&\"_\"&C24,Hg_Min_Tests!$A:$AZ,6,FALSE)","v":"AES Thames"},10675,"A","A","Mercury",1.0500000000000001E-8,"lb/MMBtu",1.0116346153846155E-7,"lb/MW","Part II","5",14,null,null,null,1.0116346153846155E-4,{"$f":"VLOOKUP(B24&\"_\"&C24,Hg_Min_Tests!$A$1:AA$1000,11,FALSE)","v":"Fluidized bed firing"},{"$f":"VLOOKUP($B24&\"_\"&$C24,Hg_Min_Tests!$A$1:AAB$1000,R$1,FALSE)","v":"Dry FGD - Circulating Dry Scrubber"},{"$f":"VLOOKUP($B24&\"_\"&$C24,Hg_Min_Tests!$A$1:AAC$1000,S$1,FALSE)","v":"Fabric Filter, pulse"},{"$f":"VLOOKUP($B24&\"_\"&$C24,Hg_Min_Tests!$A$1:AAD$1000,T$1,FALSE)","v":""},{"$f":"VLOOKUP($B24&\"_\"&$C24,Hg_Min_Tests!$A$1:AAE$1000,U$1,FALSE)","v":""},{"$f":"VLOOKUP($B24&\"_\"&$C24,Hg_Min_Tests!$A$1:AAF$1000,V$1,FALSE)","v":""},{"$f":"VLOOKUP($B24&\"_\"&$C24,Hg_Min_Tests!$A$1:AAG$1000,W$1,FALSE)","v":""}]
[{"$f":"VLOOKUP(B25&\"_\"&C25,Hg_Min_Tests!$A:$AZ,6,FALSE)","v":"AES Thames"},10675,"A","A","Mercury",1.2300000000000001E-8,"lb/MMBtu",1.1850576923076924E-7,"lb/MW","Part II","4",14,null,null,null,1.1850576923076924E-4,{"$f":"VLOOKUP(B25&\"_\"&C25,Hg_Min_Tests!$A$1:AA$1000,11,FALSE)","v":"Fluidized bed firing"},{"$f":"VLOOKUP($B25&\"_\"&$C25,Hg_Min_Tests!$A$1:AAB$1000,R$1,FALSE)","v":"Dry FGD - Circulating Dry Scrubber"},{"$f":"VLOOKUP($B25&\"_\"&$C25,Hg_Min_Tests!$A$1:AAC$1000,S$1,FALSE)","v":"Fabric Filter, pulse"},{"$f":"VLOOKUP($B25&\"_\"&$C25,Hg_Min_Tests!$A$1:AAD$1000,T$1,FALSE)","v":""},{"$f":"VLOOKUP($B25&\"_\"&$C25,Hg_Min_Tests!$A$1:AAE$1000,U$1,FALSE)","v":""},{"$f":"VLOOKUP($B25&\"_\"&$C25,Hg_Min_Tests!$A$1:AAF$1000,V$1,FALSE)","v":""},{"$f":"VLOOKUP($B25&\"_\"&$C25,Hg_Min_Tests!$A$1:AAG$1000,W$1,FALSE)","v":""}]
[{"$f":"VLOOKUP(B26&\"_\"&C26,Hg_Min_Tests!$A:$AZ,6,FALSE)","v":"AES Thames"},10675,"A","A","Mercury",1.3799999999999999E-8,"lb/MMBtu",1.329576923076923E-7,"lb/MW","Part II","6",14,null,null,null,1.329576923076923E-4,{"$f":"VLOOKUP(B26&\"_\"&C26,Hg_Min_Tests!$A$1:AA$1000,11,FALSE)","v":"Fluidized bed firing"},{"$f":"VLOOKUP($B26&\"_\"&$C26,Hg_Min_Tests!$A$1:AAB$1000,R$1,FALSE)","v":"Dry FGD - Circulating Dry Scrubber"},{"$f":"VLOOKUP($B26&\"_\"&$C26,Hg_Min_Tests!$A$1:AAC$1000,S$1,FALSE)","v":"Fabric Filter, pulse"},{"$f":"VLOOKUP($B26&\"_\"&$C26,Hg_Min_Tests!$A$1:AAD$1000,T$1,FALSE)","v":""},{"$f":"VLOOKUP($B26&\"_\"&$C26,Hg_Min_Tests!$A$1:AAE$1000,U$1,FALSE)","v":""},{"$f":"VLOOKUP($B26&\"_\"&$C26,Hg_Min_Tests!$A$1:AAF$1000,V$1,FALSE)","v":""},{"$f":"VLOOKUP($B26&\"_\"&$C26,Hg_Min_Tests!$A$1:AAG$1000,W$1,FALSE)","v":""}]
[{"$f":"VLOOKUP(B27&\"_\"&C27,Hg_Min_Tests!$A:$AZ,6,FALSE)","v":"AES Thames"},10675,"B","B","Mercury",1.0500000000000001E-8,"lb/MMBtu",1.0116346153846155E-7,"lb/MW","Part II","5",15,null,null,null,1.0116346153846155E-4,{"$f":"VLOOKUP(B27&\"_\"&C27,Hg_Min_Tests!$A$1:AA$1000,11,FALSE)","v":"Fluidized bed firing"},{"$f":"VLOOKUP($B27&\"_\"&$C27,Hg_Min_Tests!$A$1:AAB$1000,R$1,FALSE)","v":"Dry FGD - Circulating Dry Scrubber"},{"$f":"VLOOKUP($B27&\"_\"&$C27,Hg_Min_Tests!$A$1:AAC$1000,S$1,FALSE)","v":"Fabric Filter, pulse"},{"$f":"VLOOKUP($B27&\"_\"&$C27,Hg_Min_Tests!$A$1:AAD$1000,T$1,FALSE)","v":""},{"$f":"VLOOKUP($B27&\"_\"&$C27,Hg_Min_Tests!$A$1:AAE$1000,U$1,FALSE)","v":""},{"$f":"VLOOKUP($B27&\"_\"&$C27,Hg_Min_Tests!$A$1:AAF$1000,V$1,FALSE)","v":""},{"$f":"VLOOKUP($B27&\"_\"&$C27,Hg_Min_Tests!$A$1:AAG$1000,W$1,FALSE)","v":""}]
[{"$f":"VLOOKUP(B28&\"_\"&C28,Hg_Min_Tests!$A:$AZ,6,FALSE)","v":"AES Thames"},10675,"B","B","Mercury",1.2300000000000001E-8,"lb/MMBtu",1.1850576923076924E-7,"lb/MW","Part II","4",15,null,null,null,1.1850576923076924E-4,{"$f":"VLOOKUP(B28&\"_\"&C28,Hg_Min_Tests!$A$1:AA$1000,11,FALSE)","v":"Fluidized bed firing"},{"$f":"VLOOKUP($B28&\"_\"&$C28,Hg_Min_Tests!$A$1:AAB$1000,R$1,FALSE)","v":"Dry FGD - Circulating Dry Scrubber"},{"$f":"VLOOKUP($B28&\"_\"&$C28,Hg_Min_Tests!$A$1:AAC$1000,S$1,FALSE)","v":"Fabric Filter, pulse"},{"$f":"VLOOKUP($B28&\"_\"&$C28,Hg_Min_Tests!$A$1:AAD$1000,T$1,FALSE)","v":""},{"$f":"VLOOKUP($B28&\"_\"&$C28,Hg_Min_Tests!$A$1:AAE$1000,U$1,FALSE)","v":""},{"$f":"VLOOKUP($B28&\"_\"&$C28,Hg_Min_Tests!$A$1:AAF$1000,V$1,FALSE)","v":""},{"$f":"VLOOKUP($B28&\"_\"&$C28,Hg_Min_Tests!$A$1:AAG$1000,W$1,FALSE)","v":""}]
[{"$f":"VLOOKUP(B29&\"_\"&C29,Hg_Min_Tests!$A:$AZ,6,FALSE)","v":"AES Thames"},10675,"B","B","Mercury",1.3799999999999999E-8,"lb/MMBtu",1.329576923076923E-7,"lb/MW","Part II","6",15,null,null,null,1.329576923076923E-4,{"$f":"VLOOKUP(B29&\"_\"&C29,Hg_Min_Tests!$A$1:AA$1000,11,FALSE)","v":"Fluidized bed firing"},{"$f":"VLOOKUP($B29&\"_\"&$C29,Hg_Min_Tests!$A$1:AAB$1000,R$1,FALSE)","v":"Dry FGD - Circulating Dry Scrubber"},{"$f":"VLOOKUP($B29&\"_\"&$C29,Hg_Min_Tests!$A$1:AAC$1000,S$1,FALSE)","v":"Fabric Filter, pulse"},{"$f":"VLOOKUP($B29&\"_\"&$C29,Hg_Min_Tests!$A$1:AAD$1000,T$1,FALSE)","v":""},{"$f":"VLOOKUP($B29&\"_\"&$C29,Hg_Min_Tests!$A$1:AAE$1000,U$1,FALSE)","v":""},{"$f":"VLOOKUP($B29&\"_\"&$C29,Hg_Min_Tests!$A$1:AAF$1000,V$1,FALSE)","v":""},{"$f":"VLOOKUP($B29&\"_\"&$C29,Hg_Min_Tests!$A$1:AAG$1000,W$1,FALSE)","v":""}]
[{"$f":"VLOOKUP(B30&\"_\"&C30,Hg_Min_Tests!$A:$AZ,6,FALSE)","v":"AES Hawaii"},10673,"BLR A","001","Mercury",1.1710624187000002E-8,"lb/MMBtu",1.1784464575962368E-7,"lb/MW","ETTS","",16,null,null,null,1.1784464575962368E-4,{"$f":"VLOOKUP(B30&\"_\"&C30,Hg_Min_Tests!$A$1:AA$1000,11,FALSE)","v":"Fluidized bed firing"},{"$f":"VLOOKUP($B30&\"_\"&$C30,Hg_Min_Tests!$A$1:AAB$1000,R$1,FALSE)","v":"Selective Noncatalytic Reduction"},{"$f":"VLOOKUP($B30&\"_\"&$C30,Hg_Min_Tests!$A$1:AAC$1000,S$1,FALSE)","v":"Fabric Filter, unspecified"},{"$f":"VLOOKUP($B30&\"_\"&$C30,Hg_Min_Tests!$A$1:AAD$1000,T$1,FALSE)","v":""},{"$f":"VLOOKUP($B30&\"_\"&$C30,Hg_Min_Tests!$A$1:AAE$1000,U$1,FALSE)","v":""},{"$f":"VLOOKUP($B30&\"_\"&$C30,Hg_Min_Tests!$A$1:AAF$1000,V$1,FALSE)","v":""},{"$f":"VLOOKUP($B30&\"_\"&$C30,Hg_Min_Tests!$A$1:AAG$1000,W$1,FALSE)","v":""}]
[{"$f":"VLOOKUP(B31&\"_\"&C31,Hg_Min_Tests!$A:$AZ,6,FALSE)","v":"Roanoke Valley II"},54755,"BLR2","Boiler 2","Mercury",1.076E-8,"lb/MMBtu",1.2051199999999999E-7,"lb/MW","ETTS","",17,null,null,null,1.2051199999999999E-4,{"$f":"VLOOKUP(B31&\"_\"&C31,Hg_Min_Tests!$A$1:AA$1000,11,FALSE)","v":"Wall firing - front firing"},{"$f":"VLOOKUP($B31&\"_\"&$C31,Hg_Min_Tests!$A$1:AAB$1000,R$1,FALSE)","v":"Selective Noncatalytic Reduction"},{"$f":"VLOOKUP($B31&\"_\"&$C31,Hg_Min_Tests!$A$1:AAC$1000,S$1,FALSE)","v":"Dry FGD - Spray Dryer"},{"$f":"VLOOKUP($B31&\"_\"&$C31,Hg_Min_Tests!$A$1:AAD$1000,T$1,FALSE)","v":"Fabric Filter, pulse"},{"$f":"VLOOKUP($B31&\"_\"&$C31,Hg_Min_Tests!$A$1:AAE$1000,U$1,FALSE)","v":""},{"$f":"VLOOKUP($B31&\"_\"&$C31,Hg_Min_Tests!$A$1:AAF$1000,V$1,FALSE)","v":""},{"$f":"VLOOKUP($B31&\"_\"&$C31,Hg_Min_Tests!$A$1:AAG$1000,W$1,FALSE)","v":""}]
[{"$f":"VLOOKUP(B32&\"_\"&C32,Hg_Min_Tests!$A:$AZ,6,FALSE)","v":"AES Hawaii"},10673,"BLR B","002","Mercury",1.2993811432333332E-8,"lb/MMBtu",1.2087445078235599E-7,"lb/MW","ETTS","",18,null,null,null,1.2087445078235599E-4,{"$f":"VLOOKUP(B32&\"_\"&C32,Hg_Min_Tests!$A$1:AA$1000,11,FALSE)","v":"Fluidized bed firing"},{"$f":"VLOOKUP($B32&\"_\"&$C32,Hg_Min_Tests!$A$1:AAB$1000,R$1,FALSE)","v":"Selective Noncatalytic Reduction"},{"$f":"VLOOKUP($B32&\"_\"&$C32,Hg_Min_Tests!$A$1:AAC$1000,S$1,FALSE)","v":"Fabric Filter, unspecified"},{"$f":"VLOOKUP($B32&\"_\"&$C32,Hg_Min_Tests!$A$1:AAD$1000,T$1,FALSE)","v":""},{"$f":"VLOOKUP($B32&\"_\"&$C32,Hg_Min_Tests!$A$1:AAE$1000,U$1,FALSE)","v":""},{"$f":"VLOOKUP($B32&\"_\"&$C32,Hg_Min_Tests!$A$1:AAF$1000,V$1,FALSE)","v":""},{"$f":"VLOOKUP($B32&\"_\"&$C32,Hg_Min_Tests!$A$1:AAG$1000,W$1,FALSE)","v":""}]
[{"$f":"VLOOKUP(B33&\"_\"&C33,Hg_Min_Tests!$A:$AZ,6,FALSE)","v":"Spruance Genco, LLC"},54081,"4A","GEN4","Mercury",1.1770000000000001E-8,"lb/MMBtu",1.5378919860627178E-7,"lb/MW","ETTS","",19,null,null,null,1.5378919860627177E-4,{"$f":"VLOOKUP(B33&\"_\"&C33,Hg_Min_Tests!$A$1:AA$1000,11,FALSE)","v":"Stoker - underfeed"},{"$f":"VLOOKUP($B33&\"_\"&$C33,Hg_Min_Tests!$A$1:AAB$1000,R$1,FALSE)","v":"Dry FGD - Spray Dryer"},{"$f":"VLOOKUP($B33&\"_\"&$C33,Hg_Min_Tests!$A$1:AAC$1000,S$1,FALSE)","v":"Dry FGD - Spray Dryer"},{"$f":"VLOOKUP($B33&\"_\"&$C33,Hg_Min_Tests!$A$1:AAD$1000,T$1,FALSE)","v":"Fabric Filter, pulse"},{"$f":"VLOOKUP($B33&\"_\"&$C33,Hg_Min_Tests!$A$1:AAE$1000,U$1,FALSE)","v":"Fabric Filter, pulse"},{"$f":"VLOOKUP($B33&\"_\"&$C33,Hg_Min_Tests!$A$1:AAF$1000,V$1,FALSE)","v":""},{"$f":"VLOOKUP($B33&\"_\"&$C33,Hg_Min_Tests!$A$1:AAG$1000,W$1,FALSE)","v":""}]
[{"$f":"VLOOKUP(B34&\"_\"&C34,Hg_Min_Tests!$A:$AZ,6,FALSE)","v":"Spruance Genco, LLC"},54081,"4A","GEN4","Mercury",1.6075415240268799E-6,"lb/MMBtu",2.1004462421954004E-5,"lb/MW","Part II","2006 Emissions Testing  at Boilers 4A and 4B",19,null,null,null,2.1004462421954005E-2,{"$f":"VLOOKUP(B34&\"_\"&C34,Hg_Min_Tests!$A$1:AA$1000,11,FALSE)","v":"Stoker - underfeed"},{"$f":"VLOOKUP($B34&\"_\"&$C34,Hg_Min_Tests!$A$1:AAB$1000,R$1,FALSE)","v":"Dry FGD - Spray Dryer"},{"$f":"VLOOKUP($B34&\"_\"&$C34,Hg_Min_Tests!$A$1:AAC$1000,S$1,FALSE)","v":"Dry FGD - Spray Dryer"},{"$f":"VLOOKUP($B34&\"_\"&$C34,Hg_Min_Tests!$A$1:AAD$1000,T$1,FALSE)","v":"Fabric Filter, pulse"},{"$f":"VLOOKUP($B34&\"_\"&$C34,Hg_Min_Tests!$A$1:AAE$1000,U$1,FALSE)","v":"Fabric Filter, pulse"},{"$f":"VLOOKUP($B34&\"_\"&$C34,Hg_Min_Tests!$A$1:AAF$1000,V$1,FALSE)","v":""},{"$f":"VLOOKUP($B34&\"_\"&$C34,Hg_Min_Tests!$A$1:AAG$1000,W$1,FALSE)","v":""}]
[{"$f":"VLOOKUP(B35&\"_\"&C35,Hg_Min_Tests!$A:$AZ,6,FALSE)","v":"Spruance Genco, LLC"},54081,"4B","GEN4","Mercury",1.1770000000000001E-8,"lb/MMBtu",1.5378919860627178E-7,"lb/MW","ETTS","",20,null,null,null,1.5378919860627177E-4,{"$f":"VLOOKUP(B35&\"_\"&C35,Hg_Min_Tests!$A$1:AA$1000,11,FALSE)","v":"Stoker - underfeed"},{"$f":"VLOOKUP($B35&\"_\"&$C35,Hg_Min_Tests!$A$1:AAB$1000,R$1,FALSE)","v":"Dry FGD - Spray Dryer"},{"$f":"VLOOKUP($B35&\"_\"&$C35,Hg_Min_Tests!$A$1:AAC$1000,S$1,FALSE)","v":"Dry FGD - Spray Dryer"},{"$f":"VLOOKUP($B35&\"_\"&$C35,Hg_Min_Tests!$A$1:AAD$1000,T$1,FALSE)","v":"Fabric Filter, pulse"},{"$f":"VLOOKUP($B35&\"_\"&$C35,Hg_Min_Tests!$A$1:AAE$1000,U$1,FALSE)","v":"Fabric Filter, pulse"},{"$f":"VLOOKUP($B35&\"_\"&$C35,Hg_Min_Tests!$A$1:AAF$1000,V$1,FALSE)","v":""},{"$f":"VLOOKUP($B35&\"_\"&$C35,Hg_Min_Tests!$A$1:AAG$1000,W$1,FALSE)","v":""}]
[{"$f":"VLOOKUP(B36&\"_\"&C36,Hg_Min_Tests!$A:$AZ,6,FALSE)","v":"Spruance Genco, LLC"},54081,"4B","GEN4","Mercury",1.6075415240268799E-6,"lb/MMBtu",2.1004462421954004E-5,"lb/MW","Part II","2006 Emissions Testing  at Boilers 4A and 4B",20,null,null,null,2.1004462421954005E-2,{"$f":"VLOOKUP(B36&\"_\"&C36,Hg_Min_Tests!$A$1:AA$1000,11,FALSE)","v":"Stoker - underfeed"},{"$f":"VLOOKUP($B36&\"_\"&$C36,Hg_Min_Tests!$A$1:AAB$1000,R$1,FALSE)","v":"Dry FGD - Spray Dryer"},{"$f":"VLOOKUP($B36&\"_\"&$C36,Hg_Min_Tests!$A$1:AAC$1000,S$1,FALSE)","v":"Dry FGD - Spray Dryer"},{"$f":"VLOOKUP($B36&\"_\"&$C36,Hg_Min_Tests!$A$1:AAD$1000,T$1,FALSE)","v":"Fabric Filter, pulse"},{"$f":"VLOOKUP($B36&\"_\"&$C36,Hg_Min_Tests!$A$1:AAE$1000,U$1,FALSE)","v":"Fabric Filter, pulse"},{"$f":"VLOOKUP($B36&\"_\"&$C36,Hg_Min_Tests!$A$1:AAF$1000,V$1,FALSE)","v":""},{"$f":"VLOOKUP($B36&\"_\"&$C36,Hg_Min_Tests!$A$1:AAG$1000,W$1,FALSE)","v":""}]
[{"$f":"VLOOKUP(B37&\"_\"&C37,Hg_Min_Tests!$A:$AZ,6,FALSE)","v":"Colver Power Project"},10143,"AAB01","AAB01","Mercury",1.7381623128491174E-8,"lb/MMBtu",1.59751711806896E-7,"lb/MW","Part II","Mercury Emissions 8-2009",21,null,null,null,1.59751711806896E-4,{"$f":"VLOOKUP(B37&\"_\"&C37,Hg_Min_Tests!$A$1:AA$1000,11,FALSE)","v":"Fluidized bed firing"},{"$f":"VLOOKUP($B37&\"_\"&$C37,Hg_Min_Tests!$A$1:AAB$1000,R$1,FALSE)","v":"Selective Noncatalytic Reduction"},{"$f":"VLOOKUP($B37&\"_\"&$C37,Hg_Min_Tests!$A$1:AAC$1000,S$1,FALSE)","v":"Fabric Filter, pulse"},{"$f":"VLOOKUP($B37&\"_\"&$C37,Hg_Min_Tests!$A$1:AAD$1000,T$1,FALSE)","v":""},{"$f":"VLOOKUP($B37&\"_\"&$C37,Hg_Min_Tests!$A$1:AAE$1000,U$1,FALSE)","v":""},{"$f":"VLOOKUP($B37&\"_\"&$C37,Hg_Min_Tests!$A$1:AAF$1000,V$1,FALSE)","v":""},{"$f":"VLOOKUP($B37&\"_\"&$C37,Hg_Min_Tests!$A$1:AAG$1000,W$1,FALSE)","v":""}]
[{"$f":"VLOOKUP(B38&\"_\"&C38,Hg_Min_Tests!$A:$AZ,6,FALSE)","v":"Colver Power Project"},10143,"AAB01","AAB01","Mercury",7.1566666666666666E-8,"lb/MMBtu",6.5775776081424945E-7,"lb/MW","ETTS","",21,null,null,null,6.5775776081424941E-4,{"$f":"VLOOKUP(B38&\"_\"&C38,Hg_Min_Tests!$A$1:AA$1000,11,FALSE)","v":"Fluidized bed firing"},{"$f":"VLOOKUP($B38&\"_\"&$C38,Hg_Min_Tests!$A$1:AAB$1000,R$1,FALSE)","v":"Selective Noncatalytic Reduction"},{"$f":"VLOOKUP($B38&\"_\"&$C38,Hg_Min_Tests!$A$1:AAC$1000,S$1,FALSE)","v":"Fabric Filter, pulse"},{"$f":"VLOOKUP($B38&\"_\"&$C38,Hg_Min_Tests!$A$1:AAD$1000,T$1,FALSE)","v":""},{"$f":"VLOOKUP($B38&\"_\"&$C38,Hg_Min_Tests!$A$1:AAE$1000,U$1,FALSE)","v":""},{"$f":"VLOOKUP($B38&\"_\"&$C38,Hg_Min_Tests!$A$1:AAF$1000,V$1,FALSE)","v":""},{"$f":"VLOOKUP($B38&\"_\"&$C38,Hg_Min_Tests!$A$1:AAG$1000,W$1,FALSE)","v":""}]
[{"$f":"VLOOKUP(B39&\"_\"&C39,Hg_Min_Tests!$A:$AZ,6,FALSE)","v":"Colver Power Project"},10143,"AAB01","AAB01","Mercury",8.0433054692244492E-8,"lb/MMBtu",7.3924731182795707E-7,"lb/MW","Part II","Mercury Emissions 10-2008",21,null,null,null,{"$f":"H39*1000","v":7.3924731182795707E-4},{"$f":"VLOOKUP(B39&\"_\"&C39,Hg_Min_Tests!$A$1:AA$1000,11,FALSE)","v":"Fluidized bed firing"},{"$f":"VLOOKUP($B39&\"_\"&$C39,Hg_Min_Tests!$A$1:AAB$1000,R$1,FALSE)","v":"Selective Noncatalytic Reduction"},{"$f":"VLOOKUP($B39&\"_\"&$C39,Hg_Min_Tests!$A$1:AAC$1000,S$1,FALSE)","v":"Fabric Filter, pulse"},{"$f":"VLOOKUP($B39&\"_\"&$C39,Hg_Min_Tests!$A$1:AAD$1000,T$1,FALSE)","v":""},{"$f":"VLOOKUP($B39&\"_\"&$C39,Hg_Min_Tests!$A$1:AAE$1000,U$1,FALSE)","v":""},{"$f":"VLOOKUP($B39&\"_\"&$C39,Hg_Min_Tests!$A$1:AAF$1000,V$1,FALSE)","v":""},{"$f":"VLOOKUP($B39&\"_\"&$C39,Hg_Min_Tests!$A$1:AAG$1000,W$1,FALSE)","v":""}]
[{"$f":"VLOOKUP(B40&\"_\"&C40,Hg_Min_Tests!$A:$AZ,6,FALSE)","v":"Colver Power Project"},10143,"AAB01","AAB01","Mercury",4.0676927588028799E-6,"lb/MMBtu",3.7385512073272276E-5,"lb/MW","Part II","Mercury Emissions 10-07",21,null,null,null,3.7385512073272273E-2,{"$f":"VLOOKUP(B40&\"_\"&C40,Hg_Min_Tests!$A$1:AA$1000,11,FALSE)","v":"Fluidized bed firing"},{"$f":"VLOOKUP($B40&\"_\"&$C40,Hg_Min_Tests!$A$1:AAB$1000,R$1,FALSE)","v":"Selective Noncatalytic Reduction"},{"$f":"VLOOKUP($B40&\"_\"&$C40,Hg_Min_Tests!$A$1:AAC$1000,S$1,FALSE)","v":"Fabric Filter, pulse"},{"$f":"VLOOKUP($B40&\"_\"&$C40,Hg_Min_Tests!$A$1:AAD$1000,T$1,FALSE)","v":""},{"$f":"VLOOKUP($B40&\"_\"&$C40,Hg_Min_Tests!$A$1:AAE$1000,U$1,FALSE)","v":""},{"$f":"VLOOKUP($B40&\"_\"&$C40,Hg_Min_Tests!$A$1:AAF$1000,V$1,FALSE)","v":""},{"$f":"VLOOKUP($B40&\"_\"&$C40,Hg_Min_Tests!$A$1:AAG$1000,W$1,FALSE)","v":""}]
[{"$f":"VLOOKUP(B41&\"_\"&C41,Hg_Min_Tests!$A:$AZ,6,FALSE)","v":"Birchwood Power Facility"},54304,"1A","1A","Mercury",1.5476139667835107E-8,"lb/MMBtu",1.603383839460394E-7,"lb/MW","ERT","",22,null,null,null,1.603383839460394E-4,{"$f":"VLOOKUP(B41&\"_\"&C41,Hg_Min_Tests!$A$1:AA$1000,11,FALSE)","v":"Tangential firing"},{"$f":"VLOOKUP($B41&\"_\"&$C41,Hg_Min_Tests!$A$1:AAB$1000,R$1,FALSE)","v":"Selective Catalytic Reduction"},{"$f":"VLOOKUP($B41&\"_\"&$C41,Hg_Min_Tests!$A$1:AAC$1000,S$1,FALSE)","v":"Dry FGD - Spray Dryer"},{"$f":"VLOOKUP($B41&\"_\"&$C41,Hg_Min_Tests!$A$1:AAD$1000,T$1,FALSE)","v":"Fabric Filter, reverse air"},{"$f":"VLOOKUP($B41&\"_\"&$C41,Hg_Min_Tests!$A$1:AAE$1000,U$1,FALSE)","v":""},{"$f":"VLOOKUP($B41&\"_\"&$C41,Hg_Min_Tests!$A$1:AAF$1000,V$1,FALSE)","v":""},{"$f":"VLOOKUP($B41&\"_\"&$C41,Hg_Min_Tests!$A$1:AAG$1000,W$1,FALSE)","v":""}]
[{"$f":"VLOOKUP(B42&\"_\"&C42,Hg_Min_Tests!$A:$AZ,6,FALSE)","v":"Ebensburg Power Company"},10603,"031","EPC01","Mercury",1.2483369380666667E-8,"lb/MMBtu",1.7864132044747127E-7,"lb/MW","ETTS","",23,null,null,null,1.7864132044747126E-4,{"$f":"VLOOKUP(B42&\"_\"&C42,Hg_Min_Tests!$A$1:AA$1000,11,FALSE)","v":"Fluidized bed firing"},{"$f":"VLOOKUP($B42&\"_\"&$C42,Hg_Min_Tests!$A$1:AAB$1000,R$1,FALSE)","v":"Fabric Filter, pulse"},{"$f":"VLOOKUP($B42&\"_\"&$C42,Hg_Min_Tests!$A$1:AAC$1000,S$1,FALSE)","v":""},{"$f":"VLOOKUP($B42&\"_\"&$C42,Hg_Min_Tests!$A$1:AAD$1000,T$1,FALSE)","v":""},{"$f":"VLOOKUP($B42&\"_\"&$C42,Hg_Min_Tests!$A$1:AAE$1000,U$1,FALSE)","v":""},{"$f":"VLOOKUP($B42&\"_\"&$C42,Hg_Min_Tests!$A$1:AAF$1000,V$1,FALSE)","v":""},{"$f":"VLOOKUP($B42&\"_\"&$C42,Hg_Min_Tests!$A$1:AAG$1000,W$1,FALSE)","v":""}]
[{"$f":"VLOOKUP(B43&\"_\"&C43,Hg_Min_Tests!$A:$AZ,6,FALSE)","v":"Ebensburg Power Company"},10603,"031","EPC01","Mercury",3.8677255269280689E-8,"lb/MMBtu",5.5348485988798223E-7,"lb/MW","Part II","Hg June 2009",23,null,null,null,5.5348485988798225E-4,{"$f":"VLOOKUP(B43&\"_\"&C43,Hg_Min_Tests!$A$1:AA$1000,11,FALSE)","v":"Fluidized bed firing"},{"$f":"VLOOKUP($B43&\"_\"&$C43,Hg_Min_Tests!$A$1:AAB$1000,R$1,FALSE)","v":"Fabric Filter, pulse"},{"$f":"VLOOKUP($B43&\"_\"&$C43,Hg_Min_Tests!$A$1:AAC$1000,S$1,FALSE)","v":""},{"$f":"VLOOKUP($B43&\"_\"&$C43,Hg_Min_Tests!$A$1:AAD$1000,T$1,FALSE)","v":""},{"$f":"VLOOKUP($B43&\"_\"&$C43,Hg_Min_Tests!$A$1:AAE$1000,U$1,FALSE)","v":""},{"$f":"VLOOKUP($B43&\"_\"&$C43,Hg_Min_Tests!$A$1:AAF$1000,V$1,FALSE)","v":""},{"$f":"VLOOKUP($B43&\"_\"&$C43,Hg_Min_Tests!$A$1:AAG$1000,W$1,FALSE)","v":""}]
[{"$f":"VLOOKUP(B44&\"_\"&C44,Hg_Min_Tests!$A:$AZ,6,FALSE)","v":"Ebensburg Power Company"},10603,"031","EPC01","Mercury",3.4700000000000002E-7,"lb/MMBtu",4.9656896551724136E-6,"lb/MW","Part II","2005 Emissions",23,null,null,null,4.9656896551724134E-3,{"$f":"VLOOKUP(B44&\"_\"&C44,Hg_Min_Tests!$A$1:AA$1000,11,FALSE)","v":"Fluidized bed firing"},{"$f":"VLOOKUP($B44&\"_\"&$C44,Hg_Min_Tests!$A$1:AAB$1000,R$1,FALSE)","v":"Fabric Filter, pulse"},{"$f":"VLOOKUP($B44&\"_\"&$C44,Hg_Min_Tests!$A$1:AAC$1000,S$1,FALSE)","v":""},{"$f":"VLOOKUP($B44&\"_\"&$C44,Hg_Min_Tests!$A$1:AAD$1000,T$1,FALSE)","v":""},{"$f":"VLOOKUP($B44&\"_\"&$C44,Hg_Min_Tests!$A$1:AAE$1000,U$1,FALSE)","v":""},{"$f":"VLOOKUP($B44&\"_\"&$C44,Hg_Min_Tests!$A$1:AAF$1000,V$1,FALSE)","v":""},{"$f":"VLOOKUP($B44&\"_\"&$C44,Hg_Min_Tests!$A$1:AAG$1000,W$1,FALSE)","v":""}]
[{"$f":"VLOOKUP(B45&\"_\"&C45,Hg_Min_Tests!$A:$AZ,6,FALSE)","v":"Chambers Cogeneration LP"},10566,"Boil 1","Boil 1","Mercury",1.9306666666666669E-8,"lb/MMBtu",1.8791822222222223E-7,"lb/MW","ETTS","",24,null,null,null,1.8791822222222223E-4,{"$f":"VLOOKUP(B45&\"_\"&C45,Hg_Min_Tests!$A$1:AA$1000,11,FALSE)","v":"Wall firing - front firing"},{"$f":"VLOOKUP($B45&\"_\"&$C45,Hg_Min_Tests!$A$1:AAB$1000,R$1,FALSE)","v":"Selective Catalytic Reduction"},{"$f":"VLOOKUP($B45&\"_\"&$C45,Hg_Min_Tests!$A$1:AAC$1000,S$1,FALSE)","v":"Dry FGD - Spray Dryer"},{"$f":"VLOOKUP($B45&\"_\"&$C45,Hg_Min_Tests!$A$1:AAD$1000,T$1,FALSE)","v":"Fabric Filter, reverse air"},{"$f":"VLOOKUP($B45&\"_\"&$C45,Hg_Min_Tests!$A$1:AAE$1000,U$1,FALSE)","v":""},{"$f":"VLOOKUP($B45&\"_\"&$C45,Hg_Min_Tests!$A$1:AAF$1000,V$1,FALSE)","v":""},{"$f":"VLOOKUP($B45&\"_\"&$C45,Hg_Min_Tests!$A$1:AAG$1000,W$1,FALSE)","v":""}]
[{"$f":"VLOOKUP(B46&\"_\"&C46,Hg_Min_Tests!$A:$AZ,6,FALSE)","v":"Reid Gardner"},2324,"1","1","Mercury",2.007333333333333E-8,"lb/MMBtu",2.1972162162162159E-7,"lb/MW","ETTS","",25,null,null,null,2.1972162162162159E-4,{"$f":"VLOOKUP(B46&\"_\"&C46,Hg_Min_Tests!$A$1:AA$1000,11,FALSE)","v":"Wall firing - front firing"},{"$f":"VLOOKUP($B46&\"_\"&$C46,Hg_Min_Tests!$A$1:AAB$1000,R$1,FALSE)","v":"Fabric Filter, pulse"},{"$f":"VLOOKUP($B46&\"_\"&$C46,Hg_Min_Tests!$A$1:AAC$1000,S$1,FALSE)","v":"Wet FGD - Venturi Type"},{"$f":"VLOOKUP($B46&\"_\"&$C46,Hg_Min_Tests!$A$1:AAD$1000,T$1,FALSE)","v":""},{"$f":"VLOOKUP($B46&\"_\"&$C46,Hg_Min_Tests!$A$1:AAE$1000,U$1,FALSE)","v":""},{"$f":"VLOOKUP($B46&\"_\"&$C46,Hg_Min_Tests!$A$1:AAF$1000,V$1,FALSE)","v":""},{"$f":"VLOOKUP($B46&\"_\"&$C46,Hg_Min_Tests!$A$1:AAG$1000,W$1,FALSE)","v":""}]
[{"$f":"VLOOKUP(B47&\"_\"&C47,Hg_Min_Tests!$A:$AZ,6,FALSE)","v":"Cedar Bay Generating Company L.P."},10672,"CBB","CBB1","Mercury",1.9031033333333333E-8,"lb/MMBtu",2.198911786231884E-7,"lb/MW","ETTS","",26,null,null,null,2.198911786231884E-4,{"$f":"VLOOKUP(B47&\"_\"&C47,Hg_Min_Tests!$A$1:AA$1000,11,FALSE)","v":"Fluidized bed firing"},{"$f":"VLOOKUP($B47&\"_\"&$C47,Hg_Min_Tests!$A$1:AAB$1000,R$1,FALSE)","v":"Dry FGD - Circulating Dry Scrubber"},{"$f":"VLOOKUP($B47&\"_\"&$C47,Hg_Min_Tests!$A$1:AAC$1000,S$1,FALSE)","v":"Selective Noncatalytic Reduction"},{"$f":"VLOOKUP($B47&\"_\"&$C47,Hg_Min_Tests!$A$1:AAD$1000,T$1,FALSE)","v":"Fabric Filter, pulse"},{"$f":"VLOOKUP($B47&\"_\"&$C47,Hg_Min_Tests!$A$1:AAE$1000,U$1,FALSE)","v":""},{"$f":"VLOOKUP($B47&\"_\"&$C47,Hg_Min_Tests!$A$1:AAF$1000,V$1,FALSE)","v":""},{"$f":"VLOOKUP($B47&\"_\"&$C47,Hg_Min_Tests!$A$1:AAG$1000,W$1,FALSE)","v":""}]
[{"$f":"VLOOKUP(B48&\"_\"&C48,Hg_Min_Tests!$A:$AZ,6,FALSE)","v":"Cedar Bay Generating Company L.P."},10672,"CBB","CBB1","Mercury",4.8622194975001844E-8,"lb/MMBtu",5.6179775280898874E-7,"lb/MW","Part II","CBB2009metals",26,null,null,null,5.6179775280898871E-4,{"$f":"VLOOKUP(B48&\"_\"&C48,Hg_Min_Tests!$A$1:AA$1000,11,FALSE)","v":"Fluidized bed firing"},{"$f":"VLOOKUP($B48&\"_\"&$C48,Hg_Min_Tests!$A$1:AAB$1000,R$1,FALSE)","v":"Dry FGD - Circulating Dry Scrubber"},{"$f":"VLOOKUP($B48&\"_\"&$C48,Hg_Min_Tests!$A$1:AAC$1000,S$1,FALSE)","v":"Selective Noncatalytic Reduction"},{"$f":"VLOOKUP($B48&\"_\"&$C48,Hg_Min_Tests!$A$1:AAD$1000,T$1,FALSE)","v":"Fabric Filter, pulse"},{"$f":"VLOOKUP($B48&\"_\"&$C48,Hg_Min_Tests!$A$1:AAE$1000,U$1,FALSE)","v":""},{"$f":"VLOOKUP($B48&\"_\"&$C48,Hg_Min_Tests!$A$1:AAF$1000,V$1,FALSE)","v":""},{"$f":"VLOOKUP($B48&\"_\"&$C48,Hg_Min_Tests!$A$1:AAG$1000,W$1,FALSE)","v":""}]
[{"$f":"VLOOKUP(B49&\"_\"&C49,Hg_Min_Tests!$A:$AZ,6,FALSE)","v":"Clover"},7213,"1","Unit 1","Mercury",2.0233292389999999E-8,"lb/MMBtu",2.3111020518786541E-7,"lb/MW","ETTS","",27,null,null,null,2.311102051878654E-4,{"$f":"VLOOKUP(B49&\"_\"&C49,Hg_Min_Tests!$A$1:AA$1000,11,FALSE)","v":"Tangential firing"},{"$f":"VLOOKUP($B49&\"_\"&$C49,Hg_Min_Tests!$A$1:AAB$1000,R$1,FALSE)","v":"Fabric Filter, reverse air"},{"$f":"VLOOKUP($B49&\"_\"&$C49,Hg_Min_Tests!$A$1:AAC$1000,S$1,FALSE)","v":"Wet FGD - Spray Type"},{"$f":"VLOOKUP($B49&\"_\"&$C49,Hg_Min_Tests!$A$1:AAD$1000,T$1,FALSE)","v":""},{"$f":"VLOOKUP($B49&\"_\"&$C49,Hg_Min_Tests!$A$1:AAE$1000,U$1,FALSE)","v":""},{"$f":"VLOOKUP($B49&\"_\"&$C49,Hg_Min_Tests!$A$1:AAF$1000,V$1,FALSE)","v":""},{"$f":"VLOOKUP($B49&\"_\"&$C49,Hg_Min_Tests!$A$1:AAG$1000,W$1,FALSE)","v":""}]
[{"$f":"VLOOKUP(B50&\"_\"&C50,Hg_Min_Tests!$A:$AZ,6,FALSE)","v":"Valley"},4042,"1","VAPP-B1","Mercury",1.9300000000000001E-8,"lb/MMBtu",2.3267222222222224E-7,"lb/MW","ETTS","",28,null,null,null,2.3267222222222224E-4,{"$f":"VLOOKUP(B50&\"_\"&C50,Hg_Min_Tests!$A$1:AA$1000,11,FALSE)","v":"Wall firing - front firing"},{"$f":"VLOOKUP($B50&\"_\"&$C50,Hg_Min_Tests!$A$1:AAB$1000,R$1,FALSE)","v":"Fabric Filter, pulse"},{"$f":"VLOOKUP($B50&\"_\"&$C50,Hg_Min_Tests!$A$1:AAC$1000,S$1,FALSE)","v":""},{"$f":"VLOOKUP($B50&\"_\"&$C50,Hg_Min_Tests!$A$1:AAD$1000,T$1,FALSE)","v":""},{"$f":"VLOOKUP($B50&\"_\"&$C50,Hg_Min_Tests!$A$1:AAE$1000,U$1,FALSE)","v":""},{"$f":"VLOOKUP($B50&\"_\"&$C50,Hg_Min_Tests!$A$1:AAF$1000,V$1,FALSE)","v":""},{"$f":"VLOOKUP($B50&\"_\"&$C50,Hg_Min_Tests!$A$1:AAG$1000,W$1,FALSE)","v":""}]
[{"$f":"VLOOKUP(B51&\"_\"&C51,Hg_Min_Tests!$A:$AZ,6,FALSE)","v":"AES Warrior Run Cogeneration Facility"},10678,"BLR1","BLR1","Mercury",2.3400000000000001E-8,"lb/MMBtu",2.3712772277227726E-7,"lb/MW","ETTS","",29,null,null,null,2.3712772277227726E-4,{"$f":"VLOOKUP(B51&\"_\"&C51,Hg_Min_Tests!$A$1:AA$1000,11,FALSE)","v":"Fluidized bed firing"},{"$f":"VLOOKUP($B51&\"_\"&$C51,Hg_Min_Tests!$A$1:AAB$1000,R$1,FALSE)","v":"Selective Noncatalytic Reduction"},{"$f":"VLOOKUP($B51&\"_\"&$C51,Hg_Min_Tests!$A$1:AAC$1000,S$1,FALSE)","v":"Fabric Filter, pulse"},{"$f":"VLOOKUP($B51&\"_\"&$C51,Hg_Min_Tests!$A$1:AAD$1000,T$1,FALSE)","v":""},{"$f":"VLOOKUP($B51&\"_\"&$C51,Hg_Min_Tests!$A$1:AAE$1000,U$1,FALSE)","v":""},{"$f":"VLOOKUP($B51&\"_\"&$C51,Hg_Min_Tests!$A$1:AAF$1000,V$1,FALSE)","v":""},{"$f":"VLOOKUP($B51&\"_\"&$C51,Hg_Min_Tests!$A$1:AAG$1000,W$1,FALSE)","v":""}]
[{"$f":"VLOOKUP(B52&\"_\"&C52,Hg_Min_Tests!$A:$AZ,6,FALSE)","v":"AES Warrior Run Cogeneration Facility"},10678,"BLR1","BLR1","Mercury",2.0099999999999999E-7,"lb/MMBtu",2.0368663366336634E-6,"lb/MW","Part II","2006_Hg",29,null,null,null,2.0368663366336632E-3,{"$f":"VLOOKUP(B52&\"_\"&C52,Hg_Min_Tests!$A$1:AA$1000,11,FALSE)","v":"Fluidized bed firing"},{"$f":"VLOOKUP($B52&\"_\"&$C52,Hg_Min_Tests!$A$1:AAB$1000,R$1,FALSE)","v":"Selective Noncatalytic Reduction"},{"$f":"VLOOKUP($B52&\"_\"&$C52,Hg_Min_Tests!$A$1:AAC$1000,S$1,FALSE)","v":"Fabric Filter, pulse"},{"$f":"VLOOKUP($B52&\"_\"&$C52,Hg_Min_Tests!$A$1:AAD$1000,T$1,FALSE)","v":""},{"$f":"VLOOKUP($B52&\"_\"&$C52,Hg_Min_Tests!$A$1:AAE$1000,U$1,FALSE)","v":""},{"$f":"VLOOKUP($B52&\"_\"&$C52,Hg_Min_Tests!$A$1:AAF$1000,V$1,FALSE)","v":""},{"$f":"VLOOKUP($B52&\"_\"&$C52,Hg_Min_Tests!$A$1:AAG$1000,W$1,FALSE)","v":""}]
[{"$f":"VLOOKUP(B53&\"_\"&C53,Hg_Min_Tests!$A:$AZ,6,FALSE)","v":"AES Warrior Run Cogeneration Facility"},10678,"BLR1","BLR1","Mercury",2.2700000000000001E-7,"lb/MMBtu",2.3003415841584162E-6,"lb/MW","Part II","2007_Hg",29,null,null,null,2.3003415841584161E-3,{"$f":"VLOOKUP(B53&\"_\"&C53,Hg_Min_Tests!$A$1:AA$1000,11,FALSE)","v":"Fluidized bed firing"},{"$f":"VLOOKUP($B53&\"_\"&$C53,Hg_Min_Tests!$A$1:AAB$1000,R$1,FALSE)","v":"Selective Noncatalytic Reduction"},{"$f":"VLOOKUP($B53&\"_\"&$C53,Hg_Min_Tests!$A$1:AAC$1000,S$1,FALSE)","v":"Fabric Filter, pulse"},{"$f":"VLOOKUP($B53&\"_\"&$C53,Hg_Min_Tests!$A$1:AAD$1000,T$1,FALSE)","v":""},{"$f":"VLOOKUP($B53&\"_\"&$C53,Hg_Min_Tests!$A$1:AAE$1000,U$1,FALSE)","v":""},{"$f":"VLOOKUP($B53&\"_\"&$C53,Hg_Min_Tests!$A$1:AAF$1000,V$1,FALSE)","v":""},{"$f":"VLOOKUP($B53&\"_\"&$C53,Hg_Min_Tests!$A$1:AAG$1000,W$1,FALSE)","v":""}]
[{"$f":"VLOOKUP(B54&\"_\"&C54,Hg_Min_Tests!$A:$AZ,6,FALSE)","v":"AES Warrior Run Cogeneration Facility"},10678,"BLR1","BLR1","Mercury",2.6466666666666663E-7,"lb/MMBtu",2.6820429042904286E-6,"lb/MW","Part II","2008_Hg",29,null,null,null,2.6820429042904285E-3,{"$f":"VLOOKUP(B54&\"_\"&C54,Hg_Min_Tests!$A$1:AA$1000,11,FALSE)","v":"Fluidized bed firing"},{"$f":"VLOOKUP($B54&\"_\"&$C54,Hg_Min_Tests!$A$1:AAB$1000,R$1,FALSE)","v":"Selective Noncatalytic Reduction"},{"$f":"VLOOKUP($B54&\"_\"&$C54,Hg_Min_Tests!$A$1:AAC$1000,S$1,FALSE)","v":"Fabric Filter, pulse"},{"$f":"VLOOKUP($B54&\"_\"&$C54,Hg_Min_Tests!$A$1:AAD$1000,T$1,FALSE)","v":""},{"$f":"VLOOKUP($B54&\"_\"&$C54,Hg_Min_Tests!$A$1:AAE$1000,U$1,FALSE)","v":""},{"$f":"VLOOKUP($B54&\"_\"&$C54,Hg_Min_Tests!$A$1:AAF$1000,V$1,FALSE)","v":""},{"$f":"VLOOKUP($B54&\"_\"&$C54,Hg_Min_Tests!$A$1:AAG$1000,W$1,FALSE)","v":""}]
[{"$f":"VLOOKUP(B55&\"_\"&C55,Hg_Min_Tests!$A:$AZ,6,FALSE)","v":"Valley"},4042,"3","VAPP-B3","Mercury",2.0933333333333332E-8,"lb/MMBtu",2.5236296296296292E-7,"lb/MW","ETTS","",30,null,null,null,2.523629629629629E-4,{"$f":"VLOOKUP(B55&\"_\"&C55,Hg_Min_Tests!$A$1:AA$1000,11,FALSE)","v":"Wall firing - front firing"},{"$f":"VLOOKUP($B55&\"_\"&$C55,Hg_Min_Tests!$A$1:AAB$1000,R$1,FALSE)","v":"Fabric Filter, pulse"},{"$f":"VLOOKUP($B55&\"_\"&$C55,Hg_Min_Tests!$A$1:AAC$1000,S$1,FALSE)","v":""},{"$f":"VLOOKUP($B55&\"_\"&$C55,Hg_Min_Tests!$A$1:AAD$1000,T$1,FALSE)","v":""},{"$f":"VLOOKUP($B55&\"_\"&$C55,Hg_Min_Tests!$A$1:AAE$1000,U$1,FALSE)","v":""},{"$f":"VLOOKUP($B55&\"_\"&$C55,Hg_Min_Tests!$A$1:AAF$1000,V$1,FALSE)","v":""},{"$f":"VLOOKUP($B55&\"_\"&$C55,Hg_Min_Tests!$A$1:AAG$1000,W$1,FALSE)","v":""}]
[{"$f":"VLOOKUP(B56&\"_\"&C56,Hg_Min_Tests!$A:$AZ,6,FALSE)","v":"Cedar Bay Generating Company L.P."},10672,"CBA","CBA1","Mercury",2.2238249999999997E-8,"lb/MMBtu",2.5694847554347826E-7,"lb/MW","ETTS","",31,null,null,null,2.5694847554347825E-4,{"$f":"VLOOKUP(B56&\"_\"&C56,Hg_Min_Tests!$A$1:AA$1000,11,FALSE)","v":"Fluidized bed firing"},{"$f":"VLOOKUP($B56&\"_\"&$C56,Hg_Min_Tests!$A$1:AAB$1000,R$1,FALSE)","v":"Dry FGD - Circulating Dry Scrubber"},{"$f":"VLOOKUP($B56&\"_\"&$C56,Hg_Min_Tests!$A$1:AAC$1000,S$1,FALSE)","v":"Selective Noncatalytic Reduction"},{"$f":"VLOOKUP($B56&\"_\"&$C56,Hg_Min_Tests!$A$1:AAD$1000,T$1,FALSE)","v":"Fabric Filter, pulse"},{"$f":"VLOOKUP($B56&\"_\"&$C56,Hg_Min_Tests!$A$1:AAE$1000,U$1,FALSE)","v":""},{"$f":"VLOOKUP($B56&\"_\"&$C56,Hg_Min_Tests!$A$1:AAF$1000,V$1,FALSE)","v":""},{"$f":"VLOOKUP($B56&\"_\"&$C56,Hg_Min_Tests!$A$1:AAG$1000,W$1,FALSE)","v":""}]
[{"$f":"VLOOKUP(B57&\"_\"&C57,Hg_Min_Tests!$A:$AZ,6,FALSE)","v":"Cedar Bay Generating Company L.P."},10672,"CBA","CBA1","Mercury",2.4814320204724722E-6,"lb/MMBtu",2.8671328671328676E-5,"lb/MW","Part II","CBA2009metals",31,null,null,null,2.8671328671328676E-2,{"$f":"VLOOKUP(B57&\"_\"&C57,Hg_Min_Tests!$A$1:AA$1000,11,FALSE)","v":"Fluidized bed firing"},{"$f":"VLOOKUP($B57&\"_\"&$C57,Hg_Min_Tests!$A$1:AAB$1000,R$1,FALSE)","v":"Dry FGD - Circulating Dry Scrubber"},{"$f":"VLOOKUP($B57&\"_\"&$C57,Hg_Min_Tests!$A$1:AAC$1000,S$1,FALSE)","v":"Selective Noncatalytic Reduction"},{"$f":"VLOOKUP($B57&\"_\"&$C57,Hg_Min_Tests!$A$1:AAD$1000,T$1,FALSE)","v":"Fabric Filter, pulse"},{"$f":"VLOOKUP($B57&\"_\"&$C57,Hg_Min_Tests!$A$1:AAE$1000,U$1,FALSE)","v":""},{"$f":"VLOOKUP($B57&\"_\"&$C57,Hg_Min_Tests!$A$1:AAF$1000,V$1,FALSE)","v":""},{"$f":"VLOOKUP($B57&\"_\"&$C57,Hg_Min_Tests!$A$1:AAG$1000,W$1,FALSE)","v":""}]
[{"$f":"VLOOKUP(B58&\"_\"&C58,Hg_Min_Tests!$A:$AZ,6,FALSE)","v":"Cope"},7210,"COP1","COP001","Mercury",2.8959999999999999E-8,"lb/MMBtu",2.6655677097505664E-7,"lb/MW","Part II","Hg-02/09",32,null,null,null,2.6655677097505662E-4,{"$f":"VLOOKUP(B58&\"_\"&C58,Hg_Min_Tests!$A$1:AA$1000,11,FALSE)","v":"Tangential firing"},{"$f":"VLOOKUP($B58&\"_\"&$C58,Hg_Min_Tests!$A$1:AAB$1000,R$1,FALSE)","v":"Selective Catalytic Reduction"},{"$f":"VLOOKUP($B58&\"_\"&$C58,Hg_Min_Tests!$A$1:AAC$1000,S$1,FALSE)","v":"Dry FGD - Spray Dryer"},{"$f":"VLOOKUP($B58&\"_\"&$C58,Hg_Min_Tests!$A$1:AAD$1000,T$1,FALSE)","v":"Fabric Filter, unspecified"},{"$f":"VLOOKUP($B58&\"_\"&$C58,Hg_Min_Tests!$A$1:AAE$1000,U$1,FALSE)","v":""},{"$f":"VLOOKUP($B58&\"_\"&$C58,Hg_Min_Tests!$A$1:AAF$1000,V$1,FALSE)","v":""},{"$f":"VLOOKUP($B58&\"_\"&$C58,Hg_Min_Tests!$A$1:AAG$1000,W$1,FALSE)","v":""}]
[{"$f":"VLOOKUP(B59&\"_\"&C59,Hg_Min_Tests!$A:$AZ,6,FALSE)","v":"Cope"},7210,"COP1","COP001","Mercury",7.0496571531439765E-8,"lb/MMBtu",6.4887218481466469E-7,"lb/MW","ERT","",32,null,null,null,6.4887218481466465E-4,{"$f":"VLOOKUP(B59&\"_\"&C59,Hg_Min_Tests!$A$1:AA$1000,11,FALSE)","v":"Tangential firing"},{"$f":"VLOOKUP($B59&\"_\"&$C59,Hg_Min_Tests!$A$1:AAB$1000,R$1,FALSE)","v":"Selective Catalytic Reduction"},{"$f":"VLOOKUP($B59&\"_\"&$C59,Hg_Min_Tests!$A$1:AAC$1000,S$1,FALSE)","v":"Dry FGD - Spray Dryer"},{"$f":"VLOOKUP($B59&\"_\"&$C59,Hg_Min_Tests!$A$1:AAD$1000,T$1,FALSE)","v":"Fabric Filter, unspecified"},{"$f":"VLOOKUP($B59&\"_\"&$C59,Hg_Min_Tests!$A$1:AAE$1000,U$1,FALSE)","v":""},{"$f":"VLOOKUP($B59&\"_\"&$C59,Hg_Min_Tests!$A$1:AAF$1000,V$1,FALSE)","v":""},{"$f":"VLOOKUP($B59&\"_\"&$C59,Hg_Min_Tests!$A$1:AAG$1000,W$1,FALSE)","v":""}]
[{"$f":"VLOOKUP(B60&\"_\"&C60,Hg_Min_Tests!$A:$AZ,6,FALSE)","v":"BL England"},2378,"2","2 Coal w or w/o TDF","Mercury",2.9648674242424249E-8,"lb/MMBtu",2.835497835497836E-7,"lb/MW","Part II","CAM 238-026",33,null,null,null,2.8354978354978361E-4,{"$f":"VLOOKUP(B60&\"_\"&C60,Hg_Min_Tests!$A$1:AA$1000,11,FALSE)","v":"Cyclone firing"},{"$f":"VLOOKUP($B60&\"_\"&$C60,Hg_Min_Tests!$A$1:AAB$1000,R$1,FALSE)","v":"Selective Noncatalytic Reduction"},{"$f":"VLOOKUP($B60&\"_\"&$C60,Hg_Min_Tests!$A$1:AAC$1000,S$1,FALSE)","v":"Activated carbon injection"},{"$f":"VLOOKUP($B60&\"_\"&$C60,Hg_Min_Tests!$A$1:AAD$1000,T$1,FALSE)","v":"Electrostatic precipitator, cold side, w/o flue gas conditioning"},{"$f":"VLOOKUP($B60&\"_\"&$C60,Hg_Min_Tests!$A$1:AAE$1000,U$1,FALSE)","v":"Wet FGD - Spray Type"},{"$f":"VLOOKUP($B60&\"_\"&$C60,Hg_Min_Tests!$A$1:AAF$1000,V$1,FALSE)","v":""},{"$f":"VLOOKUP($B60&\"_\"&$C60,Hg_Min_Tests!$A$1:AAG$1000,W$1,FALSE)","v":""}]
[{"$f":"VLOOKUP(B61&\"_\"&C61,Hg_Min_Tests!$A:$AZ,6,FALSE)","v":"BL England"},2378,"2","2 Coal w or w/o TDF","Mercury",4.4134861932938866E-8,"lb/MMBtu",4.2209072978303753E-7,"lb/MW","Part II","CAM 238-021",33,null,null,null,4.2209072978303751E-4,{"$f":"VLOOKUP(B61&\"_\"&C61,Hg_Min_Tests!$A$1:AA$1000,11,FALSE)","v":"Cyclone firing"},{"$f":"VLOOKUP($B61&\"_\"&$C61,Hg_Min_Tests!$A$1:AAB$1000,R$1,FALSE)","v":"Selective Noncatalytic Reduction"},{"$f":"VLOOKUP($B61&\"_\"&$C61,Hg_Min_Tests!$A$1:AAC$1000,S$1,FALSE)","v":"Activated carbon injection"},{"$f":"VLOOKUP($B61&\"_\"&$C61,Hg_Min_Tests!$A$1:AAD$1000,T$1,FALSE)","v":"Electrostatic precipitator, cold side, w/o flue gas conditioning"},{"$f":"VLOOKUP($B61&\"_\"&$C61,Hg_Min_Tests!$A$1:AAE$1000,U$1,FALSE)","v":"Wet FGD - Spray Type"},{"$f":"VLOOKUP($B61&\"_\"&$C61,Hg_Min_Tests!$A$1:AAF$1000,V$1,FALSE)","v":""},{"$f":"VLOOKUP($B61&\"_\"&$C61,Hg_Min_Tests!$A$1:AAG$1000,W$1,FALSE)","v":""}]
[{"$f":"VLOOKUP(B62&\"_\"&C62,Hg_Min_Tests!$A:$AZ,6,FALSE)","v":"BL England"},2378,"2","2 Coal w or w/o TDF","Mercury",2.1882674045847703E-7,"lb/MMBtu",2.0927841287122727E-6,"lb/MW","Part II","CAM 238-017",33,null,null,null,{"$f":"H62*1000","v":2.0927841287122725E-3},{"$f":"VLOOKUP(B62&\"_\"&C62,Hg_Min_Tests!$A$1:AA$1000,11,FALSE)","v":"Cyclone firing"},{"$f":"VLOOKUP($B62&\"_\"&$C62,Hg_Min_Tests!$A$1:AAB$1000,R$1,FALSE)","v":"Selective Noncatalytic Reduction"},{"$f":"VLOOKUP($B62&\"_\"&$C62,Hg_Min_Tests!$A$1:AAC$1000,S$1,FALSE)","v":"Activated carbon injection"},{"$f":"VLOOKUP($B62&\"_\"&$C62,Hg_Min_Tests!$A$1:AAD$1000,T$1,FALSE)","v":"Electrostatic precipitator, cold side, w/o flue gas conditioning"},{"$f":"VLOOKUP($B62&\"_\"&$C62,Hg_Min_Tests!$A$1:AAE$1000,U$1,FALSE)","v":"Wet FGD - Spray Type"}]
[{"$f":"VLOOKUP(B63&\"_\"&C63,Hg_Min_Tests!$A:$AZ,6,FALSE)","v":"BL England"},2378,"2","2 Coal w or w/o TDF","Mercury",2.22616935483871E-7,"lb/MMBtu",2.1290322580645162E-6,"lb/MW","Part II","CAM 238-028",33,null,null,null,2.1290322580645163E-3,{"$f":"VLOOKUP(B63&\"_\"&C63,Hg_Min_Tests!$A$1:AA$1000,11,FALSE)","v":"Cyclone firing"},{"$f":"VLOOKUP($B63&\"_\"&$C63,Hg_Min_Tests!$A$1:AAB$1000,R$1,FALSE)","v":"Selective Noncatalytic Reduction"},{"$f":"VLOOKUP($B63&\"_\"&$C63,Hg_Min_Tests!$A$1:AAC$1000,S$1,FALSE)","v":"Activated carbon injection"},{"$f":"VLOOKUP($B63&\"_\"&$C63,Hg_Min_Tests!$A$1:AAD$1000,T$1,FALSE)","v":"Electrostatic precipitator, cold side, w/o flue gas conditioning"},{"$f":"VLOOKUP($B63&\"_\"&$C63,Hg_Min_Tests!$A$1:AAE$1000,U$1,FALSE)","v":"Wet FGD - Spray Type"}]
[{"$f":"VLOOKUP(B64&\"_\"&C64,Hg_Min_Tests!$A:$AZ,6,FALSE)","v":"BL England"},2378,"2","2 Coal w or w/o TDF","Mercury",2.8536848958333332E-7,"lb/MMBtu",2.7291666666666662E-6,"lb/MW","Part II","CAM 238-008",33,null,null,null,2.7291666666666662E-3,{"$f":"VLOOKUP(B64&\"_\"&C64,Hg_Min_Tests!$A$1:AA$1000,11,FALSE)","v":"Cyclone firing"},{"$f":"VLOOKUP($B64&\"_\"&$C64,Hg_Min_Tests!$A$1:AAB$1000,R$1,FALSE)","v":"Selective Noncatalytic Reduction"},{"$f":"VLOOKUP($B64&\"_\"&$C64,Hg_Min_Tests!$A$1:AAC$1000,S$1,FALSE)","v":"Activated carbon injection"},{"$f":"VLOOKUP($B64&\"_\"&$C64,Hg_Min_Tests!$A$1:AAD$1000,T$1,FALSE)","v":"Electrostatic precipitator, cold side, w/o flue gas conditioning"},{"$f":"VLOOKUP($B64&\"_\"&$C64,Hg_Min_Tests!$A$1:AAE$1000,U$1,FALSE)","v":"Wet FGD - Spray Type"}]
[{"$f":"VLOOKUP(B65&\"_\"&C65,Hg_Min_Tests!$A:$AZ,6,FALSE)","v":"BL England"},2378,"2","2 Coal w or w/o TDF","Mercury",3.5083368307446139E-7,"lb/MMBtu",3.3552533946152911E-6,"lb/MW","Part II","CAM 238-012",33,null,null,null,3.3552533946152913E-3,{"$f":"VLOOKUP(B65&\"_\"&C65,Hg_Min_Tests!$A$1:AA$1000,11,FALSE)","v":"Cyclone firing"},{"$f":"VLOOKUP($B65&\"_\"&$C65,Hg_Min_Tests!$A$1:AAB$1000,R$1,FALSE)","v":"Selective Noncatalytic Reduction"},{"$f":"VLOOKUP($B65&\"_\"&$C65,Hg_Min_Tests!$A$1:AAC$1000,S$1,FALSE)","v":"Activated carbon injection"},{"$f":"VLOOKUP($B65&\"_\"&$C65,Hg_Min_Tests!$A$1:AAD$1000,T$1,FALSE)","v":"Electrostatic precipitator, cold side, w/o flue gas conditioning"},{"$f":"VLOOKUP($B65&\"_\"&$C65,Hg_Min_Tests!$A$1:AAE$1000,U$1,FALSE)","v":"Wet FGD - Spray Type"}]
[{"$f":"VLOOKUP(B66&\"_\"&C66,Hg_Min_Tests!$A:$AZ,6,FALSE)","v":"BL England"},2378,"2","2 Coal w or w/o TDF","Mercury",4.8514748926800262E-7,"lb/MMBtu",4.6397847150556134E-6,"lb/MW","Part II","CAM 238-016",33,null,null,null,4.6397847150556138E-3,{"$f":"VLOOKUP(B66&\"_\"&C66,Hg_Min_Tests!$A$1:AA$1000,11,FALSE)","v":"Cyclone firing"},{"$f":"VLOOKUP($B66&\"_\"&$C66,Hg_Min_Tests!$A$1:AAB$1000,R$1,FALSE)","v":"Selective Noncatalytic Reduction"},{"$f":"VLOOKUP($B66&\"_\"&$C66,Hg_Min_Tests!$A$1:AAC$1000,S$1,FALSE)","v":"Activated carbon injection"},{"$f":"VLOOKUP($B66&\"_\"&$C66,Hg_Min_Tests!$A$1:AAD$1000,T$1,FALSE)","v":"Electrostatic precipitator, cold side, w/o flue gas conditioning"},{"$f":"VLOOKUP($B66&\"_\"&$C66,Hg_Min_Tests!$A$1:AAE$1000,U$1,FALSE)","v":"Wet FGD - Spray Type"}]
[{"$f":"VLOOKUP(B67&\"_\"&C67,Hg_Min_Tests!$A:$AZ,6,FALSE)","v":"BL England"},2378,"2","2 Coal w or w/o TDF","Mercury",7.6890404040404043E-7,"lb/MMBtu",7.3535353535353534E-6,"lb/MW","Part II","CAM 238-020",33,null,null,null,7.3535353535353534E-3,{"$f":"VLOOKUP(B67&\"_\"&C67,Hg_Min_Tests!$A$1:AA$1000,11,FALSE)","v":"Cyclone firing"},{"$f":"VLOOKUP($B67&\"_\"&$C67,Hg_Min_Tests!$A$1:AAB$1000,R$1,FALSE)","v":"Selective Noncatalytic Reduction"},{"$f":"VLOOKUP($B67&\"_\"&$C67,Hg_Min_Tests!$A$1:AAC$1000,S$1,FALSE)","v":"Activated carbon injection"},{"$f":"VLOOKUP($B67&\"_\"&$C67,Hg_Min_Tests!$A$1:AAD$1000,T$1,FALSE)","v":"Electrostatic precipitator, cold side, w/o flue gas conditioning"},{"$f":"VLOOKUP($B67&\"_\"&$C67,Hg_Min_Tests!$A$1:AAE$1000,U$1,FALSE)","v":"Wet FGD - Spray Type"}]
[{"$f":"VLOOKUP(B68&\"_\"&C68,Hg_Min_Tests!$A:$AZ,6,FALSE)","v":"Cedar Bay Generating Company L.P."},10672,"CBC","CBC1","Mercury",2.6500033333333332E-8,"lb/MMBtu",3.0619060253623187E-7,"lb/MW","ETTS","",34,null,null,null,3.0619060253623187E-4,{"$f":"VLOOKUP(B68&\"_\"&C68,Hg_Min_Tests!$A$1:AA$1000,11,FALSE)","v":"Fluidized bed firing"},{"$f":"VLOOKUP($B68&\"_\"&$C68,Hg_Min_Tests!$A$1:AAB$1000,R$1,FALSE)","v":"Dry FGD - Circulating Dry Scrubber"},{"$f":"VLOOKUP($B68&\"_\"&$C68,Hg_Min_Tests!$A$1:AAC$1000,S$1,FALSE)","v":"Selective Noncatalytic Reduction"},{"$f":"VLOOKUP($B68&\"_\"&$C68,Hg_Min_Tests!$A$1:AAD$1000,T$1,FALSE)","v":"Fabric Filter, pulse"},{"$f":"VLOOKUP($B68&\"_\"&$C68,Hg_Min_Tests!$A$1:AAE$1000,U$1,FALSE)","v":""}]
[{"$f":"VLOOKUP(B69&\"_\"&C69,Hg_Min_Tests!$A:$AZ,6,FALSE)","v":"Cherokee"},469,"3","Unit 3","Mercury",2.8072885363020188E-8,"lb/MMBtu",3.1935033834175087E-7,"lb/MW","Part II","CHE3 Hg Oct08",35,null,null,null,3.1935033834175087E-4,{"$f":"VLOOKUP(B69&\"_\"&C69,Hg_Min_Tests!$A$1:AA$1000,11,FALSE)","v":"Wall firing - front firing"},{"$f":"VLOOKUP($B69&\"_\"&$C69,Hg_Min_Tests!$A$1:AAB$1000,R$1,FALSE)","v":"Dry FGD - Spray Dryer"},{"$f":"VLOOKUP($B69&\"_\"&$C69,Hg_Min_Tests!$A$1:AAC$1000,S$1,FALSE)","v":"Fabric Filter, reverse air"},{"$f":"VLOOKUP($B69&\"_\"&$C69,Hg_Min_Tests!$A$1:AAD$1000,T$1,FALSE)","v":""},{"$f":"VLOOKUP($B69&\"_\"&$C69,Hg_Min_Tests!$A$1:AAE$1000,U$1,FALSE)","v":""}]
[{"$f":"VLOOKUP(B70&\"_\"&C70,Hg_Min_Tests!$A:$AZ,6,FALSE)","v":"Cherokee"},469,"3","Unit 3","Mercury",1.0948104618747094E-7,"lb/MMBtu",1.2454298405689874E-6,"lb/MW","Part II","CHE3 Hg Feb09",35,null,null,null,1.2454298405689874E-3,{"$f":"VLOOKUP(B70&\"_\"&C70,Hg_Min_Tests!$A$1:AA$1000,11,FALSE)","v":"Wall firing - front firing"},{"$f":"VLOOKUP($B70&\"_\"&$C70,Hg_Min_Tests!$A$1:AAB$1000,R$1,FALSE)","v":"Dry FGD - Spray Dryer"},{"$f":"VLOOKUP($B70&\"_\"&$C70,Hg_Min_Tests!$A$1:AAC$1000,S$1,FALSE)","v":"Fabric Filter, reverse air"},{"$f":"VLOOKUP($B70&\"_\"&$C70,Hg_Min_Tests!$A$1:AAD$1000,T$1,FALSE)","v":""},{"$f":"VLOOKUP($B70&\"_\"&$C70,Hg_Min_Tests!$A$1:AAE$1000,U$1,FALSE)","v":""}]
[{"$f":"VLOOKUP(B71&\"_\"&C71,Hg_Min_Tests!$A:$AZ,6,FALSE)","v":"Cherokee"},469,"3","Unit 3","Mercury",1.6E-7,"lb/MMBtu",1.8201212121212121E-6,"lb/MW","Part II","CHE3 Hg Jun07",35,null,null,null,1.8201212121212122E-3,{"$f":"VLOOKUP(B71&\"_\"&C71,Hg_Min_Tests!$A$1:AA$1000,11,FALSE)","v":"Wall firing - front firing"},{"$f":"VLOOKUP($B71&\"_\"&$C71,Hg_Min_Tests!$A$1:AAB$1000,R$1,FALSE)","v":"Dry FGD - Spray Dryer"},{"$f":"VLOOKUP($B71&\"_\"&$C71,Hg_Min_Tests!$A$1:AAC$1000,S$1,FALSE)","v":"Fabric Filter, reverse air"},{"$f":"VLOOKUP($B71&\"_\"&$C71,Hg_Min_Tests!$A$1:AAD$1000,T$1,FALSE)","v":""},{"$f":"VLOOKUP($B71&\"_\"&$C71,Hg_Min_Tests!$A$1:AAE$1000,U$1,FALSE)","v":""}]
[{"$f":"VLOOKUP(B72&\"_\"&C72,Hg_Min_Tests!$A:$AZ,6,FALSE)","v":"Martin Drake"},492,"7","Unit 7 - Coal","Mercury",3.1133333333333334E-8,"lb/MMBtu",3.2568557919621752E-7,"lb/MW","ETTS","",36,null,null,null,3.256855791962175E-4,{"$f":"VLOOKUP(B72&\"_\"&C72,Hg_Min_Tests!$A$1:AA$1000,11,FALSE)","v":"Wall firing - front firing"},{"$f":"VLOOKUP($B72&\"_\"&$C72,Hg_Min_Tests!$A$1:AAB$1000,R$1,FALSE)","v":"Fabric Filter, reverse air"},{"$f":"VLOOKUP($B72&\"_\"&$C72,Hg_Min_Tests!$A$1:AAC$1000,S$1,FALSE)","v":""},{"$f":"VLOOKUP($B72&\"_\"&$C72,Hg_Min_Tests!$A$1:AAD$1000,T$1,FALSE)","v":""},{"$f":"VLOOKUP($B72&\"_\"&$C72,Hg_Min_Tests!$A$1:AAE$1000,U$1,FALSE)","v":""}]
[{"$f":"VLOOKUP(B73&\"_\"&C73,Hg_Min_Tests!$A:$AZ,6,FALSE)","v":"Martin Drake"},492,"7","Unit 7 - Coal","Mercury",1.8300000000000001E-7,"lb/MMBtu",1.9143617021276598E-6,"lb/MW","Part II","Airtech 2480D",36,null,null,null,1.9143617021276597E-3,{"$f":"VLOOKUP(B73&\"_\"&C73,Hg_Min_Tests!$A$1:AA$1000,11,FALSE)","v":"Wall firing - front firing"},{"$f":"VLOOKUP($B73&\"_\"&$C73,Hg_Min_Tests!$A$1:AAB$1000,R$1,FALSE)","v":"Fabric Filter, reverse air"},{"$f":"VLOOKUP($B73&\"_\"&$C73,Hg_Min_Tests!$A$1:AAC$1000,S$1,FALSE)","v":""},{"$f":"VLOOKUP($B73&\"_\"&$C73,Hg_Min_Tests!$A$1:AAD$1000,T$1,FALSE)","v":""},{"$f":"VLOOKUP($B73&\"_\"&$C73,Hg_Min_Tests!$A$1:AAE$1000,U$1,FALSE)","v":""}]
[{"$f":"VLOOKUP(B74&\"_\"&C74,Hg_Min_Tests!$A:$AZ,6,FALSE)","v":"Martin Drake"},492,"7","Unit 7 - Coal","Mercury",6.8333333333333328E-7,"lb/MMBtu",7.1483451536643021E-6,"lb/MW","Part II","APT CSU5384 D",36,null,null,null,7.1483451536643022E-3,{"$f":"VLOOKUP(B74&\"_\"&C74,Hg_Min_Tests!$A$1:AA$1000,11,FALSE)","v":"Wall firing - front firing"},{"$f":"VLOOKUP($B74&\"_\"&$C74,Hg_Min_Tests!$A$1:AAB$1000,R$1,FALSE)","v":"Fabric Filter, reverse air"},{"$f":"VLOOKUP($B74&\"_\"&$C74,Hg_Min_Tests!$A$1:AAC$1000,S$1,FALSE)","v":""},{"$f":"VLOOKUP($B74&\"_\"&$C74,Hg_Min_Tests!$A$1:AAD$1000,T$1,FALSE)","v":""},{"$f":"VLOOKUP($B74&\"_\"&$C74,Hg_Min_Tests!$A$1:AAE$1000,U$1,FALSE)","v":""}]
[{"$f":"VLOOKUP(B75&\"_\"&C75,Hg_Min_Tests!$A:$AZ,6,FALSE)","v":"Chambers Cogeneration LP"},10566,"Boil 2","Boil 2","Mercury",3.3789999999999994E-8,"lb/MMBtu",3.2888933333333324E-7,"lb/MW","ETTS","",37,null,null,null,3.2888933333333323E-4,{"$f":"VLOOKUP(B75&\"_\"&C75,Hg_Min_Tests!$A$1:AA$1000,11,FALSE)","v":"Wall firing - front firing"},{"$f":"VLOOKUP($B75&\"_\"&$C75,Hg_Min_Tests!$A$1:AAB$1000,R$1,FALSE)","v":"Selective Catalytic Reduction"},{"$f":"VLOOKUP($B75&\"_\"&$C75,Hg_Min_Tests!$A$1:AAC$1000,S$1,FALSE)","v":"Dry FGD - Spray Dryer"},{"$f":"VLOOKUP($B75&\"_\"&$C75,Hg_Min_Tests!$A$1:AAD$1000,T$1,FALSE)","v":"Fabric Filter, reverse air"},{"$f":"VLOOKUP($B75&\"_\"&$C75,Hg_Min_Tests!$A$1:AAE$1000,U$1,FALSE)","v":""}]
[{"$f":"VLOOKUP(B76&\"_\"&C76,Hg_Min_Tests!$A:$AZ,6,FALSE)","v":"Valley"},4042,"2","VAPP-B2","Mercury",2.7399999999999997E-8,"lb/MMBtu",3.3032222222222219E-7,"lb/MW","ETTS","",38,null,null,null,3.303222222222222E-4,{"$f":"VLOOKUP(B76&\"_\"&C76,Hg_Min_Tests!$A$1:AA$1000,11,FALSE)","v":"Wall firing - front firing"},{"$f":"VLOOKUP($B76&\"_\"&$C76,Hg_Min_Tests!$A$1:AAB$1000,R$1,FALSE)","v":"Fabric Filter, pulse"},{"$f":"VLOOKUP($B76&\"_\"&$C76,Hg_Min_Tests!$A$1:AAC$1000,S$1,FALSE)","v":""},{"$f":"VLOOKUP($B76&\"_\"&$C76,Hg_Min_Tests!$A$1:AAD$1000,T$1,FALSE)","v":""},{"$f":"VLOOKUP($B76&\"_\"&$C76,Hg_Min_Tests!$A$1:AAE$1000,U$1,FALSE)","v":""}]
[{"$f":"VLOOKUP(B77&\"_\"&C77,Hg_Min_Tests!$A:$AZ,6,FALSE)","v":"Cherokee"},469,"4","Unit 4","Mercury",3.5970022575090311E-8,"lb/MMBtu",3.3058610826192658E-7,"lb/MW","Part II","CHE4 Hg Oct08",39,null,null,null,3.3058610826192656E-4,{"$f":"VLOOKUP(B77&\"_\"&C77,Hg_Min_Tests!$A$1:AA$1000,11,FALSE)","v":"Tangential firing"},{"$f":"VLOOKUP($B77&\"_\"&$C77,Hg_Min_Tests!$A$1:AAB$1000,R$1,FALSE)","v":"Dry FGD - Spray Dryer"},{"$f":"VLOOKUP($B77&\"_\"&$C77,Hg_Min_Tests!$A$1:AAC$1000,S$1,FALSE)","v":"Fabric Filter, reverse air"},{"$f":"VLOOKUP($B77&\"_\"&$C77,Hg_Min_Tests!$A$1:AAD$1000,T$1,FALSE)","v":""},{"$f":"VLOOKUP($B77&\"_\"&$C77,Hg_Min_Tests!$A$1:AAE$1000,U$1,FALSE)","v":""}]
[{"$f":"VLOOKUP(B78&\"_\"&C78,Hg_Min_Tests!$A:$AZ,6,FALSE)","v":"Cherokee"},469,"4","Unit 4","Mercury",2.1965180796229378E-7,"lb/MMBtu",2.0187320209589403E-6,"lb/MW","Part II","CHE4 Hg Oct09",39,null,null,null,2.0187320209589404E-3,{"$f":"VLOOKUP(B78&\"_\"&C78,Hg_Min_Tests!$A$1:AA$1000,11,FALSE)","v":"Tangential firing"},{"$f":"VLOOKUP($B78&\"_\"&$C78,Hg_Min_Tests!$A$1:AAB$1000,R$1,FALSE)","v":"Dry FGD - Spray Dryer"},{"$f":"VLOOKUP($B78&\"_\"&$C78,Hg_Min_Tests!$A$1:AAC$1000,S$1,FALSE)","v":"Fabric Filter, reverse air"},{"$f":"VLOOKUP($B78&\"_\"&$C78,Hg_Min_Tests!$A$1:AAD$1000,T$1,FALSE)","v":""},{"$f":"VLOOKUP($B78&\"_\"&$C78,Hg_Min_Tests!$A$1:AAE$1000,U$1,FALSE)","v":""}]
[{"$f":"VLOOKUP(B79&\"_\"&C79,Hg_Min_Tests!$A:$AZ,6,FALSE)","v":"Cherokee"},469,"4","Unit 4","Mercury",1.1200000000000001E-6,"lb/MMBtu",1.0293472584856398E-5,"lb/MW","Part II","CHE4 Hg Aug05",39,null,null,null,1.0293472584856397E-2,{"$f":"VLOOKUP(B79&\"_\"&C79,Hg_Min_Tests!$A$1:AA$1000,11,FALSE)","v":"Tangential firing"},{"$f":"VLOOKUP($B79&\"_\"&$C79,Hg_Min_Tests!$A$1:AAB$1000,R$1,FALSE)","v":"Dry FGD - Spray Dryer"},{"$f":"VLOOKUP($B79&\"_\"&$C79,Hg_Min_Tests!$A$1:AAC$1000,S$1,FALSE)","v":"Fabric Filter, reverse air"},{"$f":"VLOOKUP($B79&\"_\"&$C79,Hg_Min_Tests!$A$1:AAD$1000,T$1,FALSE)","v":""},{"$f":"VLOOKUP($B79&\"_\"&$C79,Hg_Min_Tests!$A$1:AAE$1000,U$1,FALSE)","v":""}]
[{"$f":"VLOOKUP(B80&\"_\"&C80,Hg_Min_Tests!$A:$AZ,6,FALSE)","v":"San Juan"},2451,"Unit 4","Unit 4","Mercury",3.4300000000000003E-8,"lb/MMBtu",3.5617775735294123E-7,"lb/MW","ETTS","",40,null,null,null,3.5617775735294121E-4,{"$f":"VLOOKUP(B80&\"_\"&C80,Hg_Min_Tests!$A$1:AA$1000,11,FALSE)","v":"Wall firing - opposed firing"},{"$f":"VLOOKUP($B80&\"_\"&$C80,Hg_Min_Tests!$A$1:AAB$1000,R$1,FALSE)","v":"Activated carbon injection"},{"$f":"VLOOKUP($B80&\"_\"&$C80,Hg_Min_Tests!$A$1:AAC$1000,S$1,FALSE)","v":"Fabric Filter, pulse"},{"$f":"VLOOKUP($B80&\"_\"&$C80,Hg_Min_Tests!$A$1:AAD$1000,T$1,FALSE)","v":"Wet FGD - Spray Type"},{"$f":"VLOOKUP($B80&\"_\"&$C80,Hg_Min_Tests!$A$1:AAE$1000,U$1,FALSE)","v":""}]
[{"$f":"VLOOKUP(B81&\"_\"&C81,Hg_Min_Tests!$A:$AZ,6,FALSE)","v":"San Juan"},2451,"Unit 4","Unit 4","Mercury",1.36E-7,"lb/MMBtu",1.4122500000000001E-6,"lb/MW","Part II","Unit 4 Mini Hg RATA 2009",40,null,null,null,1.4122500000000001E-3,{"$f":"VLOOKUP(B81&\"_\"&C81,Hg_Min_Tests!$A$1:AA$1000,11,FALSE)","v":"Wall firing - opposed firing"},{"$f":"VLOOKUP($B81&\"_\"&$C81,Hg_Min_Tests!$A$1:AAB$1000,R$1,FALSE)","v":"Activated carbon injection"},{"$f":"VLOOKUP($B81&\"_\"&$C81,Hg_Min_Tests!$A$1:AAC$1000,S$1,FALSE)","v":"Fabric Filter, pulse"},{"$f":"VLOOKUP($B81&\"_\"&$C81,Hg_Min_Tests!$A$1:AAD$1000,T$1,FALSE)","v":"Wet FGD - Spray Type"},{"$f":"VLOOKUP($B81&\"_\"&$C81,Hg_Min_Tests!$A$1:AAE$1000,U$1,FALSE)","v":""}]
[{"$f":"VLOOKUP(B82&\"_\"&C82,Hg_Min_Tests!$A:$AZ,6,FALSE)","v":"San Juan"},2451,"Unit 4","Unit 4","Mercury",3.4266666666666672E-7,"lb/MMBtu",3.5583161764705887E-6,"lb/MW","Part II","Unit 4 Mini Hg RATA 2008",40,null,null,null,3.5583161764705887E-3,{"$f":"VLOOKUP(B82&\"_\"&C82,Hg_Min_Tests!$A$1:AA$1000,11,FALSE)","v":"Wall firing - opposed firing"},{"$f":"VLOOKUP($B82&\"_\"&$C82,Hg_Min_Tests!$A$1:AAB$1000,R$1,FALSE)","v":"Activated carbon injection"},{"$f":"VLOOKUP($B82&\"_\"&$C82,Hg_Min_Tests!$A$1:AAC$1000,S$1,FALSE)","v":"Fabric Filter, pulse"},{"$f":"VLOOKUP($B82&\"_\"&$C82,Hg_Min_Tests!$A$1:AAD$1000,T$1,FALSE)","v":"Wet FGD - Spray Type"},{"$f":"VLOOKUP($B82&\"_\"&$C82,Hg_Min_Tests!$A$1:AAE$1000,U$1,FALSE)","v":""}]
[{"$f":"VLOOKUP(B83&\"_\"&C83,Hg_Min_Tests!$A:$AZ,6,FALSE)","v":"McMeekin"},3287,"MCM2","MCM002","Mercury",4.5298120846488614E-8,"lb/MMBtu",3.7793045824422661E-7,"lb/MW","ERT","",41,null,null,null,3.7793045824422659E-4,{"$f":"VLOOKUP(B83&\"_\"&C83,Hg_Min_Tests!$A$1:AA$1000,11,FALSE)","v":"Tangential firing"},{"$f":"VLOOKUP($B83&\"_\"&$C83,Hg_Min_Tests!$A$1:AAB$1000,R$1,FALSE)","v":"Fabric Filter, unspecified"},{"$f":"VLOOKUP($B83&\"_\"&$C83,Hg_Min_Tests!$A$1:AAC$1000,S$1,FALSE)","v":""},{"$f":"VLOOKUP($B83&\"_\"&$C83,Hg_Min_Tests!$A$1:AAD$1000,T$1,FALSE)","v":""},{"$f":"VLOOKUP($B83&\"_\"&$C83,Hg_Min_Tests!$A$1:AAE$1000,U$1,FALSE)","v":""}]
[{"$f":"VLOOKUP(B84&\"_\"&C84,Hg_Min_Tests!$A:$AZ,6,FALSE)","v":"McMeekin"},3287,"MCM2","MCM002","Mercury",8.8999999999999995E-7,"lb/MMBtu",7.4254318181818183E-6,"lb/MW","Part II","Hg-01/06-MCM2",41,null,null,null,7.425431818181818E-3,{"$f":"VLOOKUP(B84&\"_\"&C84,Hg_Min_Tests!$A$1:AA$1000,11,FALSE)","v":"Tangential firing"},{"$f":"VLOOKUP($B84&\"_\"&$C84,Hg_Min_Tests!$A$1:AAB$1000,R$1,FALSE)","v":"Fabric Filter, unspecified"},{"$f":"VLOOKUP($B84&\"_\"&$C84,Hg_Min_Tests!$A$1:AAC$1000,S$1,FALSE)","v":""},{"$f":"VLOOKUP($B84&\"_\"&$C84,Hg_Min_Tests!$A$1:AAD$1000,T$1,FALSE)","v":""},{"$f":"VLOOKUP($B84&\"_\"&$C84,Hg_Min_Tests!$A$1:AAE$1000,U$1,FALSE)","v":""}]
[{"$f":"VLOOKUP(B85&\"_\"&C85,Hg_Min_Tests!$A:$AZ,6,FALSE)","v":"Martin Drake"},492,"5","Unit 5 - Coal","Mercury",3.7500000000000005E-8,"lb/MMBtu",3.8863636363636368E-7,"lb/MW","ETTS","",42,null,null,null,3.8863636363636368E-4,{"$f":"VLOOKUP(B85&\"_\"&C85,Hg_Min_Tests!$A$1:AA$1000,11,FALSE)","v":"Wall firing - front firing"},{"$f":"VLOOKUP($B85&\"_\"&$C85,Hg_Min_Tests!$A$1:AAB$1000,R$1,FALSE)","v":"Fabric Filter, reverse air"},{"$f":"VLOOKUP($B85&\"_\"&$C85,Hg_Min_Tests!$A$1:AAC$1000,S$1,FALSE)","v":""},{"$f":"VLOOKUP($B85&\"_\"&$C85,Hg_Min_Tests!$A$1:AAD$1000,T$1,FALSE)","v":""},{"$f":"VLOOKUP($B85&\"_\"&$C85,Hg_Min_Tests!$A$1:AAE$1000,U$1,FALSE)","v":""}]
[{"$f":"VLOOKUP(B86&\"_\"&C86,Hg_Min_Tests!$A:$AZ,6,FALSE)","v":"Martin Drake"},492,"5","Unit 5 - Coal","Mercury",3.3666666666666669E-7,"lb/MMBtu",3.4890909090909092E-6,"lb/MW","Part II","APT CSU5384 D",42,null,null,null,3.4890909090909091E-3,{"$f":"VLOOKUP(B86&\"_\"&C86,Hg_Min_Tests!$A$1:AA$1000,11,FALSE)","v":"Wall firing - front firing"},{"$f":"VLOOKUP($B86&\"_\"&$C86,Hg_Min_Tests!$A$1:AAB$1000,R$1,FALSE)","v":"Fabric Filter, reverse air"},{"$f":"VLOOKUP($B86&\"_\"&$C86,Hg_Min_Tests!$A$1:AAC$1000,S$1,FALSE)","v":""},{"$f":"VLOOKUP($B86&\"_\"&$C86,Hg_Min_Tests!$A$1:AAD$1000,T$1,FALSE)","v":""},{"$f":"VLOOKUP($B86&\"_\"&$C86,Hg_Min_Tests!$A$1:AAE$1000,U$1,FALSE)","v":""}]
[{"$f":"VLOOKUP(B87&\"_\"&C87,Hg_Min_Tests!$A:$AZ,6,FALSE)","v":"Martin Drake"},492,"5","Unit 5 - Coal","Mercury",4.3299999999999997E-7,"lb/MMBtu",4.4874545454545454E-6,"lb/MW","Part II","Airtech 2480D",42,null,null,null,4.4874545454545453E-3,{"$f":"VLOOKUP(B87&\"_\"&C87,Hg_Min_Tests!$A$1:AA$1000,11,FALSE)","v":"Wall firing - front firing"},{"$f":"VLOOKUP($B87&\"_\"&$C87,Hg_Min_Tests!$A$1:AAB$1000,R$1,FALSE)","v":"Fabric Filter, reverse air"},{"$f":"VLOOKUP($B87&\"_\"&$C87,Hg_Min_Tests!$A$1:AAC$1000,S$1,FALSE)","v":""},{"$f":"VLOOKUP($B87&\"_\"&$C87,Hg_Min_Tests!$A$1:AAD$1000,T$1,FALSE)","v":""},{"$f":"VLOOKUP($B87&\"_\"&$C87,Hg_Min_Tests!$A$1:AAE$1000,U$1,FALSE)","v":""}]
[{"$f":"VLOOKUP(B88&\"_\"&C88,Hg_Min_Tests!$A:$AZ,6,FALSE)","v":"Canadys Steam"},3280,"CAN3","CAN003","Mercury",4.224E-8,"lb/MMBtu",4.1657772972972975E-7,"lb/MW","Part II","Hg-03/09-CAN3",43,null,null,null,4.1657772972972972E-4,{"$f":"VLOOKUP(B88&\"_\"&C88,Hg_Min_Tests!$A$1:AA$1000,11,FALSE)","v":"Wall firing - unspecified"},{"$f":"VLOOKUP($B88&\"_\"&$C88,Hg_Min_Tests!$A$1:AAB$1000,R$1,FALSE)","v":"Fabric Filter, unspecified"},{"$f":"VLOOKUP($B88&\"_\"&$C88,Hg_Min_Tests!$A$1:AAC$1000,S$1,FALSE)","v":""},{"$f":"VLOOKUP($B88&\"_\"&$C88,Hg_Min_Tests!$A$1:AAD$1000,T$1,FALSE)","v":""},{"$f":"VLOOKUP($B88&\"_\"&$C88,Hg_Min_Tests!$A$1:AAE$1000,U$1,FALSE)","v":""}]
[{"$f":"VLOOKUP(B89&\"_\"&C89,Hg_Min_Tests!$A:$AZ,6,FALSE)","v":"Canadys Steam"},3280,"CAN3","CAN003","Mercury",4.3387113091501101E-8,"lb/MMBtu",4.2789074505645274E-7,"lb/MW","ERT","",43,null,null,null,4.2789074505645273E-4,{"$f":"VLOOKUP(B89&\"_\"&C89,Hg_Min_Tests!$A$1:AA$1000,11,FALSE)","v":"Wall firing - unspecified"},{"$f":"VLOOKUP($B89&\"_\"&$C89,Hg_Min_Tests!$A$1:AAB$1000,R$1,FALSE)","v":"Fabric Filter, unspecified"},{"$f":"VLOOKUP($B89&\"_\"&$C89,Hg_Min_Tests!$A$1:AAC$1000,S$1,FALSE)","v":""},{"$f":"VLOOKUP($B89&\"_\"&$C89,Hg_Min_Tests!$A$1:AAD$1000,T$1,FALSE)","v":""},{"$f":"VLOOKUP($B89&\"_\"&$C89,Hg_Min_Tests!$A$1:AAE$1000,U$1,FALSE)","v":""}]
[{"$f":"VLOOKUP(B90&\"_\"&C90,Hg_Min_Tests!$A:$AZ,6,FALSE)","v":"Canadys Steam"},3280,"CAN3","CAN003","Mercury",7.0000000000000005E-8,"lb/MMBtu",6.903513513513514E-7,"lb/MW","Part II","Hg-01/06-CAN3",43,null,null,null,6.9035135135135141E-4,{"$f":"VLOOKUP(B90&\"_\"&C90,Hg_Min_Tests!$A$1:AA$1000,11,FALSE)","v":"Wall firing - unspecified"},{"$f":"VLOOKUP($B90&\"_\"&$C90,Hg_Min_Tests!$A$1:AAB$1000,R$1,FALSE)","v":"Fabric Filter, unspecified"},{"$f":"VLOOKUP($B90&\"_\"&$C90,Hg_Min_Tests!$A$1:AAC$1000,S$1,FALSE)","v":""},{"$f":"VLOOKUP($B90&\"_\"&$C90,Hg_Min_Tests!$A$1:AAD$1000,T$1,FALSE)","v":""},{"$f":"VLOOKUP($B90&\"_\"&$C90,Hg_Min_Tests!$A$1:AAE$1000,U$1,FALSE)","v":""}]
[{"$f":"VLOOKUP(B91&\"_\"&C91,Hg_Min_Tests!$A:$AZ,6,FALSE)","v":"Canadys Steam"},3280,"CAN3","CAN003","Mercury",2.2999999999999999E-7,"lb/MMBtu",2.2682972972972973E-6,"lb/MW","Part II","Hg-02/06-CAN3",43,null,null,null,2.2682972972972973E-3,{"$f":"VLOOKUP(B91&\"_\"&C91,Hg_Min_Tests!$A$1:AA$1000,11,FALSE)","v":"Wall firing - unspecified"},{"$f":"VLOOKUP($B91&\"_\"&$C91,Hg_Min_Tests!$A$1:AAB$1000,R$1,FALSE)","v":"Fabric Filter, unspecified"},{"$f":"VLOOKUP($B91&\"_\"&$C91,Hg_Min_Tests!$A$1:AAC$1000,S$1,FALSE)","v":""},{"$f":"VLOOKUP($B91&\"_\"&$C91,Hg_Min_Tests!$A$1:AAD$1000,T$1,FALSE)","v":""},{"$f":"VLOOKUP($B91&\"_\"&$C91,Hg_Min_Tests!$A$1:AAE$1000,U$1,FALSE)","v":""}]
[{"$f":"VLOOKUP(B92&\"_\"&C92,Hg_Min_Tests!$A:$AZ,6,FALSE)","v":"Scrubgrass Generating Company L.P."},50974,"#1 CFB boiler","Gen 1","Mercury",3.5299999999999998E-8,"lb/MMBtu",4.5489690721649483E-7,"lb/MW","ETTS","",44,null,null,null,4.5489690721649484E-4,{"$f":"VLOOKUP(B92&\"_\"&C92,Hg_Min_Tests!$A$1:AA$1000,11,FALSE)","v":"Fluidized bed firing"},{"$f":"VLOOKUP($B92&\"_\"&$C92,Hg_Min_Tests!$A$1:AAB$1000,R$1,FALSE)","v":"Selective Noncatalytic Reduction"},{"$f":"VLOOKUP($B92&\"_\"&$C92,Hg_Min_Tests!$A$1:AAC$1000,S$1,FALSE)","v":"Selective Noncatalytic Reduction"},{"$f":"VLOOKUP($B92&\"_\"&$C92,Hg_Min_Tests!$A$1:AAD$1000,T$1,FALSE)","v":"Fabric Filter, pulse"},{"$f":"VLOOKUP($B92&\"_\"&$C92,Hg_Min_Tests!$A$1:AAE$1000,U$1,FALSE)","v":"Fabric Filter, pulse"}]
[{"$f":"VLOOKUP(B93&\"_\"&C93,Hg_Min_Tests!$A:$AZ,6,FALSE)","v":"Scrubgrass Generating Company L.P."},50974,"#1 CFB boiler","Gen 1","Mercury",5.6000000000000004E-7,"lb/MMBtu",7.2164948453608251E-6,"lb/MW","Part II","12/13/2005 Waste Bituminous Coal Baseline Testing",44,null,null,null,7.2164948453608251E-3,{"$f":"VLOOKUP(B93&\"_\"&C93,Hg_Min_Tests!$A$1:AA$1000,11,FALSE)","v":"Fluidized bed firing"},{"$f":"VLOOKUP($B93&\"_\"&$C93,Hg_Min_Tests!$A$1:AAB$1000,R$1,FALSE)","v":"Selective Noncatalytic Reduction"},{"$f":"VLOOKUP($B93&\"_\"&$C93,Hg_Min_Tests!$A$1:AAC$1000,S$1,FALSE)","v":"Selective Noncatalytic Reduction"},{"$f":"VLOOKUP($B93&\"_\"&$C93,Hg_Min_Tests!$A$1:AAD$1000,T$1,FALSE)","v":"Fabric Filter, pulse"},{"$f":"VLOOKUP($B93&\"_\"&$C93,Hg_Min_Tests!$A$1:AAE$1000,U$1,FALSE)","v":"Fabric Filter, pulse"}]
[{"$f":"VLOOKUP(B94&\"_\"&C94,Hg_Min_Tests!$A:$AZ,6,FALSE)","v":"Scrubgrass Generating Company L.P."},50974,"#1 CFB boiler","Gen 1","Mercury",3.0000000000000001E-6,"lb/MMBtu",3.8659793814432993E-5,"lb/MW","Part II","common stack test 3-2-2005",44,null,null,null,3.8659793814432991E-2,{"$f":"VLOOKUP(B94&\"_\"&C94,Hg_Min_Tests!$A$1:AA$1000,11,FALSE)","v":"Fluidized bed firing"},{"$f":"VLOOKUP($B94&\"_\"&$C94,Hg_Min_Tests!$A$1:AAB$1000,R$1,FALSE)","v":"Selective Noncatalytic Reduction"},{"$f":"VLOOKUP($B94&\"_\"&$C94,Hg_Min_Tests!$A$1:AAC$1000,S$1,FALSE)","v":"Selective Noncatalytic Reduction"},{"$f":"VLOOKUP($B94&\"_\"&$C94,Hg_Min_Tests!$A$1:AAD$1000,T$1,FALSE)","v":"Fabric Filter, pulse"},{"$f":"VLOOKUP($B94&\"_\"&$C94,Hg_Min_Tests!$A$1:AAE$1000,U$1,FALSE)","v":"Fabric Filter, pulse"}]
[{"$f":"VLOOKUP(B95&\"_\"&C95,Hg_Min_Tests!$A:$AZ,6,FALSE)","v":"Scrubgrass Generating Company L.P."},50974,"#2 CFB Boiler","Gen 1","Mercury",3.5299999999999998E-8,"lb/MMBtu",4.5489690721649483E-7,"lb/MW","ETTS","",45,null,null,null,4.5489690721649484E-4,{"$f":"VLOOKUP(B95&\"_\"&C95,Hg_Min_Tests!$A$1:AA$1000,11,FALSE)","v":"Fluidized bed firing"},{"$f":"VLOOKUP($B95&\"_\"&$C95,Hg_Min_Tests!$A$1:AAB$1000,R$1,FALSE)","v":"Selective Noncatalytic Reduction"},{"$f":"VLOOKUP($B95&\"_\"&$C95,Hg_Min_Tests!$A$1:AAC$1000,S$1,FALSE)","v":"Selective Noncatalytic Reduction"},{"$f":"VLOOKUP($B95&\"_\"&$C95,Hg_Min_Tests!$A$1:AAD$1000,T$1,FALSE)","v":"Fabric Filter, pulse"},{"$f":"VLOOKUP($B95&\"_\"&$C95,Hg_Min_Tests!$A$1:AAE$1000,U$1,FALSE)","v":"Fabric Filter, pulse"}]
[{"$f":"VLOOKUP(B96&\"_\"&C96,Hg_Min_Tests!$A:$AZ,6,FALSE)","v":"Scrubgrass Generating Company L.P."},50974,"#2 CFB Boiler","Gen 1","Mercury",5.6000000000000004E-7,"lb/MMBtu",7.2164948453608251E-6,"lb/MW","Part II","12/13/2005 Waste Bituminous Coal Baseline Testing",45,null,null,null,7.2164948453608251E-3,{"$f":"VLOOKUP(B96&\"_\"&C96,Hg_Min_Tests!$A$1:AA$1000,11,FALSE)","v":"Fluidized bed firing"},{"$f":"VLOOKUP($B96&\"_\"&$C96,Hg_Min_Tests!$A$1:AAB$1000,R$1,FALSE)","v":"Selective Noncatalytic Reduction"},{"$f":"VLOOKUP($B96&\"_\"&$C96,Hg_Min_Tests!$A$1:AAC$1000,S$1,FALSE)","v":"Selective Noncatalytic Reduction"},{"$f":"VLOOKUP($B96&\"_\"&$C96,Hg_Min_Tests!$A$1:AAD$1000,T$1,FALSE)","v":"Fabric Filter, pulse"},{"$f":"VLOOKUP($B96&\"_\"&$C96,Hg_Min_Tests!$A$1:AAE$1000,U$1,FALSE)","v":"Fabric Filter, pulse"}]
[{"$f":"VLOOKUP(B97&\"_\"&C97,Hg_Min_Tests!$A:$AZ,6,FALSE)","v":"Scrubgrass Generating Company L.P."},50974,"#2 CFB Boiler","Gen 1","Mercury",3.0000000000000001E-6,"lb/MMBtu",3.8659793814432993E-5,"lb/MW","Part II","common stack test 3-2-2005",45,null,null,null,3.8659793814432991E-2,{"$f":"VLOOKUP(B97&\"_\"&C97,Hg_Min_Tests!$A$1:AA$1000,11,FALSE)","v":"Fluidized bed firing"},{"$f":"VLOOKUP($B97&\"_\"&$C97,Hg_Min_Tests!$A$1:AAB$1000,R$1,FALSE)","v":"Selective Noncatalytic Reduction"},{"$f":"VLOOKUP($B97&\"_\"&$C97,Hg_Min_Tests!$A$1:AAC$1000,S$1,FALSE)","v":"Selective Noncatalytic Reduction"},{"$f":"VLOOKUP($B97&\"_\"&$C97,Hg_Min_Tests!$A$1:AAD$1000,T$1,FALSE)","v":"Fabric Filter, pulse"},{"$f":"VLOOKUP($B97&\"_\"&$C97,Hg_Min_Tests!$A$1:AAE$1000,U$1,FALSE)","v":"Fabric Filter, pulse"}]
[{"$f":"VLOOKUP(B98&\"_\"&C98,Hg_Min_Tests!$A:$AZ,6,FALSE)","v":"Valmont"},477,"5","Unit 5","Mercury",4.9993927304857498E-8,"lb/MMBtu",4.7060610141562286E-7,"lb/MW","Part II","VAL5 Hg Jul09",46,null,null,null,4.7060610141562285E-4,{"$f":"VLOOKUP(B98&\"_\"&C98,Hg_Min_Tests!$A$1:AA$1000,11,FALSE)","v":"Tangential firing"},{"$f":"VLOOKUP($B98&\"_\"&$C98,Hg_Min_Tests!$A$1:AAB$1000,R$1,FALSE)","v":"Dry FGD - Spray Dryer"},{"$f":"VLOOKUP($B98&\"_\"&$C98,Hg_Min_Tests!$A$1:AAC$1000,S$1,FALSE)","v":"Fabric Filter, reverse air"},{"$f":"VLOOKUP($B98&\"_\"&$C98,Hg_Min_Tests!$A$1:AAD$1000,T$1,FALSE)","v":""},{"$f":"VLOOKUP($B98&\"_\"&$C98,Hg_Min_Tests!$A$1:AAE$1000,U$1,FALSE)","v":""}]
[{"$f":"VLOOKUP(B99&\"_\"&C99,Hg_Min_Tests!$A:$AZ,6,FALSE)","v":"Valmont"},477,"5","Unit 5","Mercury",5.8999999999999996E-7,"lb/MMBtu",5.5538265306122443E-6,"lb/MW","Part II","VAL5 Hg Jan08",46,null,null,null,5.5538265306122447E-3,{"$f":"VLOOKUP(B99&\"_\"&C99,Hg_Min_Tests!$A$1:AA$1000,11,FALSE)","v":"Tangential firing"},{"$f":"VLOOKUP($B99&\"_\"&$C99,Hg_Min_Tests!$A$1:AAB$1000,R$1,FALSE)","v":"Dry FGD - Spray Dryer"},{"$f":"VLOOKUP($B99&\"_\"&$C99,Hg_Min_Tests!$A$1:AAC$1000,S$1,FALSE)","v":"Fabric Filter, reverse air"},{"$f":"VLOOKUP($B99&\"_\"&$C99,Hg_Min_Tests!$A$1:AAD$1000,T$1,FALSE)","v":""},{"$f":"VLOOKUP($B99&\"_\"&$C99,Hg_Min_Tests!$A$1:AAE$1000,U$1,FALSE)","v":""}]
[{"$f":"VLOOKUP(B100&\"_\"&C100,Hg_Min_Tests!$A:$AZ,6,FALSE)","v":"San Juan"},2451,"Unit 3","Unit 3","Mercury",4.6833333333333342E-8,"lb/MMBtu",4.9571017156862753E-7,"lb/MW","ETTS","",47,null,null,null,4.9571017156862748E-4,{"$f":"VLOOKUP(B100&\"_\"&C100,Hg_Min_Tests!$A$1:AA$1000,11,FALSE)","v":"Wall firing - opposed firing"},{"$f":"VLOOKUP($B100&\"_\"&$C100,Hg_Min_Tests!$A$1:AAB$1000,R$1,FALSE)","v":"Activated carbon injection"},{"$f":"VLOOKUP($B100&\"_\"&$C100,Hg_Min_Tests!$A$1:AAC$1000,S$1,FALSE)","v":"Fabric Filter, pulse"},{"$f":"VLOOKUP($B100&\"_\"&$C100,Hg_Min_Tests!$A$1:AAD$1000,T$1,FALSE)","v":"Wet FGD - Spray Type"},{"$f":"VLOOKUP($B100&\"_\"&$C100,Hg_Min_Tests!$A$1:AAE$1000,U$1,FALSE)","v":""}]
[{"$f":"VLOOKUP(B101&\"_\"&C101,Hg_Min_Tests!$A:$AZ,6,FALSE)","v":"San Juan"},2451,"Unit 3","Unit 3","Mercury",2.4999999999999999E-7,"lb/MMBtu",2.6461397058823528E-6,"lb/MW","Part II","Unit 3 Mini Hg RATA 2009",47,null,null,null,2.646139705882353E-3,{"$f":"VLOOKUP(B101&\"_\"&C101,Hg_Min_Tests!$A$1:AA$1000,11,FALSE)","v":"Wall firing - opposed firing"},{"$f":"VLOOKUP($B101&\"_\"&$C101,Hg_Min_Tests!$A$1:AAB$1000,R$1,FALSE)","v":"Activated carbon injection"},{"$f":"VLOOKUP($B101&\"_\"&$C101,Hg_Min_Tests!$A$1:AAC$1000,S$1,FALSE)","v":"Fabric Filter, pulse"},{"$f":"VLOOKUP($B101&\"_\"&$C101,Hg_Min_Tests!$A$1:AAD$1000,T$1,FALSE)","v":"Wet FGD - Spray Type"},{"$f":"VLOOKUP($B101&\"_\"&$C101,Hg_Min_Tests!$A$1:AAE$1000,U$1,FALSE)","v":""}]
[{"$f":"VLOOKUP(B102&\"_\"&C102,Hg_Min_Tests!$A:$AZ,6,FALSE)","v":"AES Shady Point,LLC"},10671,"1b","Unit 1","Mercury",3.6666666666666671E-8,"lb/MMBtu",5.0894939145645751E-7,"lb/MW","ETTS","",48,null,null,null,5.089493914564575E-4,{"$f":"VLOOKUP(B102&\"_\"&C102,Hg_Min_Tests!$A$1:AA$1000,11,FALSE)","v":"Fluidized bed firing"},{"$f":"VLOOKUP($B102&\"_\"&$C102,Hg_Min_Tests!$A$1:AAB$1000,R$1,FALSE)","v":"Fabric Filter, pulse"},{"$f":"VLOOKUP($B102&\"_\"&$C102,Hg_Min_Tests!$A$1:AAC$1000,S$1,FALSE)","v":""},{"$f":"VLOOKUP($B102&\"_\"&$C102,Hg_Min_Tests!$A$1:AAD$1000,T$1,FALSE)","v":""},{"$f":"VLOOKUP($B102&\"_\"&$C102,Hg_Min_Tests!$A$1:AAE$1000,U$1,FALSE)","v":""}]
[{"$f":"VLOOKUP(B103&\"_\"&C103,Hg_Min_Tests!$A:$AZ,6,FALSE)","v":"AES Shady Point,LLC"},10671,"1A","Unit 1","Mercury",3.6666666666666671E-8,"lb/MMBtu",5.0894939145645751E-7,"lb/MW","ETTS","",49,null,null,null,5.089493914564575E-4,{"$f":"VLOOKUP(B103&\"_\"&C103,Hg_Min_Tests!$A$1:AA$1000,11,FALSE)","v":"Fluidized bed firing"},{"$f":"VLOOKUP($B103&\"_\"&$C103,Hg_Min_Tests!$A$1:AAB$1000,R$1,FALSE)","v":"Fabric Filter, pulse"},{"$f":"VLOOKUP($B103&\"_\"&$C103,Hg_Min_Tests!$A$1:AAC$1000,S$1,FALSE)","v":""},{"$f":"VLOOKUP($B103&\"_\"&$C103,Hg_Min_Tests!$A$1:AAD$1000,T$1,FALSE)","v":""},{"$f":"VLOOKUP($B103&\"_\"&$C103,Hg_Min_Tests!$A$1:AAE$1000,U$1,FALSE)","v":""}]
[{"$f":"VLOOKUP(B104&\"_\"&C104,Hg_Min_Tests!$A:$AZ,6,FALSE)","v":"AES Shady Point,LLC"},10671,"2b","Unit 2","Mercury",3.6666666666666671E-8,"lb/MMBtu",5.0894939145645751E-7,"lb/MW","ETTS","",50,null,null,null,5.089493914564575E-4,{"$f":"VLOOKUP(B104&\"_\"&C104,Hg_Min_Tests!$A$1:AA$1000,11,FALSE)","v":"Fluidized bed firing"},{"$f":"VLOOKUP($B104&\"_\"&$C104,Hg_Min_Tests!$A$1:AAB$1000,R$1,FALSE)","v":"Fabric Filter, pulse"},{"$f":"VLOOKUP($B104&\"_\"&$C104,Hg_Min_Tests!$A$1:AAC$1000,S$1,FALSE)","v":""},{"$f":"VLOOKUP($B104&\"_\"&$C104,Hg_Min_Tests!$A$1:AAD$1000,T$1,FALSE)","v":""},{"$f":"VLOOKUP($B104&\"_\"&$C104,Hg_Min_Tests!$A$1:AAE$1000,U$1,FALSE)","v":""}]
[{"$f":"VLOOKUP(B105&\"_\"&C105,Hg_Min_Tests!$A:$AZ,6,FALSE)","v":"AES Shady Point,LLC"},10671,"2a","Unit 2","Mercury",3.6666666666666671E-8,"lb/MMBtu",5.0894939145645751E-7,"lb/MW","ETTS","",51,null,null,null,5.089493914564575E-4,{"$f":"VLOOKUP(B105&\"_\"&C105,Hg_Min_Tests!$A$1:AA$1000,11,FALSE)","v":"Fluidized bed firing"},{"$f":"VLOOKUP($B105&\"_\"&$C105,Hg_Min_Tests!$A$1:AAB$1000,R$1,FALSE)","v":"Fabric Filter, pulse"},{"$f":"VLOOKUP($B105&\"_\"&$C105,Hg_Min_Tests!$A$1:AAC$1000,S$1,FALSE)","v":""},{"$f":"VLOOKUP($B105&\"_\"&$C105,Hg_Min_Tests!$A$1:AAD$1000,T$1,FALSE)","v":""},{"$f":"VLOOKUP($B105&\"_\"&$C105,Hg_Min_Tests!$A$1:AAE$1000,U$1,FALSE)","v":""}]
[{"$f":"VLOOKUP(B106&\"_\"&C106,Hg_Min_Tests!$A:$AZ,6,FALSE)","v":"Mount Tom"},1606,"1","1 current","Mercury",5.5500000000000001E-8,"lb/MMBtu",5.2993548387096773E-7,"lb/MW","Part II","Turbosorp - initial compliance test",52,null,null,null,5.2993548387096775E-4,{"$f":"VLOOKUP(B106&\"_\"&C106,Hg_Min_Tests!$A$1:AA$1000,11,FALSE)","v":"Wall firing - front firing"},{"$f":"VLOOKUP($B106&\"_\"&$C106,Hg_Min_Tests!$A$1:AAB$1000,R$1,FALSE)","v":"Selective Catalytic Reduction"},{"$f":"VLOOKUP($B106&\"_\"&$C106,Hg_Min_Tests!$A$1:AAC$1000,S$1,FALSE)","v":"Electrostatic precipitator, cold side, w/o flue gas conditioning"},{"$f":"VLOOKUP($B106&\"_\"&$C106,Hg_Min_Tests!$A$1:AAD$1000,T$1,FALSE)","v":"Dry FGD - Circulating Dry Scrubber"},{"$f":"VLOOKUP($B106&\"_\"&$C106,Hg_Min_Tests!$A$1:AAE$1000,U$1,FALSE)","v":"Fabric Filter, pulse"}]
[{"$f":"VLOOKUP(B107&\"_\"&C107,Hg_Min_Tests!$A:$AZ,6,FALSE)","v":"PANTHER CREEK ENERGY FACILITY"},50776,"BLR1","BG1","Mercury",4.1333333333333333E-8,"lb/MMBtu",5.3333333333333334E-7,"lb/MW","ETTS","",53,null,null,null,5.3333333333333336E-4,{"$f":"VLOOKUP(B107&\"_\"&C107,Hg_Min_Tests!$A$1:AA$1000,11,FALSE)","v":"Fluidized bed firing"},{"$f":"VLOOKUP($B107&\"_\"&$C107,Hg_Min_Tests!$A$1:AAB$1000,R$1,FALSE)","v":"Selective Noncatalytic Reduction"},{"$f":"VLOOKUP($B107&\"_\"&$C107,Hg_Min_Tests!$A$1:AAC$1000,S$1,FALSE)","v":"Fabric Filter, pulse"},{"$f":"VLOOKUP($B107&\"_\"&$C107,Hg_Min_Tests!$A$1:AAD$1000,T$1,FALSE)","v":""},{"$f":"VLOOKUP($B107&\"_\"&$C107,Hg_Min_Tests!$A$1:AAE$1000,U$1,FALSE)","v":""}]
[{"$f":"VLOOKUP(B108&\"_\"&C108,Hg_Min_Tests!$A:$AZ,6,FALSE)","v":"PANTHER CREEK ENERGY FACILITY"},50776,"BLR1","BG1","Mercury",8.1000000000000011E-8,"lb/MMBtu",1.0451612903225808E-6,"lb/MW","Part II","B1 Hg 12/2008",53,null,null,null,1.0451612903225808E-3,{"$f":"VLOOKUP(B108&\"_\"&C108,Hg_Min_Tests!$A$1:AA$1000,11,FALSE)","v":"Fluidized bed firing"},{"$f":"VLOOKUP($B108&\"_\"&$C108,Hg_Min_Tests!$A$1:AAB$1000,R$1,FALSE)","v":"Selective Noncatalytic Reduction"},{"$f":"VLOOKUP($B108&\"_\"&$C108,Hg_Min_Tests!$A$1:AAC$1000,S$1,FALSE)","v":"Fabric Filter, pulse"},{"$f":"VLOOKUP($B108&\"_\"&$C108,Hg_Min_Tests!$A$1:AAD$1000,T$1,FALSE)","v":""},{"$f":"VLOOKUP($B108&\"_\"&$C108,Hg_Min_Tests!$A$1:AAE$1000,U$1,FALSE)","v":""}]
[{"$f":"VLOOKUP(B109&\"_\"&C109,Hg_Min_Tests!$A:$AZ,6,FALSE)","v":"PANTHER CREEK ENERGY FACILITY"},50776,"BLR1","BG1","Mercury",1.8000000000000002E-7,"lb/MMBtu",2.3225806451612903E-6,"lb/MW","Part II","B1 Hg 06/2008",53,null,null,null,2.3225806451612901E-3,{"$f":"VLOOKUP(B109&\"_\"&C109,Hg_Min_Tests!$A$1:AA$1000,11,FALSE)","v":"Fluidized bed firing"},{"$f":"VLOOKUP($B109&\"_\"&$C109,Hg_Min_Tests!$A$1:AAB$1000,R$1,FALSE)","v":"Selective Noncatalytic Reduction"},{"$f":"VLOOKUP($B109&\"_\"&$C109,Hg_Min_Tests!$A$1:AAC$1000,S$1,FALSE)","v":"Fabric Filter, pulse"},{"$f":"VLOOKUP($B109&\"_\"&$C109,Hg_Min_Tests!$A$1:AAD$1000,T$1,FALSE)","v":""},{"$f":"VLOOKUP($B109&\"_\"&$C109,Hg_Min_Tests!$A$1:AAE$1000,U$1,FALSE)","v":""}]
[{"$f":"VLOOKUP(B110&\"_\"&C110,Hg_Min_Tests!$A:$AZ,6,FALSE)","v":"PANTHER CREEK ENERGY FACILITY"},50776,"BLR2","BG2","Mercury",4.1333333333333333E-8,"lb/MMBtu",5.3333333333333334E-7,"lb/MW","ETTS","",54,null,null,null,5.3333333333333336E-4,{"$f":"VLOOKUP(B110&\"_\"&C110,Hg_Min_Tests!$A$1:AA$1000,11,FALSE)","v":"Fluidized bed firing"},{"$f":"VLOOKUP($B110&\"_\"&$C110,Hg_Min_Tests!$A$1:AAB$1000,R$1,FALSE)","v":"Selective Noncatalytic Reduction"},{"$f":"VLOOKUP($B110&\"_\"&$C110,Hg_Min_Tests!$A$1:AAC$1000,S$1,FALSE)","v":"Fabric Filter, pulse"},{"$f":"VLOOKUP($B110&\"_\"&$C110,Hg_Min_Tests!$A$1:AAD$1000,T$1,FALSE)","v":""},{"$f":"VLOOKUP($B110&\"_\"&$C110,Hg_Min_Tests!$A$1:AAE$1000,U$1,FALSE)","v":""}]
[{"$f":"VLOOKUP(B111&\"_\"&C111,Hg_Min_Tests!$A:$AZ,6,FALSE)","v":"PANTHER CREEK ENERGY FACILITY"},50776,"BLR2","BG2","Mercury",5.9833333333333333E-8,"lb/MMBtu",7.7204301075268812E-7,"lb/MW","Part II","B2 Hg 12/2008",54,null,null,null,7.7204301075268816E-4,{"$f":"VLOOKUP(B111&\"_\"&C111,Hg_Min_Tests!$A$1:AA$1000,11,FALSE)","v":"Fluidized bed firing"},{"$f":"VLOOKUP($B111&\"_\"&$C111,Hg_Min_Tests!$A$1:AAB$1000,R$1,FALSE)","v":"Selective Noncatalytic Reduction"},{"$f":"VLOOKUP($B111&\"_\"&$C111,Hg_Min_Tests!$A$1:AAC$1000,S$1,FALSE)","v":"Fabric Filter, pulse"},{"$f":"VLOOKUP($B111&\"_\"&$C111,Hg_Min_Tests!$A$1:AAD$1000,T$1,FALSE)","v":""},{"$f":"VLOOKUP($B111&\"_\"&$C111,Hg_Min_Tests!$A$1:AAE$1000,U$1,FALSE)","v":""}]
[{"$f":"VLOOKUP(B112&\"_\"&C112,Hg_Min_Tests!$A:$AZ,6,FALSE)","v":"PANTHER CREEK ENERGY FACILITY"},50776,"BLR2","BG2","Mercury",1.275E-7,"lb/MMBtu",1.6451612903225806E-6,"lb/MW","Part II","B2 Hg 06/2008",54,null,null,null,1.6451612903225804E-3,{"$f":"VLOOKUP(B112&\"_\"&C112,Hg_Min_Tests!$A$1:AA$1000,11,FALSE)","v":"Fluidized bed firing"},{"$f":"VLOOKUP($B112&\"_\"&$C112,Hg_Min_Tests!$A$1:AAB$1000,R$1,FALSE)","v":"Selective Noncatalytic Reduction"},{"$f":"VLOOKUP($B112&\"_\"&$C112,Hg_Min_Tests!$A$1:AAC$1000,S$1,FALSE)","v":"Fabric Filter, pulse"},{"$f":"VLOOKUP($B112&\"_\"&$C112,Hg_Min_Tests!$A$1:AAD$1000,T$1,FALSE)","v":""},{"$f":"VLOOKUP($B112&\"_\"&$C112,Hg_Min_Tests!$A$1:AAE$1000,U$1,FALSE)","v":""}]
[{"$f":"VLOOKUP(B113&\"_\"&C113,Hg_Min_Tests!$A:$AZ,6,FALSE)","v":"PSEG Mercer Generating Station"},2408,"E1","MERU1E1PT1OS1-Coal","Mercury",5.9130000000000001E-8,"lb/MMBtu",5.3441107871720119E-7,"lb/MW","Part II","EG08004-4Q",55,null,null,null,5.344110787172012E-4,{"$f":"VLOOKUP(B113&\"_\"&C113,Hg_Min_Tests!$A$1:AA$1000,11,FALSE)","v":"Wall firing - unspecified"},{"$f":"VLOOKUP($B113&\"_\"&$C113,Hg_Min_Tests!$A$1:AAB$1000,R$1,FALSE)","v":"Electrostatic precipitator, cold side, w/ flue gas conditioning"},{"$f":"VLOOKUP($B113&\"_\"&$C113,Hg_Min_Tests!$A$1:AAC$1000,S$1,FALSE)","v":"Selective Catalytic Reduction"},{"$f":"VLOOKUP($B113&\"_\"&$C113,Hg_Min_Tests!$A$1:AAD$1000,T$1,FALSE)","v":"Activated carbon injection"},{"$f":"VLOOKUP($B113&\"_\"&$C113,Hg_Min_Tests!$A$1:AAE$1000,U$1,FALSE)","v":"Fabric Filter, pulse"}]
[{"$f":"VLOOKUP(B114&\"_\"&C114,Hg_Min_Tests!$A:$AZ,6,FALSE)","v":"PSEG Mercer Generating Station"},2408,"E1","MERU1E1PT1OS1-Coal","Mercury",2.6323333333333333E-7,"lb/MMBtu",2.3790767735665695E-6,"lb/MW","Part II","MER1-2 4Q2009 Hg PM10 ST Co NG",55,null,null,null,2.3790767735665697E-3,{"$f":"VLOOKUP(B114&\"_\"&C114,Hg_Min_Tests!$A$1:AA$1000,11,FALSE)","v":"Wall firing - unspecified"},{"$f":"VLOOKUP($B114&\"_\"&$C114,Hg_Min_Tests!$A$1:AAB$1000,R$1,FALSE)","v":"Electrostatic precipitator, cold side, w/ flue gas conditioning"},{"$f":"VLOOKUP($B114&\"_\"&$C114,Hg_Min_Tests!$A$1:AAC$1000,S$1,FALSE)","v":"Selective Catalytic Reduction"},{"$f":"VLOOKUP($B114&\"_\"&$C114,Hg_Min_Tests!$A$1:AAD$1000,T$1,FALSE)","v":"Activated carbon injection"},{"$f":"VLOOKUP($B114&\"_\"&$C114,Hg_Min_Tests!$A$1:AAE$1000,U$1,FALSE)","v":"Fabric Filter, pulse"}]
[{"$f":"VLOOKUP(B115&\"_\"&C115,Hg_Min_Tests!$A:$AZ,6,FALSE)","v":"PSEG Mercer Generating Station"},2408,"E1","MERU1E1PT1OS1-Coal","Mercury",3.1833333333333334E-7,"lb/MMBtu",2.8770651117589891E-6,"lb/MW","ETTS","",55,null,null,null,2.877065111758989E-3,{"$f":"VLOOKUP(B115&\"_\"&C115,Hg_Min_Tests!$A$1:AA$1000,11,FALSE)","v":"Wall firing - unspecified"},{"$f":"VLOOKUP($B115&\"_\"&$C115,Hg_Min_Tests!$A$1:AAB$1000,R$1,FALSE)","v":"Electrostatic precipitator, cold side, w/ flue gas conditioning"},{"$f":"VLOOKUP($B115&\"_\"&$C115,Hg_Min_Tests!$A$1:AAC$1000,S$1,FALSE)","v":"Selective Catalytic Reduction"},{"$f":"VLOOKUP($B115&\"_\"&$C115,Hg_Min_Tests!$A$1:AAD$1000,T$1,FALSE)","v":"Activated carbon injection"},{"$f":"VLOOKUP($B115&\"_\"&$C115,Hg_Min_Tests!$A$1:AAE$1000,U$1,FALSE)","v":"Fabric Filter, pulse"}]
[{"$f":"VLOOKUP(B116&\"_\"&C116,Hg_Min_Tests!$A:$AZ,6,FALSE)","v":"PSEG Mercer Generating Station"},2408,"E1","MERU1E1PT1OS1-Coal","Mercury",7.6296666666666674E-7,"lb/MMBtu",6.8956171039844509E-6,"lb/MW","Part II","MER1-2 3Q2009 STCo NG",55,null,null,null,6.895617103984451E-3,{"$f":"VLOOKUP(B116&\"_\"&C116,Hg_Min_Tests!$A$1:AA$1000,11,FALSE)","v":"Wall firing - unspecified"},{"$f":"VLOOKUP($B116&\"_\"&$C116,Hg_Min_Tests!$A$1:AAB$1000,R$1,FALSE)","v":"Electrostatic precipitator, cold side, w/ flue gas conditioning"},{"$f":"VLOOKUP($B116&\"_\"&$C116,Hg_Min_Tests!$A$1:AAC$1000,S$1,FALSE)","v":"Selective Catalytic Reduction"},{"$f":"VLOOKUP($B116&\"_\"&$C116,Hg_Min_Tests!$A$1:AAD$1000,T$1,FALSE)","v":"Activated carbon injection"},{"$f":"VLOOKUP($B116&\"_\"&$C116,Hg_Min_Tests!$A$1:AAE$1000,U$1,FALSE)","v":"Fabric Filter, pulse"}]
[{"$f":"VLOOKUP(B117&\"_\"&C117,Hg_Min_Tests!$A:$AZ,6,FALSE)","v":"PSEG Mercer Generating Station"},2408,"E1","MERU1E1PT1OS1-Coal","Mercury",7.8140000000000005E-7,"lb/MMBtu",7.0622157434402335E-6,"lb/MW","Part II","MER1-2 1Q2009 ST Co HgPM10",55,null,null,null,7.0622157434402331E-3,{"$f":"VLOOKUP(B117&\"_\"&C117,Hg_Min_Tests!$A$1:AA$1000,11,FALSE)","v":"Wall firing - unspecified"},{"$f":"VLOOKUP($B117&\"_\"&$C117,Hg_Min_Tests!$A$1:AAB$1000,R$1,FALSE)","v":"Electrostatic precipitator, cold side, w/ flue gas conditioning"},{"$f":"VLOOKUP($B117&\"_\"&$C117,Hg_Min_Tests!$A$1:AAC$1000,S$1,FALSE)","v":"Selective Catalytic Reduction"},{"$f":"VLOOKUP($B117&\"_\"&$C117,Hg_Min_Tests!$A$1:AAD$1000,T$1,FALSE)","v":"Activated carbon injection"},{"$f":"VLOOKUP($B117&\"_\"&$C117,Hg_Min_Tests!$A$1:AAE$1000,U$1,FALSE)","v":"Fabric Filter, pulse"}]
[{"$f":"VLOOKUP(B118&\"_\"&C118,Hg_Min_Tests!$A:$AZ,6,FALSE)","v":"Clover"},7213,"2","Unit 2","Mercury",4.8745858007666673E-8,"lb/MMBtu",5.6619324934711457E-7,"lb/MW","ETTS","",56,null,null,null,5.6619324934711456E-4,{"$f":"VLOOKUP(B118&\"_\"&C118,Hg_Min_Tests!$A$1:AA$1000,11,FALSE)","v":"Tangential firing"},{"$f":"VLOOKUP($B118&\"_\"&$C118,Hg_Min_Tests!$A$1:AAB$1000,R$1,FALSE)","v":"Selective Noncatalytic Reduction"},{"$f":"VLOOKUP($B118&\"_\"&$C118,Hg_Min_Tests!$A$1:AAC$1000,S$1,FALSE)","v":"Fabric Filter, reverse air"},{"$f":"VLOOKUP($B118&\"_\"&$C118,Hg_Min_Tests!$A$1:AAD$1000,T$1,FALSE)","v":"Wet FGD - Spray Type"},{"$f":"VLOOKUP($B118&\"_\"&$C118,Hg_Min_Tests!$A$1:AAE$1000,U$1,FALSE)","v":""}]
[{"$f":"VLOOKUP(B119&\"_\"&C119,Hg_Min_Tests!$A:$AZ,6,FALSE)","v":"Hopewell"},10771,"10771-01","1 & 2","Mercury",4.5931342286333333E-8,"lb/MMBtu",5.7751908315904416E-7,"lb/MW","ETTS","",57,null,null,null,5.7751908315904418E-4,{"$f":"VLOOKUP(B119&\"_\"&C119,Hg_Min_Tests!$A$1:AA$1000,11,FALSE)","v":"Stoker - spreader"},{"$f":"VLOOKUP($B119&\"_\"&$C119,Hg_Min_Tests!$A$1:AAB$1000,R$1,FALSE)","v":"Selective Noncatalytic Reduction"},{"$f":"VLOOKUP($B119&\"_\"&$C119,Hg_Min_Tests!$A$1:AAC$1000,S$1,FALSE)","v":"Selective Noncatalytic Reduction"},{"$f":"VLOOKUP($B119&\"_\"&$C119,Hg_Min_Tests!$A$1:AAD$1000,T$1,FALSE)","v":"Multiple cyclone"},{"$f":"VLOOKUP($B119&\"_\"&$C119,Hg_Min_Tests!$A$1:AAE$1000,U$1,FALSE)","v":"Multiple cyclone"}]
[{"$f":"VLOOKUP(B120&\"_\"&C120,Hg_Min_Tests!$A:$AZ,6,FALSE)","v":"Hopewell"},10771,"10771-02","1 & 2","Mercury",4.5931342286333333E-8,"lb/MMBtu",5.7751908315904416E-7,"lb/MW","ETTS","",58,null,null,null,5.7751908315904418E-4,{"$f":"VLOOKUP(B120&\"_\"&C120,Hg_Min_Tests!$A$1:AA$1000,11,FALSE)","v":"Stoker - underfeed"},{"$f":"VLOOKUP($B120&\"_\"&$C120,Hg_Min_Tests!$A$1:AAB$1000,R$1,FALSE)","v":"Selective Noncatalytic Reduction"},{"$f":"VLOOKUP($B120&\"_\"&$C120,Hg_Min_Tests!$A$1:AAC$1000,S$1,FALSE)","v":"Selective Noncatalytic Reduction"},{"$f":"VLOOKUP($B120&\"_\"&$C120,Hg_Min_Tests!$A$1:AAD$1000,T$1,FALSE)","v":"Multiple cyclone"},{"$f":"VLOOKUP($B120&\"_\"&$C120,Hg_Min_Tests!$A$1:AAE$1000,U$1,FALSE)","v":"Multiple cyclone"}]
[{"$f":"VLOOKUP(B121&\"_\"&C121,Hg_Min_Tests!$A:$AZ,6,FALSE)","v":"H L Spurlock Station"},6041,"3","Unit 03","Mercury",7.1999999999999996E-8,"lb/MMBtu",5.9999999999999997E-7,"lb/MW","ETTS","",59,null,null,null,5.9999999999999995E-4,{"$f":"VLOOKUP(B121&\"_\"&C121,Hg_Min_Tests!$A$1:AA$1000,11,FALSE)","v":"Fluidized bed firing"},{"$f":"VLOOKUP($B121&\"_\"&$C121,Hg_Min_Tests!$A$1:AAB$1000,R$1,FALSE)","v":"Selective Noncatalytic Reduction"},{"$f":"VLOOKUP($B121&\"_\"&$C121,Hg_Min_Tests!$A$1:AAC$1000,S$1,FALSE)","v":"Dry FGD - Unspecified"},{"$f":"VLOOKUP($B121&\"_\"&$C121,Hg_Min_Tests!$A$1:AAD$1000,T$1,FALSE)","v":"Fabric Filter, pulse"},{"$f":"VLOOKUP($B121&\"_\"&$C121,Hg_Min_Tests!$A$1:AAE$1000,U$1,FALSE)","v":""}]
[{"$f":"VLOOKUP(B122&\"_\"&C122,Hg_Min_Tests!$A:$AZ,6,FALSE)","v":"San Juan"},2451,"Unit 2","Unit 2","Mercury",6.1033333333333344E-8,"lb/MMBtu",6.0835387387387398E-7,"lb/MW","ETTS","",60,null,null,null,6.0835387387387393E-4,{"$f":"VLOOKUP(B122&\"_\"&C122,Hg_Min_Tests!$A$1:AA$1000,11,FALSE)","v":"Wall firing - front firing"},{"$f":"VLOOKUP($B122&\"_\"&$C122,Hg_Min_Tests!$A$1:AAB$1000,R$1,FALSE)","v":"Activated carbon injection"},{"$f":"VLOOKUP($B122&\"_\"&$C122,Hg_Min_Tests!$A$1:AAC$1000,S$1,FALSE)","v":"Fabric Filter, pulse"},{"$f":"VLOOKUP($B122&\"_\"&$C122,Hg_Min_Tests!$A$1:AAD$1000,T$1,FALSE)","v":"Wet FGD - Spray Type"},{"$f":"VLOOKUP($B122&\"_\"&$C122,Hg_Min_Tests!$A$1:AAE$1000,U$1,FALSE)","v":""}]
[{"$f":"VLOOKUP(B123&\"_\"&C123,Hg_Min_Tests!$A:$AZ,6,FALSE)","v":"Sunnyside Cogen Associates"},50951,"1","Config 1","Mercury",5.32E-8,"lb/MMBtu",6.2066666666666664E-7,"lb/MW","ETTS","",61,null,null,null,6.2066666666666661E-4,{"$f":"VLOOKUP(B123&\"_\"&C123,Hg_Min_Tests!$A$1:AA$1000,11,FALSE)","v":"Fluidized bed firing"},{"$f":"VLOOKUP($B123&\"_\"&$C123,Hg_Min_Tests!$A$1:AAB$1000,R$1,FALSE)","v":"Other (specify): Anhydrous ammonia injection"},{"$f":"VLOOKUP($B123&\"_\"&$C123,Hg_Min_Tests!$A$1:AAC$1000,S$1,FALSE)","v":"Dry FGD - Sorbent Injection"},{"$f":"VLOOKUP($B123&\"_\"&$C123,Hg_Min_Tests!$A$1:AAD$1000,T$1,FALSE)","v":"Fabric Filter, pulse"},{"$f":"VLOOKUP($B123&\"_\"&$C123,Hg_Min_Tests!$A$1:AAE$1000,U$1,FALSE)","v":""}]
[{"$f":"VLOOKUP(B124&\"_\"&C124,Hg_Min_Tests!$A:$AZ,6,FALSE)","v":"Craig"},6021,"C2","C2","Mercury",6.7920000000000002E-8,"lb/MMBtu",6.3585631578947373E-7,"lb/MW","ETTS","",62,null,null,null,6.3585631578947375E-4,{"$f":"VLOOKUP(B124&\"_\"&C124,Hg_Min_Tests!$A$1:AA$1000,11,FALSE)","v":"Wall firing - opposed firing"},{"$f":"VLOOKUP($B124&\"_\"&$C124,Hg_Min_Tests!$A$1:AAB$1000,R$1,FALSE)","v":"Fabric Filter, pulse"},{"$f":"VLOOKUP($B124&\"_\"&$C124,Hg_Min_Tests!$A$1:AAC$1000,S$1,FALSE)","v":"Wet FGD - Spray Type"},{"$f":"VLOOKUP($B124&\"_\"&$C124,Hg_Min_Tests!$A$1:AAD$1000,T$1,FALSE)","v":""},{"$f":"VLOOKUP($B124&\"_\"&$C124,Hg_Min_Tests!$A$1:AAE$1000,U$1,FALSE)","v":""}]
[{"$f":"VLOOKUP(B125&\"_\"&C125,Hg_Min_Tests!$A:$AZ,6,FALSE)","v":"Craig"},6021,"C2","C2","Mercury",8.3566666666666667E-8,"lb/MMBtu",7.8233793859649118E-7,"lb/MW","Part II","C2 2009 Hg Low Mass Emitter",62,null,null,null,7.8233793859649114E-4,{"$f":"VLOOKUP(B125&\"_\"&C125,Hg_Min_Tests!$A$1:AA$1000,11,FALSE)","v":"Wall firing - opposed firing"},{"$f":"VLOOKUP($B125&\"_\"&$C125,Hg_Min_Tests!$A$1:AAB$1000,R$1,FALSE)","v":"Fabric Filter, pulse"},{"$f":"VLOOKUP($B125&\"_\"&$C125,Hg_Min_Tests!$A$1:AAC$1000,S$1,FALSE)","v":"Wet FGD - Spray Type"},{"$f":"VLOOKUP($B125&\"_\"&$C125,Hg_Min_Tests!$A$1:AAD$1000,T$1,FALSE)","v":""},{"$f":"VLOOKUP($B125&\"_\"&$C125,Hg_Min_Tests!$A$1:AAE$1000,U$1,FALSE)","v":""}]
[{"$f":"VLOOKUP(B126&\"_\"&C126,Hg_Min_Tests!$A:$AZ,6,FALSE)","v":"Craig"},6021,"C2","C2","Mercury",1.0766666666666668E-7,"lb/MMBtu",1.0079583333333334E-6,"lb/MW","Part II","C2 2008 Hg Low Mass Emitter",62,null,null,null,{"$f":"H126*1000","v":1.0079583333333334E-3},{"$f":"VLOOKUP(B126&\"_\"&C126,Hg_Min_Tests!$A$1:AA$1000,11,FALSE)","v":"Wall firing - opposed firing"},{"$f":"VLOOKUP($B126&\"_\"&$C126,Hg_Min_Tests!$A$1:AAB$1000,R$1,FALSE)","v":"Fabric Filter, pulse"},{"$f":"VLOOKUP($B126&\"_\"&$C126,Hg_Min_Tests!$A$1:AAC$1000,S$1,FALSE)","v":"Wet FGD - Spray Type"},{"$f":"VLOOKUP($B126&\"_\"&$C126,Hg_Min_Tests!$A$1:AAD$1000,T$1,FALSE)","v":""},{"$f":"VLOOKUP($B126&\"_\"&$C126,Hg_Min_Tests!$A$1:AAE$1000,U$1,FALSE)","v":""}]
[{"$f":"VLOOKUP(B127&\"_\"&C127,Hg_Min_Tests!$A:$AZ,6,FALSE)","v":"Elm Road Generating Station"},56068,"1","ERGS-B1","Mercury",7.5333333333333333E-8,"lb/MMBtu",7.2495814869522406E-7,"lb/MW","ETTS","",63,null,null,null,7.2495814869522404E-4,{"$f":"VLOOKUP(B127&\"_\"&C127,Hg_Min_Tests!$A$1:AA$1000,11,FALSE)","v":"Wall firing - unspecified"},{"$f":"VLOOKUP($B127&\"_\"&$C127,Hg_Min_Tests!$A$1:AAB$1000,R$1,FALSE)","v":"Selective Catalytic Reduction"},{"$f":"VLOOKUP($B127&\"_\"&$C127,Hg_Min_Tests!$A$1:AAC$1000,S$1,FALSE)","v":"Fabric Filter, pulse"},{"$f":"VLOOKUP($B127&\"_\"&$C127,Hg_Min_Tests!$A$1:AAD$1000,T$1,FALSE)","v":"Wet FGD - Spray Type"},{"$f":"VLOOKUP($B127&\"_\"&$C127,Hg_Min_Tests!$A$1:AAE$1000,U$1,FALSE)","v":"Wet electrostatic precipitator"}]
[{"$f":"VLOOKUP(B128&\"_\"&C128,Hg_Min_Tests!$A:$AZ,6,FALSE)","v":"McMeekin"},3287,"MCM1","MCM001","Mercury",8.8463094938116517E-8,"lb/MMBtu",7.4931517823508316E-7,"lb/MW","ERT","",64,null,null,null,7.4931517823508312E-4,{"$f":"VLOOKUP(B128&\"_\"&C128,Hg_Min_Tests!$A$1:AA$1000,11,FALSE)","v":"Tangential firing"},{"$f":"VLOOKUP($B128&\"_\"&$C128,Hg_Min_Tests!$A$1:AAB$1000,R$1,FALSE)","v":"Fabric Filter, unspecified"},{"$f":"VLOOKUP($B128&\"_\"&$C128,Hg_Min_Tests!$A$1:AAC$1000,S$1,FALSE)","v":""},{"$f":"VLOOKUP($B128&\"_\"&$C128,Hg_Min_Tests!$A$1:AAD$1000,T$1,FALSE)","v":""},{"$f":"VLOOKUP($B128&\"_\"&$C128,Hg_Min_Tests!$A$1:AAE$1000,U$1,FALSE)","v":""}]
[{"$f":"VLOOKUP(B129&\"_\"&C129,Hg_Min_Tests!$A:$AZ,6,FALSE)","v":"McMeekin"},3287,"MCM1","MCM001","Mercury",1.0100000000000001E-6,"lb/MMBtu",8.5550740740740741E-6,"lb/MW","Part II","Hg-01/06-MCM1",64,null,null,null,8.5550740740740743E-3,{"$f":"VLOOKUP(B129&\"_\"&C129,Hg_Min_Tests!$A$1:AA$1000,11,FALSE)","v":"Tangential firing"},{"$f":"VLOOKUP($B129&\"_\"&$C129,Hg_Min_Tests!$A$1:AAB$1000,R$1,FALSE)","v":"Fabric Filter, unspecified"},{"$f":"VLOOKUP($B129&\"_\"&$C129,Hg_Min_Tests!$A$1:AAC$1000,S$1,FALSE)","v":""},{"$f":"VLOOKUP($B129&\"_\"&$C129,Hg_Min_Tests!$A$1:AAD$1000,T$1,FALSE)","v":""},{"$f":"VLOOKUP($B129&\"_\"&$C129,Hg_Min_Tests!$A$1:AAE$1000,U$1,FALSE)","v":""}]
[{"$f":"VLOOKUP(B130&\"_\"&C130,Hg_Min_Tests!$A:$AZ,6,FALSE)","v":"Piney Creek Project"},54144,"BRBR1","BRBRI","Mercury",6.0972972972972973E-8,"lb/MMBtu",7.6216216216216218E-7,"lb/MW","Part II","16-00127 Condition 4 & 12",65,null,null,null,7.6216216216216221E-4,{"$f":"VLOOKUP(B130&\"_\"&C130,Hg_Min_Tests!$A$1:AA$1000,11,FALSE)","v":"Fluidized bed firing"},{"$f":"VLOOKUP($B130&\"_\"&$C130,Hg_Min_Tests!$A$1:AAB$1000,R$1,FALSE)","v":"Selective Noncatalytic Reduction"},{"$f":"VLOOKUP($B130&\"_\"&$C130,Hg_Min_Tests!$A$1:AAC$1000,S$1,FALSE)","v":"Fabric Filter, pulse"},{"$f":"VLOOKUP($B130&\"_\"&$C130,Hg_Min_Tests!$A$1:AAD$1000,T$1,FALSE)","v":""},{"$f":"VLOOKUP($B130&\"_\"&$C130,Hg_Min_Tests!$A$1:AAE$1000,U$1,FALSE)","v":""}]
[{"$f":"VLOOKUP(B131&\"_\"&C131,Hg_Min_Tests!$A:$AZ,6,FALSE)","v":"Piney Creek Project"},54144,"BRBR1","BRBRI","Mercury",1.2733333333333334E-7,"lb/MMBtu",1.5916666666666667E-6,"lb/MW","ETTS","",65,null,null,null,{"$f":"H131*1000","v":1.5916666666666668E-3},{"$f":"VLOOKUP(B131&\"_\"&C131,Hg_Min_Tests!$A$1:AA$1000,11,FALSE)","v":"Fluidized bed firing"},{"$f":"VLOOKUP($B131&\"_\"&$C131,Hg_Min_Tests!$A$1:AAB$1000,R$1,FALSE)","v":"Selective Noncatalytic Reduction"},{"$f":"VLOOKUP($B131&\"_\"&$C131,Hg_Min_Tests!$A$1:AAC$1000,S$1,FALSE)","v":"Fabric Filter, pulse"},{"$f":"VLOOKUP($B131&\"_\"&$C131,Hg_Min_Tests!$A$1:AAD$1000,T$1,FALSE)","v":""},{"$f":"VLOOKUP($B131&\"_\"&$C131,Hg_Min_Tests!$A$1:AAE$1000,U$1,FALSE)","v":""}]
[{"$f":"VLOOKUP(B132&\"_\"&C132,Hg_Min_Tests!$A:$AZ,6,FALSE)","v":"PSEG Mercer Generating Station"},2408,"E2","MERU2E2PT2OS1-Coal","Mercury",8.9406666666666672E-8,"lb/MMBtu",8.0804859086491742E-7,"lb/MW","Part II","EG08004-4Q",66,null,null,null,8.0804859086491744E-4,{"$f":"VLOOKUP(B132&\"_\"&C132,Hg_Min_Tests!$A$1:AA$1000,11,FALSE)","v":"Wall firing - unspecified"},{"$f":"VLOOKUP($B132&\"_\"&$C132,Hg_Min_Tests!$A$1:AAB$1000,R$1,FALSE)","v":"Electrostatic precipitator, cold side, w/ flue gas conditioning"},{"$f":"VLOOKUP($B132&\"_\"&$C132,Hg_Min_Tests!$A$1:AAC$1000,S$1,FALSE)","v":"Selective Catalytic Reduction"},{"$f":"VLOOKUP($B132&\"_\"&$C132,Hg_Min_Tests!$A$1:AAD$1000,T$1,FALSE)","v":"Activated carbon injection"},{"$f":"VLOOKUP($B132&\"_\"&$C132,Hg_Min_Tests!$A$1:AAE$1000,U$1,FALSE)","v":"Fabric Filter, pulse"}]
[{"$f":"VLOOKUP(B133&\"_\"&C133,Hg_Min_Tests!$A:$AZ,6,FALSE)","v":"PSEG Mercer Generating Station"},2408,"E2","MERU2E2PT2OS1-Coal","Mercury",1.6609999999999999E-7,"lb/MMBtu",1.5011953352769677E-6,"lb/MW","Part II","MER1-2 4Q2009 Hg PM10 ST Co NG",66,null,null,null,1.5011953352769677E-3,{"$f":"VLOOKUP(B133&\"_\"&C133,Hg_Min_Tests!$A$1:AA$1000,11,FALSE)","v":"Wall firing - unspecified"},{"$f":"VLOOKUP($B133&\"_\"&$C133,Hg_Min_Tests!$A$1:AAB$1000,R$1,FALSE)","v":"Electrostatic precipitator, cold side, w/ flue gas conditioning"},{"$f":"VLOOKUP($B133&\"_\"&$C133,Hg_Min_Tests!$A$1:AAC$1000,S$1,FALSE)","v":"Selective Catalytic Reduction"},{"$f":"VLOOKUP($B133&\"_\"&$C133,Hg_Min_Tests!$A$1:AAD$1000,T$1,FALSE)","v":"Activated carbon injection"},{"$f":"VLOOKUP($B133&\"_\"&$C133,Hg_Min_Tests!$A$1:AAE$1000,U$1,FALSE)","v":"Fabric Filter, pulse"}]
[{"$f":"VLOOKUP(B134&\"_\"&C134,Hg_Min_Tests!$A:$AZ,6,FALSE)","v":"PSEG Mercer Generating Station"},2408,"E2","MERU2E2PT2OS1-Coal","Mercury",1.9999999999999999E-7,"lb/MMBtu",1.8075801749271135E-6,"lb/MW","Part II","MER2 2009 1YR ST Co NG",66,null,null,null,1.8075801749271134E-3,{"$f":"VLOOKUP(B134&\"_\"&C134,Hg_Min_Tests!$A$1:AA$1000,11,FALSE)","v":"Wall firing - unspecified"},{"$f":"VLOOKUP($B134&\"_\"&$C134,Hg_Min_Tests!$A$1:AAB$1000,R$1,FALSE)","v":"Electrostatic precipitator, cold side, w/ flue gas conditioning"},{"$f":"VLOOKUP($B134&\"_\"&$C134,Hg_Min_Tests!$A$1:AAC$1000,S$1,FALSE)","v":"Selective Catalytic Reduction"},{"$f":"VLOOKUP($B134&\"_\"&$C134,Hg_Min_Tests!$A$1:AAD$1000,T$1,FALSE)","v":"Activated carbon injection"},{"$f":"VLOOKUP($B134&\"_\"&$C134,Hg_Min_Tests!$A$1:AAE$1000,U$1,FALSE)","v":"Fabric Filter, pulse"}]
[{"$f":"VLOOKUP(B135&\"_\"&C135,Hg_Min_Tests!$A:$AZ,6,FALSE)","v":"PSEG Mercer Generating Station"},2408,"E2","MERU2E2PT2OS1-Coal","Mercury",4.8033333333333339E-7,"lb/MMBtu",4.341205053449952E-6,"lb/MW","ETTS","",66,null,null,null,4.3412050534499518E-3,{"$f":"VLOOKUP(B135&\"_\"&C135,Hg_Min_Tests!$A$1:AA$1000,11,FALSE)","v":"Wall firing - unspecified"},{"$f":"VLOOKUP($B135&\"_\"&$C135,Hg_Min_Tests!$A$1:AAB$1000,R$1,FALSE)","v":"Electrostatic precipitator, cold side, w/ flue gas conditioning"},{"$f":"VLOOKUP($B135&\"_\"&$C135,Hg_Min_Tests!$A$1:AAC$1000,S$1,FALSE)","v":"Selective Catalytic Reduction"},{"$f":"VLOOKUP($B135&\"_\"&$C135,Hg_Min_Tests!$A$1:AAD$1000,T$1,FALSE)","v":"Activated carbon injection"},{"$f":"VLOOKUP($B135&\"_\"&$C135,Hg_Min_Tests!$A$1:AAE$1000,U$1,FALSE)","v":"Fabric Filter, pulse"}]
[{"$f":"VLOOKUP(B136&\"_\"&C136,Hg_Min_Tests!$A:$AZ,6,FALSE)","v":"PSEG Mercer Generating Station"},2408,"E2","MERU2E2PT2OS1-Coal","Mercury",9.6856666666666673E-7,"lb/MMBtu",8.7538095238095237E-6,"lb/MW","Part II","MER1-2 3Q2009 STCo NG",66,null,null,null,8.7538095238095231E-3,{"$f":"VLOOKUP(B136&\"_\"&C136,Hg_Min_Tests!$A$1:AA$1000,11,FALSE)","v":"Wall firing - unspecified"},{"$f":"VLOOKUP($B136&\"_\"&$C136,Hg_Min_Tests!$A$1:AAB$1000,R$1,FALSE)","v":"Electrostatic precipitator, cold side, w/ flue gas conditioning"},{"$f":"VLOOKUP($B136&\"_\"&$C136,Hg_Min_Tests!$A$1:AAC$1000,S$1,FALSE)","v":"Selective Catalytic Reduction"},{"$f":"VLOOKUP($B136&\"_\"&$C136,Hg_Min_Tests!$A$1:AAD$1000,T$1,FALSE)","v":"Activated carbon injection"},{"$f":"VLOOKUP($B136&\"_\"&$C136,Hg_Min_Tests!$A$1:AAE$1000,U$1,FALSE)","v":"Fabric Filter, pulse"}]
[{"$f":"VLOOKUP(B137&\"_\"&C137,Hg_Min_Tests!$A:$AZ,6,FALSE)","v":"PSEG Mercer Generating Station"},2408,"E2","MERU2E2PT2OS1-Coal","Mercury",2.362E-6,"lb/MMBtu",2.1347521865889211E-5,"lb/MW","Part II","MER1-2 1Q2009 ST Co HgPM10",66,null,null,null,2.1347521865889212E-2,{"$f":"VLOOKUP(B137&\"_\"&C137,Hg_Min_Tests!$A$1:AA$1000,11,FALSE)","v":"Wall firing - unspecified"},{"$f":"VLOOKUP($B137&\"_\"&$C137,Hg_Min_Tests!$A$1:AAB$1000,R$1,FALSE)","v":"Electrostatic precipitator, cold side, w/ flue gas conditioning"},{"$f":"VLOOKUP($B137&\"_\"&$C137,Hg_Min_Tests!$A$1:AAC$1000,S$1,FALSE)","v":"Selective Catalytic Reduction"},{"$f":"VLOOKUP($B137&\"_\"&$C137,Hg_Min_Tests!$A$1:AAD$1000,T$1,FALSE)","v":"Activated carbon injection"},{"$f":"VLOOKUP($B137&\"_\"&$C137,Hg_Min_Tests!$A$1:AAE$1000,U$1,FALSE)","v":"Fabric Filter, pulse"}]
[{"$f":"VLOOKUP(B138&\"_\"&C138,Hg_Min_Tests!$A:$AZ,6,FALSE)","v":"Valley"},4042,"4","VAPP-B4","Mercury",7.3400000000000009E-8,"lb/MMBtu",8.848777777777779E-7,"lb/MW","ETTS","",67,null,null,null,8.848777777777779E-4,{"$f":"VLOOKUP(B138&\"_\"&C138,Hg_Min_Tests!$A$1:AA$1000,11,FALSE)","v":"Wall firing - front firing"},{"$f":"VLOOKUP($B138&\"_\"&$C138,Hg_Min_Tests!$A$1:AAB$1000,R$1,FALSE)","v":"Fabric Filter, pulse"},{"$f":"VLOOKUP($B138&\"_\"&$C138,Hg_Min_Tests!$A$1:AAC$1000,S$1,FALSE)","v":""},{"$f":"VLOOKUP($B138&\"_\"&$C138,Hg_Min_Tests!$A$1:AAD$1000,T$1,FALSE)","v":""},{"$f":"VLOOKUP($B138&\"_\"&$C138,Hg_Min_Tests!$A$1:AAE$1000,U$1,FALSE)","v":""}]
[{"$f":"VLOOKUP(B139&\"_\"&C139,Hg_Min_Tests!$A:$AZ,6,FALSE)","v":"Deepwater"},2384,"8","Coal-firing","Mercury",9.4342410975609746E-8,"lb/MMBtu",8.8920433333333324E-7,"lb/MW","Part II","OBG compliance 6/25-26/09",68,null,null,null,8.8920433333333326E-4,{"$f":"VLOOKUP(B139&\"_\"&C139,Hg_Min_Tests!$A$1:AA$1000,11,FALSE)","v":"Wall firing - front firing"},{"$f":"VLOOKUP($B139&\"_\"&$C139,Hg_Min_Tests!$A$1:AAB$1000,R$1,FALSE)","v":"Other (specify): Hydrated lime injection to control HCl"},{"$f":"VLOOKUP($B139&\"_\"&$C139,Hg_Min_Tests!$A$1:AAC$1000,S$1,FALSE)","v":"Selective Noncatalytic Reduction"},{"$f":"VLOOKUP($B139&\"_\"&$C139,Hg_Min_Tests!$A$1:AAD$1000,T$1,FALSE)","v":"Fabric Filter, reverse air"},{"$f":"VLOOKUP($B139&\"_\"&$C139,Hg_Min_Tests!$A$1:AAE$1000,U$1,FALSE)","v":""}]
[{"$f":"VLOOKUP(B140&\"_\"&C140,Hg_Min_Tests!$A:$AZ,6,FALSE)","v":"Deepwater"},2384,"8","Coal-firing","Mercury",1.1695134146341464E-7,"lb/MMBtu",1.1023E-6,"lb/MW","Part II","OBG 08/04-06/09",68,null,null,null,1.1023000000000001E-3,{"$f":"VLOOKUP(B140&\"_\"&C140,Hg_Min_Tests!$A$1:AA$1000,11,FALSE)","v":"Wall firing - front firing"},{"$f":"VLOOKUP($B140&\"_\"&$C140,Hg_Min_Tests!$A$1:AAB$1000,R$1,FALSE)","v":"Other (specify): Hydrated lime injection to control HCl"},{"$f":"VLOOKUP($B140&\"_\"&$C140,Hg_Min_Tests!$A$1:AAC$1000,S$1,FALSE)","v":"Selective Noncatalytic Reduction"},{"$f":"VLOOKUP($B140&\"_\"&$C140,Hg_Min_Tests!$A$1:AAD$1000,T$1,FALSE)","v":"Fabric Filter, reverse air"},{"$f":"VLOOKUP($B140&\"_\"&$C140,Hg_Min_Tests!$A$1:AAE$1000,U$1,FALSE)","v":""}]
[{"$f":"VLOOKUP(B141&\"_\"&C141,Hg_Min_Tests!$A:$AZ,6,FALSE)","v":"Deepwater"},2384,"8","Coal-firing","Mercury",3.5085932926829272E-7,"lb/MMBtu",3.3069500000000002E-6,"lb/MW","Part II","Air Nova compliance 12/9-10/08",68,null,null,null,3.3069500000000003E-3,{"$f":"VLOOKUP(B141&\"_\"&C141,Hg_Min_Tests!$A$1:AA$1000,11,FALSE)","v":"Wall firing - front firing"},{"$f":"VLOOKUP($B141&\"_\"&$C141,Hg_Min_Tests!$A$1:AAB$1000,R$1,FALSE)","v":"Other (specify): Hydrated lime injection to control HCl"},{"$f":"VLOOKUP($B141&\"_\"&$C141,Hg_Min_Tests!$A$1:AAC$1000,S$1,FALSE)","v":"Selective Noncatalytic Reduction"},{"$f":"VLOOKUP($B141&\"_\"&$C141,Hg_Min_Tests!$A$1:AAD$1000,T$1,FALSE)","v":"Fabric Filter, reverse air"},{"$f":"VLOOKUP($B141&\"_\"&$C141,Hg_Min_Tests!$A$1:AAE$1000,U$1,FALSE)","v":""}]
[{"$f":"VLOOKUP(B142&\"_\"&C142,Hg_Min_Tests!$A:$AZ,6,FALSE)","v":"Deepwater"},2384,"8","Coal-firing","Mercury",4.2103119512195125E-7,"lb/MMBtu",3.96834E-6,"lb/MW","Part II","Air Nova TSP, HCl, Hg 3/13/09",68,null,null,null,3.9683399999999999E-3,{"$f":"VLOOKUP(B142&\"_\"&C142,Hg_Min_Tests!$A$1:AA$1000,11,FALSE)","v":"Wall firing - front firing"},{"$f":"VLOOKUP($B142&\"_\"&$C142,Hg_Min_Tests!$A$1:AAB$1000,R$1,FALSE)","v":"Other (specify): Hydrated lime injection to control HCl"},{"$f":"VLOOKUP($B142&\"_\"&$C142,Hg_Min_Tests!$A$1:AAC$1000,S$1,FALSE)","v":"Selective Noncatalytic Reduction"},{"$f":"VLOOKUP($B142&\"_\"&$C142,Hg_Min_Tests!$A$1:AAD$1000,T$1,FALSE)","v":"Fabric Filter, reverse air"},{"$f":"VLOOKUP($B142&\"_\"&$C142,Hg_Min_Tests!$A$1:AAE$1000,U$1,FALSE)","v":""}]
[{"$f":"VLOOKUP(B143&\"_\"&C143,Hg_Min_Tests!$A:$AZ,6,FALSE)","v":"Bridgeport Station"},568,"BHB3","BHSEMU3OS2-Coal","Mercury",9.0066666666666679E-8,"lb/MMBtu",9.1631100082713001E-7,"lb/MW","Part II","630-0902",69,null,null,null,9.1631100082712998E-4,{"$f":"VLOOKUP(B143&\"_\"&C143,Hg_Min_Tests!$A$1:AA$1000,11,FALSE)","v":"Tangential firing"},{"$f":"VLOOKUP($B143&\"_\"&$C143,Hg_Min_Tests!$A$1:AAB$1000,R$1,FALSE)","v":"Electrostatic precipitator, cold side, w/o flue gas conditioning"},{"$f":"VLOOKUP($B143&\"_\"&$C143,Hg_Min_Tests!$A$1:AAC$1000,S$1,FALSE)","v":"Activated carbon injection"},{"$f":"VLOOKUP($B143&\"_\"&$C143,Hg_Min_Tests!$A$1:AAD$1000,T$1,FALSE)","v":"Fabric Filter, pulse"},{"$f":"VLOOKUP($B143&\"_\"&$C143,Hg_Min_Tests!$A$1:AAE$1000,U$1,FALSE)","v":""}]
[{"$f":"VLOOKUP(B144&\"_\"&C144,Hg_Min_Tests!$A:$AZ,6,FALSE)","v":"Bridgeport Station"},568,"BHB3","BHSEMU3OS2-Coal","Mercury",1.1616666666666668E-7,"lb/MMBtu",1.1818444995864352E-6,"lb/MW","Part II","630-0915",69,null,null,null,1.1818444995864352E-3,{"$f":"VLOOKUP(B144&\"_\"&C144,Hg_Min_Tests!$A$1:AA$1000,11,FALSE)","v":"Tangential firing"},{"$f":"VLOOKUP($B144&\"_\"&$C144,Hg_Min_Tests!$A$1:AAB$1000,R$1,FALSE)","v":"Electrostatic precipitator, cold side, w/o flue gas conditioning"},{"$f":"VLOOKUP($B144&\"_\"&$C144,Hg_Min_Tests!$A$1:AAC$1000,S$1,FALSE)","v":"Activated carbon injection"},{"$f":"VLOOKUP($B144&\"_\"&$C144,Hg_Min_Tests!$A$1:AAD$1000,T$1,FALSE)","v":"Fabric Filter, pulse"},{"$f":"VLOOKUP($B144&\"_\"&$C144,Hg_Min_Tests!$A$1:AAE$1000,U$1,FALSE)","v":""}]
[{"$f":"VLOOKUP(B145&\"_\"&C145,Hg_Min_Tests!$A:$AZ,6,FALSE)","v":"Bridgeport Station"},568,"BHB3","BHSEMU3OS2-Coal","Mercury",1.2166666666666666E-7,"lb/MMBtu",1.2377998345740282E-6,"lb/MW","ETTS","",69,null,null,null,1.2377998345740281E-3,{"$f":"VLOOKUP(B145&\"_\"&C145,Hg_Min_Tests!$A$1:AA$1000,11,FALSE)","v":"Tangential firing"},{"$f":"VLOOKUP($B145&\"_\"&$C145,Hg_Min_Tests!$A$1:AAB$1000,R$1,FALSE)","v":"Electrostatic precipitator, cold side, w/o flue gas conditioning"},{"$f":"VLOOKUP($B145&\"_\"&$C145,Hg_Min_Tests!$A$1:AAC$1000,S$1,FALSE)","v":"Activated carbon injection"},{"$f":"VLOOKUP($B145&\"_\"&$C145,Hg_Min_Tests!$A$1:AAD$1000,T$1,FALSE)","v":"Fabric Filter, pulse"},{"$f":"VLOOKUP($B145&\"_\"&$C145,Hg_Min_Tests!$A$1:AAE$1000,U$1,FALSE)","v":""}]
[{"$f":"VLOOKUP(B146&\"_\"&C146,Hg_Min_Tests!$A:$AZ,6,FALSE)","v":"Bridgeport Station"},568,"BHB3","BHSEMU3OS2-Coal","Mercury",2.2700000000000003E-7,"lb/MMBtu",2.3094292803970227E-6,"lb/MW","Part II","630-0927",69,null,null,null,2.3094292803970229E-3,{"$f":"VLOOKUP(B146&\"_\"&C146,Hg_Min_Tests!$A$1:AA$1000,11,FALSE)","v":"Tangential firing"},{"$f":"VLOOKUP($B146&\"_\"&$C146,Hg_Min_Tests!$A$1:AAB$1000,R$1,FALSE)","v":"Electrostatic precipitator, cold side, w/o flue gas conditioning"},{"$f":"VLOOKUP($B146&\"_\"&$C146,Hg_Min_Tests!$A$1:AAC$1000,S$1,FALSE)","v":"Activated carbon injection"},{"$f":"VLOOKUP($B146&\"_\"&$C146,Hg_Min_Tests!$A$1:AAD$1000,T$1,FALSE)","v":"Fabric Filter, pulse"},{"$f":"VLOOKUP($B146&\"_\"&$C146,Hg_Min_Tests!$A$1:AAE$1000,U$1,FALSE)","v":""}]
[{"$f":"VLOOKUP(B147&\"_\"&C147,Hg_Min_Tests!$A:$AZ,6,FALSE)","v":"Dallman"},963,"34","34","Mercury",1.1600000000000001E-7,"lb/MMBtu",9.7335832606800371E-7,"lb/MW","Part II","Dallman 34 Test 2",70,null,null,null,9.7335832606800367E-4,{"$f":"VLOOKUP(B147&\"_\"&C147,Hg_Min_Tests!$A$1:AA$1000,11,FALSE)","v":"Wall firing - opposed firing"},{"$f":"VLOOKUP($B147&\"_\"&$C147,Hg_Min_Tests!$A$1:AAB$1000,R$1,FALSE)","v":"Selective Catalytic Reduction"},{"$f":"VLOOKUP($B147&\"_\"&$C147,Hg_Min_Tests!$A$1:AAC$1000,S$1,FALSE)","v":"Fabric Filter, pulse"},{"$f":"VLOOKUP($B147&\"_\"&$C147,Hg_Min_Tests!$A$1:AAD$1000,T$1,FALSE)","v":"Wet FGD - Packed Type"},{"$f":"VLOOKUP($B147&\"_\"&$C147,Hg_Min_Tests!$A$1:AAE$1000,U$1,FALSE)","v":"Wet electrostatic precipitator"}]
[{"$f":"VLOOKUP(B148&\"_\"&C148,Hg_Min_Tests!$A:$AZ,6,FALSE)","v":"Dallman"},963,"34","34","Mercury",1.4999999999999999E-7,"lb/MMBtu",1.2586530078465563E-6,"lb/MW","Part II","Dallman 34 Test 1",70,null,null,null,1.2586530078465563E-3,{"$f":"VLOOKUP(B148&\"_\"&C148,Hg_Min_Tests!$A$1:AA$1000,11,FALSE)","v":"Wall firing - opposed firing"},{"$f":"VLOOKUP($B148&\"_\"&$C148,Hg_Min_Tests!$A$1:AAB$1000,R$1,FALSE)","v":"Selective Catalytic Reduction"},{"$f":"VLOOKUP($B148&\"_\"&$C148,Hg_Min_Tests!$A$1:AAC$1000,S$1,FALSE)","v":"Fabric Filter, pulse"},{"$f":"VLOOKUP($B148&\"_\"&$C148,Hg_Min_Tests!$A$1:AAD$1000,T$1,FALSE)","v":"Wet FGD - Packed Type"},{"$f":"VLOOKUP($B148&\"_\"&$C148,Hg_Min_Tests!$A$1:AAE$1000,U$1,FALSE)","v":"Wet electrostatic precipitator"}]
[{"$f":"VLOOKUP(B149&\"_\"&C149,Hg_Min_Tests!$A:$AZ,6,FALSE)","v":"Dallman"},963,"34","34","Mercury",5.7268999999999998E-7,"lb/MMBtu",4.8054532737576288E-6,"lb/MW","ETTS","",70,null,null,null,4.8054532737576289E-3,{"$f":"VLOOKUP(B149&\"_\"&C149,Hg_Min_Tests!$A$1:AA$1000,11,FALSE)","v":"Wall firing - opposed firing"},{"$f":"VLOOKUP($B149&\"_\"&$C149,Hg_Min_Tests!$A$1:AAB$1000,R$1,FALSE)","v":"Selective Catalytic Reduction"},{"$f":"VLOOKUP($B149&\"_\"&$C149,Hg_Min_Tests!$A$1:AAC$1000,S$1,FALSE)","v":"Fabric Filter, pulse"},{"$f":"VLOOKUP($B149&\"_\"&$C149,Hg_Min_Tests!$A$1:AAD$1000,T$1,FALSE)","v":"Wet FGD - Packed Type"},{"$f":"VLOOKUP($B149&\"_\"&$C149,Hg_Min_Tests!$A$1:AAE$1000,U$1,FALSE)","v":"Wet electrostatic precipitator"}]
[{"$f":"VLOOKUP(B150&\"_\"&C150,Hg_Min_Tests!$A:$AZ,6,FALSE)","v":"Craig"},6021,"C1","C1","Mercury",1.1266666666666666E-7,"lb/MMBtu",9.9522222222222222E-7,"lb/MW","Part II","C1 2008 Low-mass emitter HG",71,null,null,null,9.9522222222222221E-4,{"$f":"VLOOKUP(B150&\"_\"&C150,Hg_Min_Tests!$A$1:AA$1000,11,FALSE)","v":"Wall firing - opposed firing"},{"$f":"VLOOKUP($B150&\"_\"&$C150,Hg_Min_Tests!$A$1:AAB$1000,R$1,FALSE)","v":"Fabric Filter, pulse"},{"$f":"VLOOKUP($B150&\"_\"&$C150,Hg_Min_Tests!$A$1:AAC$1000,S$1,FALSE)","v":"Wet FGD - Spray Type"},{"$f":"VLOOKUP($B150&\"_\"&$C150,Hg_Min_Tests!$A$1:AAD$1000,T$1,FALSE)","v":""},{"$f":"VLOOKUP($B150&\"_\"&$C150,Hg_Min_Tests!$A$1:AAE$1000,U$1,FALSE)","v":""}]
[{"$f":"VLOOKUP(B151&\"_\"&C151,Hg_Min_Tests!$A:$AZ,6,FALSE)","v":"Craig"},6021,"C1","C1","Mercury",1.1566666666666667E-7,"lb/MMBtu",1.0217222222222223E-6,"lb/MW","Part II","C1 2009 Hg Low Mass Emitter",71,null,null,null,1.0217222222222223E-3,{"$f":"VLOOKUP(B151&\"_\"&C151,Hg_Min_Tests!$A$1:AA$1000,11,FALSE)","v":"Wall firing - opposed firing"},{"$f":"VLOOKUP($B151&\"_\"&$C151,Hg_Min_Tests!$A$1:AAB$1000,R$1,FALSE)","v":"Fabric Filter, pulse"},{"$f":"VLOOKUP($B151&\"_\"&$C151,Hg_Min_Tests!$A$1:AAC$1000,S$1,FALSE)","v":"Wet FGD - Spray Type"},{"$f":"VLOOKUP($B151&\"_\"&$C151,Hg_Min_Tests!$A$1:AAD$1000,T$1,FALSE)","v":""},{"$f":"VLOOKUP($B151&\"_\"&$C151,Hg_Min_Tests!$A$1:AAE$1000,U$1,FALSE)","v":""}]
[{"$f":"VLOOKUP(B152&\"_\"&C152,Hg_Min_Tests!$A:$AZ,6,FALSE)","v":"Craig"},6021,"C1","C1","Mercury",2.2625E-7,"lb/MMBtu",1.9985416666666668E-6,"lb/MW","ETTS","",71,null,null,null,1.9985416666666667E-3,{"$f":"VLOOKUP(B152&\"_\"&C152,Hg_Min_Tests!$A$1:AA$1000,11,FALSE)","v":"Wall firing - opposed firing"},{"$f":"VLOOKUP($B152&\"_\"&$C152,Hg_Min_Tests!$A$1:AAB$1000,R$1,FALSE)","v":"Fabric Filter, pulse"},{"$f":"VLOOKUP($B152&\"_\"&$C152,Hg_Min_Tests!$A$1:AAC$1000,S$1,FALSE)","v":"Wet FGD - Spray Type"},{"$f":"VLOOKUP($B152&\"_\"&$C152,Hg_Min_Tests!$A$1:AAD$1000,T$1,FALSE)","v":""},{"$f":"VLOOKUP($B152&\"_\"&$C152,Hg_Min_Tests!$A$1:AAE$1000,U$1,FALSE)","v":""}]
[{"$f":"VLOOKUP(B153&\"_\"&C153,Hg_Min_Tests!$A:$AZ,6,FALSE)","v":"AES Somerset LLC"},6082,"1","001","Mercury",1.3199999999999999E-7,"lb/MMBtu",1.2176263219741481E-6,"lb/MW","Part II","Hg_June_2008",72,null,null,null,1.2176263219741482E-3,{"$f":"VLOOKUP(B153&\"_\"&C153,Hg_Min_Tests!$A$1:AA$1000,11,FALSE)","v":"Wall firing - opposed firing"},{"$f":"VLOOKUP($B153&\"_\"&$C153,Hg_Min_Tests!$A$1:AAB$1000,R$1,FALSE)","v":"Selective Catalytic Reduction"},{"$f":"VLOOKUP($B153&\"_\"&$C153,Hg_Min_Tests!$A$1:AAC$1000,S$1,FALSE)","v":"Dry sorbent injection"},{"$f":"VLOOKUP($B153&\"_\"&$C153,Hg_Min_Tests!$A$1:AAD$1000,T$1,FALSE)","v":"Electrostatic precipitator, unspecified"},{"$f":"VLOOKUP($B153&\"_\"&$C153,Hg_Min_Tests!$A$1:AAE$1000,U$1,FALSE)","v":"Wet FGD - Spray Type"}]
[{"$f":"VLOOKUP(B154&\"_\"&C154,Hg_Min_Tests!$A:$AZ,6,FALSE)","v":"Roxboro Steam Electric Plant"},2712,"1","Rox_Cfg_1b","Mercury",1.2937892664800001E-7,"lb/MMBtu",1.2618645962681559E-6,"lb/MW","ETTS","",73,null,null,null,1.2618645962681559E-3,{"$f":"VLOOKUP(B154&\"_\"&C154,Hg_Min_Tests!$A$1:AA$1000,11,FALSE)","v":"Wall firing - opposed firing"},{"$f":"VLOOKUP($B154&\"_\"&$C154,Hg_Min_Tests!$A$1:AAB$1000,R$1,FALSE)","v":"Selective Catalytic Reduction"},{"$f":"VLOOKUP($B154&\"_\"&$C154,Hg_Min_Tests!$A$1:AAC$1000,S$1,FALSE)","v":"Electrostatic precipitator, cold side, w/o flue gas conditioning"},{"$f":"VLOOKUP($B154&\"_\"&$C154,Hg_Min_Tests!$A$1:AAD$1000,T$1,FALSE)","v":"Wet FGD - Spray/Tray Type"},{"$f":"VLOOKUP($B154&\"_\"&$C154,Hg_Min_Tests!$A$1:AAE$1000,U$1,FALSE)","v":""}]
[{"$f":"VLOOKUP(B155&\"_\"&C155,Hg_Min_Tests!$A:$AZ,6,FALSE)","v":"San Juan"},2451,"Unit 1","Unit 1","Mercury",1.3090000000000001E-7,"lb/MMBtu",1.3114764864864867E-6,"lb/MW","ETTS","",74,null,null,null,1.3114764864864867E-3,{"$f":"VLOOKUP(B155&\"_\"&C155,Hg_Min_Tests!$A$1:AA$1000,11,FALSE)","v":"Wall firing - front firing"},{"$f":"VLOOKUP($B155&\"_\"&$C155,Hg_Min_Tests!$A$1:AAB$1000,R$1,FALSE)","v":"Activated carbon injection"},{"$f":"VLOOKUP($B155&\"_\"&$C155,Hg_Min_Tests!$A$1:AAC$1000,S$1,FALSE)","v":"Fabric Filter, pulse"},{"$f":"VLOOKUP($B155&\"_\"&$C155,Hg_Min_Tests!$A$1:AAD$1000,T$1,FALSE)","v":"Wet FGD - Spray Type"},{"$f":"VLOOKUP($B155&\"_\"&$C155,Hg_Min_Tests!$A$1:AAE$1000,U$1,FALSE)","v":""}]
[{"$f":"VLOOKUP(B156&\"_\"&C156,Hg_Min_Tests!$A:$AZ,6,FALSE)","v":"Roxboro Steam Electric Plant"},2712,"2","Rox_Cfg_2c","Mercury",1.5089201328E-7,"lb/MMBtu",1.4795144346216786E-6,"lb/MW","ETTS","",75,null,null,null,1.4795144346216786E-3,{"$f":"VLOOKUP(B156&\"_\"&C156,Hg_Min_Tests!$A$1:AA$1000,11,FALSE)","v":"Tangential firing"},{"$f":"VLOOKUP($B156&\"_\"&$C156,Hg_Min_Tests!$A$1:AAB$1000,R$1,FALSE)","v":"Selective Catalytic Reduction"},{"$f":"VLOOKUP($B156&\"_\"&$C156,Hg_Min_Tests!$A$1:AAC$1000,S$1,FALSE)","v":"Electrostatic precipitator, cold side, w/o flue gas conditioning"},{"$f":"VLOOKUP($B156&\"_\"&$C156,Hg_Min_Tests!$A$1:AAD$1000,T$1,FALSE)","v":"Wet FGD - Spray/Tray Type"},{"$f":"VLOOKUP($B156&\"_\"&$C156,Hg_Min_Tests!$A$1:AAE$1000,U$1,FALSE)","v":""}]
[{"$f":"VLOOKUP(B157&\"_\"&C157,Hg_Min_Tests!$A:$AZ,6,FALSE)","v":"Roxboro Steam Electric Plant"},2712,"2","Rox_Cfg_2c","Mercury",6.2783333333333335E-7,"lb/MMBtu",6.1559817449027981E-6,"lb/MW","Part II","Rox_Blr_2_Test_6h",75,null,null,null,6.1559817449027979E-3,{"$f":"VLOOKUP(B157&\"_\"&C157,Hg_Min_Tests!$A$1:AA$1000,11,FALSE)","v":"Tangential firing"},{"$f":"VLOOKUP($B157&\"_\"&$C157,Hg_Min_Tests!$A$1:AAB$1000,R$1,FALSE)","v":"Selective Catalytic Reduction"},{"$f":"VLOOKUP($B157&\"_\"&$C157,Hg_Min_Tests!$A$1:AAC$1000,S$1,FALSE)","v":"Electrostatic precipitator, cold side, w/o flue gas conditioning"},{"$f":"VLOOKUP($B157&\"_\"&$C157,Hg_Min_Tests!$A$1:AAD$1000,T$1,FALSE)","v":"Wet FGD - Spray/Tray Type"},{"$f":"VLOOKUP($B157&\"_\"&$C157,Hg_Min_Tests!$A$1:AAE$1000,U$1,FALSE)","v":""}]
[{"$f":"VLOOKUP(B158&\"_\"&C158,Hg_Min_Tests!$A:$AZ,6,FALSE)","v":"Mecklenburg Power Station"},52007,"BLR2","Unit 1 & 2","Mercury",1.2533333333333332E-7,"lb/MMBtu",1.5122456140350875E-6,"lb/MW","ETTS","",76,null,null,null,1.5122456140350875E-3,{"$f":"VLOOKUP(B158&\"_\"&C158,Hg_Min_Tests!$A$1:AA$1000,11,FALSE)","v":"Wall firing - front firing"},{"$f":"VLOOKUP($B158&\"_\"&$C158,Hg_Min_Tests!$A$1:AAB$1000,R$1,FALSE)","v":"Dry FGD - Spray Dryer"},{"$f":"VLOOKUP($B158&\"_\"&$C158,Hg_Min_Tests!$A$1:AAC$1000,S$1,FALSE)","v":"Dry FGD - Spray Dryer"},{"$f":"VLOOKUP($B158&\"_\"&$C158,Hg_Min_Tests!$A$1:AAD$1000,T$1,FALSE)","v":"Fabric Filter, pulse"},{"$f":"VLOOKUP($B158&\"_\"&$C158,Hg_Min_Tests!$A$1:AAE$1000,U$1,FALSE)","v":"Fabric Filter, pulse"}]
[{"$f":"VLOOKUP(B159&\"_\"&C159,Hg_Min_Tests!$A:$AZ,6,FALSE)","v":"Mecklenburg Power Station"},52007,"BLR1","Unit 1 & 2","Mercury",1.2533333333333332E-7,"lb/MMBtu",1.5122456140350875E-6,"lb/MW","ETTS","",78,null,null,null,1.5122456140350875E-3,{"$f":"VLOOKUP(B159&\"_\"&C159,Hg_Min_Tests!$A$1:AA$1000,11,FALSE)","v":"Wall firing - front firing"},{"$f":"VLOOKUP($B159&\"_\"&$C159,Hg_Min_Tests!$A$1:AAB$1000,R$1,FALSE)","v":"Dry FGD - Spray Dryer"},{"$f":"VLOOKUP($B159&\"_\"&$C159,Hg_Min_Tests!$A$1:AAC$1000,S$1,FALSE)","v":"Dry FGD - Spray Dryer"},{"$f":"VLOOKUP($B159&\"_\"&$C159,Hg_Min_Tests!$A$1:AAD$1000,T$1,FALSE)","v":"Fabric Filter, pulse"},{"$f":"VLOOKUP($B159&\"_\"&$C159,Hg_Min_Tests!$A$1:AAE$1000,U$1,FALSE)","v":"Fabric Filter, pulse"}]
[{"$f":"VLOOKUP(B160&\"_\"&C160,Hg_Min_Tests!$A:$AZ,6,FALSE)","v":"H L Spurlock Station"},6041,"4","Unit 04","Mercury",1.7100000000000001E-7,"lb/MMBtu",1.5960000000000003E-6,"lb/MW","ETTS","",80,null,null,null,1.5960000000000002E-3,{"$f":"VLOOKUP(B160&\"_\"&C160,Hg_Min_Tests!$A$1:AA$1000,11,FALSE)","v":"Fluidized bed firing"},{"$f":"VLOOKUP($B160&\"_\"&$C160,Hg_Min_Tests!$A$1:AAB$1000,R$1,FALSE)","v":"Selective Noncatalytic Reduction"},{"$f":"VLOOKUP($B160&\"_\"&$C160,Hg_Min_Tests!$A$1:AAC$1000,S$1,FALSE)","v":"Dry FGD - Unspecified"},{"$f":"VLOOKUP($B160&\"_\"&$C160,Hg_Min_Tests!$A$1:AAD$1000,T$1,FALSE)","v":"Fabric Filter, pulse"},{"$f":"VLOOKUP($B160&\"_\"&$C160,Hg_Min_Tests!$A$1:AAE$1000,U$1,FALSE)","v":""}]
[{"$f":"VLOOKUP(B161&\"_\"&C161,Hg_Min_Tests!$A:$AZ,6,FALSE)","v":"H L Spurlock Station"},6041,"4","Unit 04","Mercury",5.1399999999999997E-7,"lb/MMBtu",4.7973333333333332E-6,"lb/MW","Part II","Compliance_metals_05/27/09",80,null,null,null,4.7973333333333331E-3,{"$f":"VLOOKUP(B161&\"_\"&C161,Hg_Min_Tests!$A$1:AA$1000,11,FALSE)","v":"Fluidized bed firing"},{"$f":"VLOOKUP($B161&\"_\"&$C161,Hg_Min_Tests!$A$1:AAB$1000,R$1,FALSE)","v":"Selective Noncatalytic Reduction"},{"$f":"VLOOKUP($B161&\"_\"&$C161,Hg_Min_Tests!$A$1:AAC$1000,S$1,FALSE)","v":"Dry FGD - Unspecified"},{"$f":"VLOOKUP($B161&\"_\"&$C161,Hg_Min_Tests!$A$1:AAD$1000,T$1,FALSE)","v":"Fabric Filter, pulse"},{"$f":"VLOOKUP($B161&\"_\"&$C161,Hg_Min_Tests!$A$1:AAE$1000,U$1,FALSE)","v":""}]
[{"$f":"VLOOKUP(B162&\"_\"&C162,Hg_Min_Tests!$A:$AZ,6,FALSE)","v":"Cross"},130,"1","C1","Mercury",1.5033333333333334E-7,"lb/MMBtu",1.6024054644808746E-6,"lb/MW","ETTS","",81,null,null,null,1.6024054644808747E-3,{"$f":"VLOOKUP(B162&\"_\"&C162,Hg_Min_Tests!$A$1:AA$1000,11,FALSE)","v":"Wall firing - opposed firing"},{"$f":"VLOOKUP($B162&\"_\"&$C162,Hg_Min_Tests!$A$1:AAB$1000,R$1,FALSE)","v":"Selective Catalytic Reduction"},{"$f":"VLOOKUP($B162&\"_\"&$C162,Hg_Min_Tests!$A$1:AAC$1000,S$1,FALSE)","v":"Electrostatic precipitator, cold side, w/o flue gas conditioning"},{"$f":"VLOOKUP($B162&\"_\"&$C162,Hg_Min_Tests!$A$1:AAD$1000,T$1,FALSE)","v":"Wet FGD - Spray Type"},{"$f":"VLOOKUP($B162&\"_\"&$C162,Hg_Min_Tests!$A$1:AAE$1000,U$1,FALSE)","v":""}]
[{"$f":"VLOOKUP(B163&\"_\"&C163,Hg_Min_Tests!$A:$AZ,6,FALSE)","v":"Havana"},891,"Boiler 9","Boiler 9","Mercury",1.5966666666666665E-7,"lb/MMBtu",1.6696950796950796E-6,"lb/MW","ETTS","",82,null,null,null,1.6696950796950796E-3,{"$f":"VLOOKUP(B163&\"_\"&C163,Hg_Min_Tests!$A$1:AA$1000,11,FALSE)","v":"Wall firing - unspecified"},{"$f":"VLOOKUP($B163&\"_\"&$C163,Hg_Min_Tests!$A$1:AAB$1000,R$1,FALSE)","v":"Electrostatic precipitator, hot side, unspecified"},{"$f":"VLOOKUP($B163&\"_\"&$C163,Hg_Min_Tests!$A$1:AAC$1000,S$1,FALSE)","v":"Selective Catalytic Reduction"},{"$f":"VLOOKUP($B163&\"_\"&$C163,Hg_Min_Tests!$A$1:AAD$1000,T$1,FALSE)","v":"Activated carbon injection"},{"$f":"VLOOKUP($B163&\"_\"&$C163,Hg_Min_Tests!$A$1:AAE$1000,U$1,FALSE)","v":"Dry FGD - Spray Dryer"}]
[{"$f":"VLOOKUP(B164&\"_\"&C164,Hg_Min_Tests!$A:$AZ,6,FALSE)","v":"Hennepin Power Station"},892,"Unit 1","001","Mercury",1.6166666666666667E-7,"lb/MMBtu",1.6727111111111111E-6,"lb/MW","ETTS","",83,null,null,null,1.6727111111111111E-3,{"$f":"VLOOKUP(B164&\"_\"&C164,Hg_Min_Tests!$A$1:AA$1000,11,FALSE)","v":"Tangential firing"},{"$f":"VLOOKUP($B164&\"_\"&$C164,Hg_Min_Tests!$A$1:AAB$1000,R$1,FALSE)","v":"Electrostatic precipitator, cold side, unspecified"},{"$f":"VLOOKUP($B164&\"_\"&$C164,Hg_Min_Tests!$A$1:AAC$1000,S$1,FALSE)","v":"Activated carbon injection"},{"$f":"VLOOKUP($B164&\"_\"&$C164,Hg_Min_Tests!$A$1:AAD$1000,T$1,FALSE)","v":"Fabric Filter, unspecified"},{"$f":"VLOOKUP($B164&\"_\"&$C164,Hg_Min_Tests!$A$1:AAE$1000,U$1,FALSE)","v":""}]
[{"$f":"VLOOKUP(B165&\"_\"&C165,Hg_Min_Tests!$A:$AZ,6,FALSE)","v":"Hennepin Power Station"},892,"Unit 2","002","Mercury",1.6166666666666667E-7,"lb/MMBtu",1.7272079772079771E-6,"lb/MW","ETTS","",84,null,null,null,1.727207977207977E-3,{"$f":"VLOOKUP(B165&\"_\"&C165,Hg_Min_Tests!$A$1:AA$1000,11,FALSE)","v":"Tangential firing"},{"$f":"VLOOKUP($B165&\"_\"&$C165,Hg_Min_Tests!$A$1:AAB$1000,R$1,FALSE)","v":"Electrostatic precipitator, cold side, unspecified"},{"$f":"VLOOKUP($B165&\"_\"&$C165,Hg_Min_Tests!$A$1:AAC$1000,S$1,FALSE)","v":"Activated carbon injection"},{"$f":"VLOOKUP($B165&\"_\"&$C165,Hg_Min_Tests!$A$1:AAD$1000,T$1,FALSE)","v":"Fabric Filter, unspecified"},{"$f":"VLOOKUP($B165&\"_\"&$C165,Hg_Min_Tests!$A$1:AAE$1000,U$1,FALSE)","v":""}]
[{"$f":"VLOOKUP(B166&\"_\"&C166,Hg_Min_Tests!$A:$AZ,6,FALSE)","v":"Brandon Shores"},602,"2","002","Mercury",1.8469666666666669E-7,"lb/MMBtu",1.7934314009661838E-6,"lb/MW","CEMS","",85,null,null,null,1.7934314009661839E-3,{"$f":"VLOOKUP(B166&\"_\"&C166,Hg_Min_Tests!$A$1:AA$1000,11,FALSE)","v":"Wall firing - unspecified"},{"$f":"VLOOKUP($B166&\"_\"&$C166,Hg_Min_Tests!$A$1:AAB$1000,R$1,FALSE)","v":"Selective Catalytic Reduction"},{"$f":"VLOOKUP($B166&\"_\"&$C166,Hg_Min_Tests!$A$1:AAC$1000,S$1,FALSE)","v":"Electrostatic precipitator, hot side, unspecified"},{"$f":"VLOOKUP($B166&\"_\"&$C166,Hg_Min_Tests!$A$1:AAD$1000,T$1,FALSE)","v":"Activated carbon injection"},{"$f":"VLOOKUP($B166&\"_\"&$C166,Hg_Min_Tests!$A$1:AAE$1000,U$1,FALSE)","v":"Other (specify): lime injection"}]
[{"$f":"VLOOKUP(B167&\"_\"&C167,Hg_Min_Tests!$A:$AZ,6,FALSE)","v":"Somerset Station"},1613,"8","Unit 8","Mercury",1.7450000000000001E-7,"lb/MMBtu",1.9828141592920355E-6,"lb/MW","Part II","11",86,null,null,null,1.9828141592920356E-3,{"$f":"VLOOKUP(B167&\"_\"&C167,Hg_Min_Tests!$A$1:AA$1000,11,FALSE)","v":"Tangential firing"},{"$f":"VLOOKUP($B167&\"_\"&$C167,Hg_Min_Tests!$A$1:AAB$1000,R$1,FALSE)","v":"Selective Noncatalytic Reduction"},{"$f":"VLOOKUP($B167&\"_\"&$C167,Hg_Min_Tests!$A$1:AAC$1000,S$1,FALSE)","v":"Electrostatic precipitator, cold side, w/o flue gas conditioning"},{"$f":"VLOOKUP($B167&\"_\"&$C167,Hg_Min_Tests!$A$1:AAD$1000,T$1,FALSE)","v":""},{"$f":"VLOOKUP($B167&\"_\"&$C167,Hg_Min_Tests!$A$1:AAE$1000,U$1,FALSE)","v":""}]
[{"$f":"VLOOKUP(B168&\"_\"&C168,Hg_Min_Tests!$A:$AZ,6,FALSE)","v":"Somerset Station"},1613,"8","Unit 8","Mercury",4.1699999999999999E-7,"lb/MMBtu",4.7383008849557524E-6,"lb/MW","Part II","7",86,null,null,null,4.7383008849557528E-3,{"$f":"VLOOKUP(B168&\"_\"&C168,Hg_Min_Tests!$A$1:AA$1000,11,FALSE)","v":"Tangential firing"},{"$f":"VLOOKUP($B168&\"_\"&$C168,Hg_Min_Tests!$A$1:AAB$1000,R$1,FALSE)","v":"Selective Noncatalytic Reduction"},{"$f":"VLOOKUP($B168&\"_\"&$C168,Hg_Min_Tests!$A$1:AAC$1000,S$1,FALSE)","v":"Electrostatic precipitator, cold side, w/o flue gas conditioning"},{"$f":"VLOOKUP($B168&\"_\"&$C168,Hg_Min_Tests!$A$1:AAD$1000,T$1,FALSE)","v":""},{"$f":"VLOOKUP($B168&\"_\"&$C168,Hg_Min_Tests!$A$1:AAE$1000,U$1,FALSE)","v":""}]
[{"$f":"VLOOKUP(B169&\"_\"&C169,Hg_Min_Tests!$A:$AZ,6,FALSE)","v":"Somerset Station"},1613,"8","Unit 8","Mercury",5.4099999999999999E-7,"lb/MMBtu",6.1472920353982304E-6,"lb/MW","Part II","8",86,null,null,null,6.1472920353982307E-3,{"$f":"VLOOKUP(B169&\"_\"&C169,Hg_Min_Tests!$A$1:AA$1000,11,FALSE)","v":"Tangential firing"},{"$f":"VLOOKUP($B169&\"_\"&$C169,Hg_Min_Tests!$A$1:AAB$1000,R$1,FALSE)","v":"Selective Noncatalytic Reduction"},{"$f":"VLOOKUP($B169&\"_\"&$C169,Hg_Min_Tests!$A$1:AAC$1000,S$1,FALSE)","v":"Electrostatic precipitator, cold side, w/o flue gas conditioning"},{"$f":"VLOOKUP($B169&\"_\"&$C169,Hg_Min_Tests!$A$1:AAD$1000,T$1,FALSE)","v":""},{"$f":"VLOOKUP($B169&\"_\"&$C169,Hg_Min_Tests!$A$1:AAE$1000,U$1,FALSE)","v":""}]
[{"$f":"VLOOKUP(B170&\"_\"&C170,Hg_Min_Tests!$A:$AZ,6,FALSE)","v":"Somerset Station"},1613,"8","Unit 8","Mercury",5.9400000000000005E-7,"lb/MMBtu",6.7495221238938063E-6,"lb/MW","Part II","6",86,null,null,null,6.7495221238938067E-3,{"$f":"VLOOKUP(B170&\"_\"&C170,Hg_Min_Tests!$A$1:AA$1000,11,FALSE)","v":"Tangential firing"},{"$f":"VLOOKUP($B170&\"_\"&$C170,Hg_Min_Tests!$A$1:AAB$1000,R$1,FALSE)","v":"Selective Noncatalytic Reduction"},{"$f":"VLOOKUP($B170&\"_\"&$C170,Hg_Min_Tests!$A$1:AAC$1000,S$1,FALSE)","v":"Electrostatic precipitator, cold side, w/o flue gas conditioning"},{"$f":"VLOOKUP($B170&\"_\"&$C170,Hg_Min_Tests!$A$1:AAD$1000,T$1,FALSE)","v":""},{"$f":"VLOOKUP($B170&\"_\"&$C170,Hg_Min_Tests!$A$1:AAE$1000,U$1,FALSE)","v":""}]
[{"$f":"VLOOKUP(B171&\"_\"&C171,Hg_Min_Tests!$A:$AZ,6,FALSE)","v":"Somerset Station"},1613,"8","Unit 8","Mercury",1.3403012632442614E-6,"lb/MMBtu",1.5229617893855149E-5,"lb/MW","Part II","4",86,null,null,null,1.5229617893855149E-2,{"$f":"VLOOKUP(B171&\"_\"&C171,Hg_Min_Tests!$A$1:AA$1000,11,FALSE)","v":"Tangential firing"},{"$f":"VLOOKUP($B171&\"_\"&$C171,Hg_Min_Tests!$A$1:AAB$1000,R$1,FALSE)","v":"Selective Noncatalytic Reduction"},{"$f":"VLOOKUP($B171&\"_\"&$C171,Hg_Min_Tests!$A$1:AAC$1000,S$1,FALSE)","v":"Electrostatic precipitator, cold side, w/o flue gas conditioning"},{"$f":"VLOOKUP($B171&\"_\"&$C171,Hg_Min_Tests!$A$1:AAD$1000,T$1,FALSE)","v":""},{"$f":"VLOOKUP($B171&\"_\"&$C171,Hg_Min_Tests!$A$1:AAE$1000,U$1,FALSE)","v":""}]
[{"$f":"VLOOKUP(B172&\"_\"&C172,Hg_Min_Tests!$A:$AZ,6,FALSE)","v":"Somerset Station"},1613,"8","Unit 8","Mercury",1.3770218457988991E-6,"lb/MMBtu",1.5646867699166254E-5,"lb/MW","Part II","2",86,null,null,null,1.5646867699166254E-2,{"$f":"VLOOKUP(B172&\"_\"&C172,Hg_Min_Tests!$A$1:AA$1000,11,FALSE)","v":"Tangential firing"},{"$f":"VLOOKUP($B172&\"_\"&$C172,Hg_Min_Tests!$A$1:AAB$1000,R$1,FALSE)","v":"Selective Noncatalytic Reduction"},{"$f":"VLOOKUP($B172&\"_\"&$C172,Hg_Min_Tests!$A$1:AAC$1000,S$1,FALSE)","v":"Electrostatic precipitator, cold side, w/o flue gas conditioning"},{"$f":"VLOOKUP($B172&\"_\"&$C172,Hg_Min_Tests!$A$1:AAD$1000,T$1,FALSE)","v":""},{"$f":"VLOOKUP($B172&\"_\"&$C172,Hg_Min_Tests!$A$1:AAE$1000,U$1,FALSE)","v":""}]
[{"$f":"VLOOKUP(B173&\"_\"&C173,Hg_Min_Tests!$A:$AZ,6,FALSE)","v":"Somerset Station"},1613,"8","Unit 8","Mercury",1.6199999999999999E-6,"lb/MMBtu",1.840778761061947E-5,"lb/MW","Part II","10",86,null,null,null,1.840778761061947E-2,{"$f":"VLOOKUP(B173&\"_\"&C173,Hg_Min_Tests!$A$1:AA$1000,11,FALSE)","v":"Tangential firing"},{"$f":"VLOOKUP($B173&\"_\"&$C173,Hg_Min_Tests!$A$1:AAB$1000,R$1,FALSE)","v":"Selective Noncatalytic Reduction"},{"$f":"VLOOKUP($B173&\"_\"&$C173,Hg_Min_Tests!$A$1:AAC$1000,S$1,FALSE)","v":"Electrostatic precipitator, cold side, w/o flue gas conditioning"},{"$f":"VLOOKUP($B173&\"_\"&$C173,Hg_Min_Tests!$A$1:AAD$1000,T$1,FALSE)","v":""},{"$f":"VLOOKUP($B173&\"_\"&$C173,Hg_Min_Tests!$A$1:AAE$1000,U$1,FALSE)","v":""}]
[{"$f":"VLOOKUP(B174&\"_\"&C174,Hg_Min_Tests!$A:$AZ,6,FALSE)","v":"Somerset Station"},1613,"8","Unit 8","Mercury",1.8268489820932075E-6,"lb/MMBtu",2.0758177814227244E-5,"lb/MW","Part II","5",86,null,null,null,2.0758177814227244E-2,{"$f":"VLOOKUP(B174&\"_\"&C174,Hg_Min_Tests!$A$1:AA$1000,11,FALSE)","v":"Tangential firing"},{"$f":"VLOOKUP($B174&\"_\"&$C174,Hg_Min_Tests!$A$1:AAB$1000,R$1,FALSE)","v":"Selective Noncatalytic Reduction"},{"$f":"VLOOKUP($B174&\"_\"&$C174,Hg_Min_Tests!$A$1:AAC$1000,S$1,FALSE)","v":"Electrostatic precipitator, cold side, w/o flue gas conditioning"},{"$f":"VLOOKUP($B174&\"_\"&$C174,Hg_Min_Tests!$A$1:AAD$1000,T$1,FALSE)","v":""},{"$f":"VLOOKUP($B174&\"_\"&$C174,Hg_Min_Tests!$A$1:AAE$1000,U$1,FALSE)","v":""}]
[{"$f":"VLOOKUP(B175&\"_\"&C175,Hg_Min_Tests!$A:$AZ,6,FALSE)","v":"Somerset Station"},1613,"8","Unit 8","Mercury",1.8989999999999999E-6,"lb/MMBtu",2.1578017699115044E-5,"lb/MW","Part II","9",86,null,null,null,2.1578017699115045E-2,{"$f":"VLOOKUP(B175&\"_\"&C175,Hg_Min_Tests!$A$1:AA$1000,11,FALSE)","v":"Tangential firing"},{"$f":"VLOOKUP($B175&\"_\"&$C175,Hg_Min_Tests!$A$1:AAB$1000,R$1,FALSE)","v":"Selective Noncatalytic Reduction"},{"$f":"VLOOKUP($B175&\"_\"&$C175,Hg_Min_Tests!$A$1:AAC$1000,S$1,FALSE)","v":"Electrostatic precipitator, cold side, w/o flue gas conditioning"},{"$f":"VLOOKUP($B175&\"_\"&$C175,Hg_Min_Tests!$A$1:AAD$1000,T$1,FALSE)","v":""},{"$f":"VLOOKUP($B175&\"_\"&$C175,Hg_Min_Tests!$A$1:AAE$1000,U$1,FALSE)","v":""}]
[{"$f":"VLOOKUP(B176&\"_\"&C176,Hg_Min_Tests!$A:$AZ,6,FALSE)","v":"Somerset Station"},1613,"8","Unit 8","Mercury",2.1129999999999999E-6,"lb/MMBtu",2.4009663716814161E-5,"lb/MW","Part II","13",86,null,null,null,2.4009663716814161E-2,{"$f":"VLOOKUP(B176&\"_\"&C176,Hg_Min_Tests!$A$1:AA$1000,11,FALSE)","v":"Tangential firing"},{"$f":"VLOOKUP($B176&\"_\"&$C176,Hg_Min_Tests!$A$1:AAB$1000,R$1,FALSE)","v":"Selective Noncatalytic Reduction"},{"$f":"VLOOKUP($B176&\"_\"&$C176,Hg_Min_Tests!$A$1:AAC$1000,S$1,FALSE)","v":"Electrostatic precipitator, cold side, w/o flue gas conditioning"},{"$f":"VLOOKUP($B176&\"_\"&$C176,Hg_Min_Tests!$A$1:AAD$1000,T$1,FALSE)","v":""},{"$f":"VLOOKUP($B176&\"_\"&$C176,Hg_Min_Tests!$A$1:AAE$1000,U$1,FALSE)","v":""}]
[{"$f":"VLOOKUP(B177&\"_\"&C177,Hg_Min_Tests!$A:$AZ,6,FALSE)","v":"Somerset Station"},1613,"8","Unit 8","Mercury",2.5399999999999998E-6,"lb/MMBtu",2.8861592920353982E-5,"lb/MW","Part II","12",86,null,null,null,2.8861592920353982E-2,{"$f":"VLOOKUP(B177&\"_\"&C177,Hg_Min_Tests!$A$1:AA$1000,11,FALSE)","v":"Tangential firing"},{"$f":"VLOOKUP($B177&\"_\"&$C177,Hg_Min_Tests!$A$1:AAB$1000,R$1,FALSE)","v":"Selective Noncatalytic Reduction"},{"$f":"VLOOKUP($B177&\"_\"&$C177,Hg_Min_Tests!$A$1:AAC$1000,S$1,FALSE)","v":"Electrostatic precipitator, cold side, w/o flue gas conditioning"},{"$f":"VLOOKUP($B177&\"_\"&$C177,Hg_Min_Tests!$A$1:AAD$1000,T$1,FALSE)","v":""},{"$f":"VLOOKUP($B177&\"_\"&$C177,Hg_Min_Tests!$A$1:AAE$1000,U$1,FALSE)","v":""}]
[{"$f":"VLOOKUP(B178&\"_\"&C178,Hg_Min_Tests!$A:$AZ,6,FALSE)","v":"Somerset Station"},1613,"8","Unit 8","Mercury",2.8080000000000001E-6,"lb/MMBtu",3.1906831858407084E-5,"lb/MW","Part II","14",86,null,null,null,3.1906831858407085E-2,{"$f":"VLOOKUP(B178&\"_\"&C178,Hg_Min_Tests!$A$1:AA$1000,11,FALSE)","v":"Tangential firing"},{"$f":"VLOOKUP($B178&\"_\"&$C178,Hg_Min_Tests!$A$1:AAB$1000,R$1,FALSE)","v":"Selective Noncatalytic Reduction"},{"$f":"VLOOKUP($B178&\"_\"&$C178,Hg_Min_Tests!$A$1:AAC$1000,S$1,FALSE)","v":"Electrostatic precipitator, cold side, w/o flue gas conditioning"},{"$f":"VLOOKUP($B178&\"_\"&$C178,Hg_Min_Tests!$A$1:AAD$1000,T$1,FALSE)","v":""},{"$f":"VLOOKUP($B178&\"_\"&$C178,Hg_Min_Tests!$A$1:AAE$1000,U$1,FALSE)","v":""}]
[{"$f":"VLOOKUP(B179&\"_\"&C179,Hg_Min_Tests!$A:$AZ,6,FALSE)","v":"Ray D Nixon"},8219,"1","Unit 1","Mercury",2.1549999999999999E-7,"lb/MMBtu",2.0065444444444446E-6,"lb/MW","Part II","APT CSU5384 N",87,null,null,null,2.0065444444444447E-3,{"$f":"VLOOKUP(B179&\"_\"&C179,Hg_Min_Tests!$A$1:AA$1000,11,FALSE)","v":"Wall firing - front firing"},{"$f":"VLOOKUP($B179&\"_\"&$C179,Hg_Min_Tests!$A$1:AAB$1000,R$1,FALSE)","v":"Fabric Filter, reverse air"},{"$f":"VLOOKUP($B179&\"_\"&$C179,Hg_Min_Tests!$A$1:AAC$1000,S$1,FALSE)","v":""},{"$f":"VLOOKUP($B179&\"_\"&$C179,Hg_Min_Tests!$A$1:AAD$1000,T$1,FALSE)","v":""},{"$f":"VLOOKUP($B179&\"_\"&$C179,Hg_Min_Tests!$A$1:AAE$1000,U$1,FALSE)","v":""}]
[{"$f":"VLOOKUP(B180&\"_\"&C180,Hg_Min_Tests!$A:$AZ,6,FALSE)","v":"Ray D Nixon"},8219,"1","Unit 1","Mercury",3.6400000000000003E-7,"lb/MMBtu",3.3892444444444449E-6,"lb/MW","Part II","Airtech 2480N",87,null,null,null,3.3892444444444448E-3,{"$f":"VLOOKUP(B180&\"_\"&C180,Hg_Min_Tests!$A$1:AA$1000,11,FALSE)","v":"Wall firing - front firing"},{"$f":"VLOOKUP($B180&\"_\"&$C180,Hg_Min_Tests!$A$1:AAB$1000,R$1,FALSE)","v":"Fabric Filter, reverse air"},{"$f":"VLOOKUP($B180&\"_\"&$C180,Hg_Min_Tests!$A$1:AAC$1000,S$1,FALSE)","v":""},{"$f":"VLOOKUP($B180&\"_\"&$C180,Hg_Min_Tests!$A$1:AAD$1000,T$1,FALSE)","v":""},{"$f":"VLOOKUP($B180&\"_\"&$C180,Hg_Min_Tests!$A$1:AAE$1000,U$1,FALSE)","v":""}]
[{"$f":"VLOOKUP(B181&\"_\"&C181,Hg_Min_Tests!$A:$AZ,6,FALSE)","v":"Ray D Nixon"},8219,"1","Unit 1","Mercury",1.0804999999999999E-6,"lb/MMBtu",1.0060655555555554E-5,"lb/MW","Part II","Airtech 2693-O",87,null,null,null,1.0060655555555555E-2,{"$f":"VLOOKUP(B181&\"_\"&C181,Hg_Min_Tests!$A$1:AA$1000,11,FALSE)","v":"Wall firing - front firing"},{"$f":"VLOOKUP($B181&\"_\"&$C181,Hg_Min_Tests!$A$1:AAB$1000,R$1,FALSE)","v":"Fabric Filter, reverse air"},{"$f":"VLOOKUP($B181&\"_\"&$C181,Hg_Min_Tests!$A$1:AAC$1000,S$1,FALSE)","v":""},{"$f":"VLOOKUP($B181&\"_\"&$C181,Hg_Min_Tests!$A$1:AAD$1000,T$1,FALSE)","v":""},{"$f":"VLOOKUP($B181&\"_\"&$C181,Hg_Min_Tests!$A$1:AAE$1000,U$1,FALSE)","v":""}]
[{"$f":"VLOOKUP(B182&\"_\"&C182,Hg_Min_Tests!$A:$AZ,6,FALSE)","v":"Clinch River"},3775,"1","CR-1","Mercury",2.2725261675750002E-7,"lb/MMBtu",2.0758044458514426E-6,"lb/MW","ETTS","",88,null,null,null,2.0758044458514427E-3,{"$f":"VLOOKUP(B182&\"_\"&C182,Hg_Min_Tests!$A$1:AA$1000,11,FALSE)","v":"Vertical firing"},{"$f":"VLOOKUP($B182&\"_\"&$C182,Hg_Min_Tests!$A$1:AAB$1000,R$1,FALSE)","v":"Selective Noncatalytic Reduction"},{"$f":"VLOOKUP($B182&\"_\"&$C182,Hg_Min_Tests!$A$1:AAC$1000,S$1,FALSE)","v":"Electrostatic precipitator, cold side, w/ flue gas conditioning"},{"$f":"VLOOKUP($B182&\"_\"&$C182,Hg_Min_Tests!$A$1:AAD$1000,T$1,FALSE)","v":""},{"$f":"VLOOKUP($B182&\"_\"&$C182,Hg_Min_Tests!$A$1:AAE$1000,U$1,FALSE)","v":""}]
[{"$f":"VLOOKUP(B183&\"_\"&C183,Hg_Min_Tests!$A:$AZ,6,FALSE)","v":"Asheville Steam Electric Plant"},2706,"1","Ash_Cfg_1d","Mercury",2.2933333333333335E-7,"lb/MMBtu",2.1205024154589375E-6,"lb/MW","Part II","Ash_Blr_1_Test_8ap",89,null,null,null,2.1205024154589375E-3,{"$f":"VLOOKUP(B183&\"_\"&C183,Hg_Min_Tests!$A$1:AA$1000,11,FALSE)","v":"Wall firing - front firing"},{"$f":"VLOOKUP($B183&\"_\"&$C183,Hg_Min_Tests!$A$1:AAB$1000,R$1,FALSE)","v":"Selective Catalytic Reduction"},{"$f":"VLOOKUP($B183&\"_\"&$C183,Hg_Min_Tests!$A$1:AAC$1000,S$1,FALSE)","v":"Electrostatic precipitator, cold side, w/o flue gas conditioning"},{"$f":"VLOOKUP($B183&\"_\"&$C183,Hg_Min_Tests!$A$1:AAD$1000,T$1,FALSE)","v":"Wet FGD - Spray/Tray Type"},{"$f":"VLOOKUP($B183&\"_\"&$C183,Hg_Min_Tests!$A$1:AAE$1000,U$1,FALSE)","v":""}]
[{"$f":"VLOOKUP(B184&\"_\"&C184,Hg_Min_Tests!$A:$AZ,6,FALSE)","v":"Asheville Steam Electric Plant"},2706,"1","Ash_Cfg_1d","Mercury",6.7033333333333326E-7,"lb/MMBtu",6.1981545893719802E-6,"lb/MW","ETTS","",89,null,null,null,6.19815458937198E-3,{"$f":"VLOOKUP(B184&\"_\"&C184,Hg_Min_Tests!$A$1:AA$1000,11,FALSE)","v":"Wall firing - front firing"},{"$f":"VLOOKUP($B184&\"_\"&$C184,Hg_Min_Tests!$A$1:AAB$1000,R$1,FALSE)","v":"Selective Catalytic Reduction"},{"$f":"VLOOKUP($B184&\"_\"&$C184,Hg_Min_Tests!$A$1:AAC$1000,S$1,FALSE)","v":"Electrostatic precipitator, cold side, w/o flue gas conditioning"},{"$f":"VLOOKUP($B184&\"_\"&$C184,Hg_Min_Tests!$A$1:AAD$1000,T$1,FALSE)","v":"Wet FGD - Spray/Tray Type"},{"$f":"VLOOKUP($B184&\"_\"&$C184,Hg_Min_Tests!$A$1:AAE$1000,U$1,FALSE)","v":""}]
[{"$f":"VLOOKUP(B185&\"_\"&C185,Hg_Min_Tests!$A:$AZ,6,FALSE)","v":"Cross"},130,"3","C3","Mercury",2.2900000000000003E-7,"lb/MMBtu",2.2196512000000001E-6,"lb/MW","ETTS","",90,null,null,null,2.2196512000000001E-3,{"$f":"VLOOKUP(B185&\"_\"&C185,Hg_Min_Tests!$A$1:AA$1000,11,FALSE)","v":"Tangential firing"},{"$f":"VLOOKUP($B185&\"_\"&$C185,Hg_Min_Tests!$A$1:AAB$1000,R$1,FALSE)","v":"Selective Catalytic Reduction"},{"$f":"VLOOKUP($B185&\"_\"&$C185,Hg_Min_Tests!$A$1:AAC$1000,S$1,FALSE)","v":"Electrostatic precipitator, cold side, w/o flue gas conditioning"},{"$f":"VLOOKUP($B185&\"_\"&$C185,Hg_Min_Tests!$A$1:AAD$1000,T$1,FALSE)","v":"Wet FGD - Spray Type"},{"$f":"VLOOKUP($B185&\"_\"&$C185,Hg_Min_Tests!$A$1:AAE$1000,U$1,FALSE)","v":""}]
[{"$f":"VLOOKUP(B186&\"_\"&C186,Hg_Min_Tests!$A:$AZ,6,FALSE)","v":"Cross"},130,"3","C3","Mercury",4.7208814879537854E-7,"lb/MMBtu",4.5758560086438452E-6,"lb/MW","Part II","C3LME2008",90,null,null,null,4.5758560086438449E-3,{"$f":"VLOOKUP(B186&\"_\"&C186,Hg_Min_Tests!$A$1:AA$1000,11,FALSE)","v":"Tangential firing"},{"$f":"VLOOKUP($B186&\"_\"&$C186,Hg_Min_Tests!$A$1:AAB$1000,R$1,FALSE)","v":"Selective Catalytic Reduction"},{"$f":"VLOOKUP($B186&\"_\"&$C186,Hg_Min_Tests!$A$1:AAC$1000,S$1,FALSE)","v":"Electrostatic precipitator, cold side, w/o flue gas conditioning"},{"$f":"VLOOKUP($B186&\"_\"&$C186,Hg_Min_Tests!$A$1:AAD$1000,T$1,FALSE)","v":"Wet FGD - Spray Type"},{"$f":"VLOOKUP($B186&\"_\"&$C186,Hg_Min_Tests!$A$1:AAE$1000,U$1,FALSE)","v":""}]
[{"$f":"VLOOKUP(B187&\"_\"&C187,Hg_Min_Tests!$A:$AZ,6,FALSE)","v":"Cross"},130,"3","C3","Mercury",6.5733333333333334E-7,"lb/MMBtu",6.3714005333333335E-6,"lb/MW","Part II","C3TV292008",90,null,null,null,6.3714005333333334E-3,{"$f":"VLOOKUP(B187&\"_\"&C187,Hg_Min_Tests!$A$1:AA$1000,11,FALSE)","v":"Tangential firing"},{"$f":"VLOOKUP($B187&\"_\"&$C187,Hg_Min_Tests!$A$1:AAB$1000,R$1,FALSE)","v":"Selective Catalytic Reduction"},{"$f":"VLOOKUP($B187&\"_\"&$C187,Hg_Min_Tests!$A$1:AAC$1000,S$1,FALSE)","v":"Electrostatic precipitator, cold side, w/o flue gas conditioning"},{"$f":"VLOOKUP($B187&\"_\"&$C187,Hg_Min_Tests!$A$1:AAD$1000,T$1,FALSE)","v":"Wet FGD - Spray Type"},{"$f":"VLOOKUP($B187&\"_\"&$C187,Hg_Min_Tests!$A$1:AAE$1000,U$1,FALSE)","v":""}]
[{"$f":"VLOOKUP(B188&\"_\"&C188,Hg_Min_Tests!$A:$AZ,6,FALSE)","v":"Cross"},130,"3","C3","Mercury",7.2333333333333333E-7,"lb/MMBtu",7.0111253333333337E-6,"lb/MW","Part II","C3TVM292007",90,null,null,null,7.011125333333334E-3,{"$f":"VLOOKUP(B188&\"_\"&C188,Hg_Min_Tests!$A$1:AA$1000,11,FALSE)","v":"Tangential firing"},{"$f":"VLOOKUP($B188&\"_\"&$C188,Hg_Min_Tests!$A$1:AAB$1000,R$1,FALSE)","v":"Selective Catalytic Reduction"},{"$f":"VLOOKUP($B188&\"_\"&$C188,Hg_Min_Tests!$A$1:AAC$1000,S$1,FALSE)","v":"Electrostatic precipitator, cold side, w/o flue gas conditioning"},{"$f":"VLOOKUP($B188&\"_\"&$C188,Hg_Min_Tests!$A$1:AAD$1000,T$1,FALSE)","v":"Wet FGD - Spray Type"},{"$f":"VLOOKUP($B188&\"_\"&$C188,Hg_Min_Tests!$A$1:AAE$1000,U$1,FALSE)","v":""}]
[{"$f":"VLOOKUP(B189&\"_\"&C189,Hg_Min_Tests!$A:$AZ,6,FALSE)","v":"Cross"},130,"3","C3","Mercury",7.9933333333333321E-7,"lb/MMBtu",7.747778133333332E-6,"lb/MW","Part II","C3TV292009",90,null,null,null,7.7477781333333317E-3,{"$f":"VLOOKUP(B189&\"_\"&C189,Hg_Min_Tests!$A$1:AA$1000,11,FALSE)","v":"Tangential firing"},{"$f":"VLOOKUP($B189&\"_\"&$C189,Hg_Min_Tests!$A$1:AAB$1000,R$1,FALSE)","v":"Selective Catalytic Reduction"},{"$f":"VLOOKUP($B189&\"_\"&$C189,Hg_Min_Tests!$A$1:AAC$1000,S$1,FALSE)","v":"Electrostatic precipitator, cold side, w/o flue gas conditioning"},{"$f":"VLOOKUP($B189&\"_\"&$C189,Hg_Min_Tests!$A$1:AAD$1000,T$1,FALSE)","v":"Wet FGD - Spray Type"},{"$f":"VLOOKUP($B189&\"_\"&$C189,Hg_Min_Tests!$A$1:AAE$1000,U$1,FALSE)","v":""}]
[{"$f":"VLOOKUP(B190&\"_\"&C190,Hg_Min_Tests!$A:$AZ,6,FALSE)","v":"Kincaid Generation LLC"},876,"2","KI1 & 2","Mercury",2.2333333333333332E-7,"lb/MMBtu",2.408707264957265E-6,"lb/MW","Part II","2009Hg",91,null,null,null,2.4087072649572648E-3,{"$f":"VLOOKUP(B190&\"_\"&C190,Hg_Min_Tests!$A$1:AA$1000,11,FALSE)","v":"Cyclone firing"},{"$f":"VLOOKUP($B190&\"_\"&$C190,Hg_Min_Tests!$A$1:AAB$1000,R$1,FALSE)","v":"Selective Catalytic Reduction"},{"$f":"VLOOKUP($B190&\"_\"&$C190,Hg_Min_Tests!$A$1:AAC$1000,S$1,FALSE)","v":"Selective Catalytic Reduction"},{"$f":"VLOOKUP($B190&\"_\"&$C190,Hg_Min_Tests!$A$1:AAD$1000,T$1,FALSE)","v":"Activated carbon injection"},{"$f":"VLOOKUP($B190&\"_\"&$C190,Hg_Min_Tests!$A$1:AAE$1000,U$1,FALSE)","v":"Activated carbon injection"}]
[{"$f":"VLOOKUP(B191&\"_\"&C191,Hg_Min_Tests!$A:$AZ,6,FALSE)","v":"Kincaid Generation LLC"},876,"1","KI1 & 2","Mercury",2.2333333333333332E-7,"lb/MMBtu",2.408707264957265E-6,"lb/MW","Part II","2009Hg",92,null,null,null,2.4087072649572648E-3,{"$f":"VLOOKUP(B191&\"_\"&C191,Hg_Min_Tests!$A$1:AA$1000,11,FALSE)","v":"Cyclone firing"},{"$f":"VLOOKUP($B191&\"_\"&$C191,Hg_Min_Tests!$A$1:AAB$1000,R$1,FALSE)","v":"Selective Catalytic Reduction"},{"$f":"VLOOKUP($B191&\"_\"&$C191,Hg_Min_Tests!$A$1:AAC$1000,S$1,FALSE)","v":"Selective Catalytic Reduction"},{"$f":"VLOOKUP($B191&\"_\"&$C191,Hg_Min_Tests!$A$1:AAD$1000,T$1,FALSE)","v":"Activated carbon injection"},{"$f":"VLOOKUP($B191&\"_\"&$C191,Hg_Min_Tests!$A$1:AAE$1000,U$1,FALSE)","v":"Activated carbon injection"}]
[{"$f":"VLOOKUP(B192&\"_\"&C192,Hg_Min_Tests!$A:$AZ,6,FALSE)","v":"Williams"},3298,"WIL1","WIL001","Mercury",2.8099999999999999E-7,"lb/MMBtu",2.4495981651376143E-6,"lb/MW","Part II","Hg-12/09",93,null,null,null,2.4495981651376144E-3,{"$f":"VLOOKUP(B192&\"_\"&C192,Hg_Min_Tests!$A$1:AA$1000,11,FALSE)","v":"Tangential firing"},{"$f":"VLOOKUP($B192&\"_\"&$C192,Hg_Min_Tests!$A$1:AAB$1000,R$1,FALSE)","v":"Selective Catalytic Reduction"},{"$f":"VLOOKUP($B192&\"_\"&$C192,Hg_Min_Tests!$A$1:AAC$1000,S$1,FALSE)","v":"Electrostatic precipitator, cold side, unspecified"},{"$f":"VLOOKUP($B192&\"_\"&$C192,Hg_Min_Tests!$A$1:AAD$1000,T$1,FALSE)","v":"Wet FGD - Unspecified"},{"$f":"VLOOKUP($B192&\"_\"&$C192,Hg_Min_Tests!$A$1:AAE$1000,U$1,FALSE)","v":""}]
[{"$f":"VLOOKUP(B193&\"_\"&C193,Hg_Min_Tests!$A:$AZ,6,FALSE)","v":"PPL Montour"},3149,"1","U1","Mercury",2.8333333333333336E-7,"lb/MMBtu",2.5734629861982436E-6,"lb/MW","ETTS","",94,null,null,null,2.5734629861982436E-3,{"$f":"VLOOKUP(B193&\"_\"&C193,Hg_Min_Tests!$A$1:AA$1000,11,FALSE)","v":"Tangential firing"},{"$f":"VLOOKUP($B193&\"_\"&$C193,Hg_Min_Tests!$A$1:AAB$1000,R$1,FALSE)","v":"Electrostatic precipitator, cold side, w/o flue gas conditioning"},{"$f":"VLOOKUP($B193&\"_\"&$C193,Hg_Min_Tests!$A$1:AAC$1000,S$1,FALSE)","v":"Selective Catalytic Reduction"},{"$f":"VLOOKUP($B193&\"_\"&$C193,Hg_Min_Tests!$A$1:AAD$1000,T$1,FALSE)","v":"Wet FGD - Tray Type"},{"$f":"VLOOKUP($B193&\"_\"&$C193,Hg_Min_Tests!$A$1:AAE$1000,U$1,FALSE)","v":""}]
[{"$f":"VLOOKUP(B194&\"_\"&C194,Hg_Min_Tests!$A:$AZ,6,FALSE)","v":"Foster Wheeler Mt Carmel Cogen"},10343,"SG-101","SG-101","Mercury",2.2499999999999996E-7,"lb/MMBtu",2.6424418604651157E-6,"lb/MW","Part II","Hg 2008",95,null,null,null,2.6424418604651155E-3,{"$f":"VLOOKUP(B194&\"_\"&C194,Hg_Min_Tests!$A$1:AA$1000,11,FALSE)","v":"Fluidized bed firing"},{"$f":"VLOOKUP($B194&\"_\"&$C194,Hg_Min_Tests!$A$1:AAB$1000,R$1,FALSE)","v":"Fabric Filter, reverse air"},{"$f":"VLOOKUP($B194&\"_\"&$C194,Hg_Min_Tests!$A$1:AAC$1000,S$1,FALSE)","v":""},{"$f":"VLOOKUP($B194&\"_\"&$C194,Hg_Min_Tests!$A$1:AAD$1000,T$1,FALSE)","v":""},{"$f":"VLOOKUP($B194&\"_\"&$C194,Hg_Min_Tests!$A$1:AAE$1000,U$1,FALSE)","v":""}]
[{"$f":"VLOOKUP(B195&\"_\"&C195,Hg_Min_Tests!$A:$AZ,6,FALSE)","v":"Foster Wheeler Mt Carmel Cogen"},10343,"SG-101","SG-101","Mercury",2.7000000000000001E-7,"lb/MMBtu",3.1709302325581396E-6,"lb/MW","Part II","Hg 2009",95,null,null,null,{"$f":"H195*1000","v":3.1709302325581396E-3},{"$f":"VLOOKUP(B195&\"_\"&C195,Hg_Min_Tests!$A$1:AA$1000,11,FALSE)","v":"Fluidized bed firing"},{"$f":"VLOOKUP($B195&\"_\"&$C195,Hg_Min_Tests!$A$1:AAB$1000,R$1,FALSE)","v":"Fabric Filter, reverse air"},{"$f":"VLOOKUP($B195&\"_\"&$C195,Hg_Min_Tests!$A$1:AAC$1000,S$1,FALSE)","v":""},{"$f":"VLOOKUP($B195&\"_\"&$C195,Hg_Min_Tests!$A$1:AAD$1000,T$1,FALSE)","v":""},{"$f":"VLOOKUP($B195&\"_\"&$C195,Hg_Min_Tests!$A$1:AAE$1000,U$1,FALSE)","v":""}]
[{"$f":"VLOOKUP(B196&\"_\"&C196,Hg_Min_Tests!$A:$AZ,6,FALSE)","v":"Hayden"},525,"1","Unit 1","Mercury",2.8002063718263203E-7,"lb/MMBtu",2.7211906474728053E-6,"lb/MW","Part II","HAY1 Hg Feb09",96,null,null,null,2.7211906474728055E-3,{"$f":"VLOOKUP(B196&\"_\"&C196,Hg_Min_Tests!$A$1:AA$1000,11,FALSE)","v":"Wall firing - front firing"},{"$f":"VLOOKUP($B196&\"_\"&$C196,Hg_Min_Tests!$A$1:AAB$1000,R$1,FALSE)","v":"Dry FGD - Spray Dryer"},{"$f":"VLOOKUP($B196&\"_\"&$C196,Hg_Min_Tests!$A$1:AAC$1000,S$1,FALSE)","v":"Fabric Filter, reverse air"},{"$f":"VLOOKUP($B196&\"_\"&$C196,Hg_Min_Tests!$A$1:AAD$1000,T$1,FALSE)","v":""},{"$f":"VLOOKUP($B196&\"_\"&$C196,Hg_Min_Tests!$A$1:AAE$1000,U$1,FALSE)","v":""}]
[{"$f":"VLOOKUP(B197&\"_\"&C197,Hg_Min_Tests!$A:$AZ,6,FALSE)","v":"Hayden"},525,"1","Unit 1","Mercury",3.3352866666666663E-7,"lb/MMBtu",3.2411721419141913E-6,"lb/MW","ETTS","",96,null,null,null,3.2411721419141914E-3,{"$f":"VLOOKUP(B197&\"_\"&C197,Hg_Min_Tests!$A$1:AA$1000,11,FALSE)","v":"Wall firing - front firing"},{"$f":"VLOOKUP($B197&\"_\"&$C197,Hg_Min_Tests!$A$1:AAB$1000,R$1,FALSE)","v":"Dry FGD - Spray Dryer"},{"$f":"VLOOKUP($B197&\"_\"&$C197,Hg_Min_Tests!$A$1:AAC$1000,S$1,FALSE)","v":"Fabric Filter, reverse air"},{"$f":"VLOOKUP($B197&\"_\"&$C197,Hg_Min_Tests!$A$1:AAD$1000,T$1,FALSE)","v":""},{"$f":"VLOOKUP($B197&\"_\"&$C197,Hg_Min_Tests!$A$1:AAE$1000,U$1,FALSE)","v":""}]
[{"$f":"VLOOKUP(B198&\"_\"&C198,Hg_Min_Tests!$A:$AZ,6,FALSE)","v":"Hayden"},525,"1","Unit 1","Mercury",3.5782620707853449E-7,"lb/MMBtu",3.477291309381996E-6,"lb/MW","Part II","HAY1 Hg Jul09",96,null,null,null,3.4772913093819961E-3,{"$f":"VLOOKUP(B198&\"_\"&C198,Hg_Min_Tests!$A$1:AA$1000,11,FALSE)","v":"Wall firing - front firing"},{"$f":"VLOOKUP($B198&\"_\"&$C198,Hg_Min_Tests!$A$1:AAB$1000,R$1,FALSE)","v":"Dry FGD - Spray Dryer"},{"$f":"VLOOKUP($B198&\"_\"&$C198,Hg_Min_Tests!$A$1:AAC$1000,S$1,FALSE)","v":"Fabric Filter, reverse air"},{"$f":"VLOOKUP($B198&\"_\"&$C198,Hg_Min_Tests!$A$1:AAD$1000,T$1,FALSE)","v":""},{"$f":"VLOOKUP($B198&\"_\"&$C198,Hg_Min_Tests!$A$1:AAE$1000,U$1,FALSE)","v":""}]
[{"$f":"VLOOKUP(B199&\"_\"&C199,Hg_Min_Tests!$A:$AZ,6,FALSE)","v":"Hayden"},525,"1","Unit 1","Mercury",4.7999999999999996E-7,"lb/MMBtu",4.6645544554455443E-6,"lb/MW","Part II","HAY1 Hg Jan08",96,null,null,null,4.6645544554455446E-3,{"$f":"VLOOKUP(B199&\"_\"&C199,Hg_Min_Tests!$A$1:AA$1000,11,FALSE)","v":"Wall firing - front firing"},{"$f":"VLOOKUP($B199&\"_\"&$C199,Hg_Min_Tests!$A$1:AAB$1000,R$1,FALSE)","v":"Dry FGD - Spray Dryer"},{"$f":"VLOOKUP($B199&\"_\"&$C199,Hg_Min_Tests!$A$1:AAC$1000,S$1,FALSE)","v":"Fabric Filter, reverse air"},{"$f":"VLOOKUP($B199&\"_\"&$C199,Hg_Min_Tests!$A$1:AAD$1000,T$1,FALSE)","v":""},{"$f":"VLOOKUP($B199&\"_\"&$C199,Hg_Min_Tests!$A$1:AAE$1000,U$1,FALSE)","v":""}]
[{"$f":"VLOOKUP(B200&\"_\"&C200,Hg_Min_Tests!$A:$AZ,6,FALSE)","v":"Hayden"},525,"1","Unit 1","Mercury",5.5000000000000003E-7,"lb/MMBtu",5.3448019801980202E-6,"lb/MW","Part II","HAY1 Hg Sep07",96,null,null,null,5.3448019801980206E-3,{"$f":"VLOOKUP(B200&\"_\"&C200,Hg_Min_Tests!$A$1:AA$1000,11,FALSE)","v":"Wall firing - front firing"},{"$f":"VLOOKUP($B200&\"_\"&$C200,Hg_Min_Tests!$A$1:AAB$1000,R$1,FALSE)","v":"Dry FGD - Spray Dryer"},{"$f":"VLOOKUP($B200&\"_\"&$C200,Hg_Min_Tests!$A$1:AAC$1000,S$1,FALSE)","v":"Fabric Filter, reverse air"},{"$f":"VLOOKUP($B200&\"_\"&$C200,Hg_Min_Tests!$A$1:AAD$1000,T$1,FALSE)","v":""},{"$f":"VLOOKUP($B200&\"_\"&$C200,Hg_Min_Tests!$A$1:AAE$1000,U$1,FALSE)","v":""}]
[{"$f":"VLOOKUP(B201&\"_\"&C201,Hg_Min_Tests!$A:$AZ,6,FALSE)","v":"Hayden"},525,"1","Unit 1","Mercury",5.8999999999999996E-7,"lb/MMBtu",5.7335148514851483E-6,"lb/MW","Part II","HAY1 Hg Jun07",96,null,null,null,5.7335148514851483E-3,{"$f":"VLOOKUP(B201&\"_\"&C201,Hg_Min_Tests!$A$1:AA$1000,11,FALSE)","v":"Wall firing - front firing"},{"$f":"VLOOKUP($B201&\"_\"&$C201,Hg_Min_Tests!$A$1:AAB$1000,R$1,FALSE)","v":"Dry FGD - Spray Dryer"},{"$f":"VLOOKUP($B201&\"_\"&$C201,Hg_Min_Tests!$A$1:AAC$1000,S$1,FALSE)","v":"Fabric Filter, reverse air"},{"$f":"VLOOKUP($B201&\"_\"&$C201,Hg_Min_Tests!$A$1:AAD$1000,T$1,FALSE)","v":""},{"$f":"VLOOKUP($B201&\"_\"&$C201,Hg_Min_Tests!$A$1:AAE$1000,U$1,FALSE)","v":""}]
[{"$f":"VLOOKUP(B202&\"_\"&C202,Hg_Min_Tests!$A:$AZ,6,FALSE)","v":"Hayden"},525,"1","Unit 1","Mercury",3.01E-6,"lb/MMBtu",2.9250643564356435E-5,"lb/MW","Part II","HAY1 Hg Aug05",96,null,null,null,{"$f":"H202*1000","v":2.9250643564356436E-2},{"$f":"VLOOKUP(B202&\"_\"&C202,Hg_Min_Tests!$A$1:AA$1000,11,FALSE)","v":"Wall firing - front firing"},{"$f":"VLOOKUP($B202&\"_\"&$C202,Hg_Min_Tests!$A$1:AAB$1000,R$1,FALSE)","v":"Dry FGD - Spray Dryer"},{"$f":"VLOOKUP($B202&\"_\"&$C202,Hg_Min_Tests!$A$1:AAC$1000,S$1,FALSE)","v":"Fabric Filter, reverse air"},{"$f":"VLOOKUP($B202&\"_\"&$C202,Hg_Min_Tests!$A$1:AAD$1000,T$1,FALSE)","v":""},{"$f":"VLOOKUP($B202&\"_\"&$C202,Hg_Min_Tests!$A$1:AAE$1000,U$1,FALSE)","v":""}]
[{"$f":"VLOOKUP(B203&\"_\"&C203,Hg_Min_Tests!$A:$AZ,6,FALSE)","v":"A. B. Brown Generating Station"},6137,"1","1Config","Mercury",3.0507975404E-7,"lb/MMBtu",2.8988332855574337E-6,"lb/MW","ETTS","",97,null,null,null,2.8988332855574336E-3,{"$f":"VLOOKUP(B203&\"_\"&C203,Hg_Min_Tests!$A$1:AA$1000,11,FALSE)","v":"Wall firing - opposed firing"},{"$f":"VLOOKUP($B203&\"_\"&$C203,Hg_Min_Tests!$A$1:AAB$1000,R$1,FALSE)","v":"Selective Catalytic Reduction"},{"$f":"VLOOKUP($B203&\"_\"&$C203,Hg_Min_Tests!$A$1:AAC$1000,S$1,FALSE)","v":"Fabric Filter, pulse"},{"$f":"VLOOKUP($B203&\"_\"&$C203,Hg_Min_Tests!$A$1:AAD$1000,T$1,FALSE)","v":"Wet FGD - Spray Type"},{"$f":"VLOOKUP($B203&\"_\"&$C203,Hg_Min_Tests!$A$1:AAE$1000,U$1,FALSE)","v":""}]
[{"$f":"VLOOKUP(B204&\"_\"&C204,Hg_Min_Tests!$A:$AZ,6,FALSE)","v":"AES Cayuga, LLC"},2535,"1","Unit_1","Mercury",3.3700000000000001E-7,"lb/MMBtu",3.0042317073170731E-6,"lb/MW","Part II","22_902572_h",98,null,null,null,3.004231707317073E-3,{"$f":"VLOOKUP(B204&\"_\"&C204,Hg_Min_Tests!$A$1:AA$1000,11,FALSE)","v":"Tangential firing"},{"$f":"VLOOKUP($B204&\"_\"&$C204,Hg_Min_Tests!$A$1:AAB$1000,R$1,FALSE)","v":"Selective Catalytic Reduction"},{"$f":"VLOOKUP($B204&\"_\"&$C204,Hg_Min_Tests!$A$1:AAC$1000,S$1,FALSE)","v":"Electrostatic precipitator, cold side, w/o flue gas conditioning"},{"$f":"VLOOKUP($B204&\"_\"&$C204,Hg_Min_Tests!$A$1:AAD$1000,T$1,FALSE)","v":"Wet FGD - Spray Type"},{"$f":"VLOOKUP($B204&\"_\"&$C204,Hg_Min_Tests!$A$1:AAE$1000,U$1,FALSE)","v":""}]
[{"$f":"VLOOKUP(B205&\"_\"&C205,Hg_Min_Tests!$A:$AZ,6,FALSE)","v":"AES Cayuga, LLC"},2535,"1","Unit_1","Mercury",3.4900000000000001E-7,"lb/MMBtu",3.1112073170731707E-6,"lb/MW","Part II","7_902495_a",98,null,null,null,3.1112073170731706E-3,{"$f":"VLOOKUP(B205&\"_\"&C205,Hg_Min_Tests!$A$1:AA$1000,11,FALSE)","v":"Tangential firing"},{"$f":"VLOOKUP($B205&\"_\"&$C205,Hg_Min_Tests!$A$1:AAB$1000,R$1,FALSE)","v":"Selective Catalytic Reduction"},{"$f":"VLOOKUP($B205&\"_\"&$C205,Hg_Min_Tests!$A$1:AAC$1000,S$1,FALSE)","v":"Electrostatic precipitator, cold side, w/o flue gas conditioning"},{"$f":"VLOOKUP($B205&\"_\"&$C205,Hg_Min_Tests!$A$1:AAD$1000,T$1,FALSE)","v":"Wet FGD - Spray Type"},{"$f":"VLOOKUP($B205&\"_\"&$C205,Hg_Min_Tests!$A$1:AAE$1000,U$1,FALSE)","v":""}]
[{"$f":"VLOOKUP(B206&\"_\"&C206,Hg_Min_Tests!$A:$AZ,6,FALSE)","v":"AES Cayuga, LLC"},2535,"1","Unit_1","Mercury",4.2199999999999999E-7,"lb/MMBtu",3.7619756097560973E-6,"lb/MW","Part II","5_902426Hg_a",98,null,null,null,3.7619756097560975E-3,{"$f":"VLOOKUP(B206&\"_\"&C206,Hg_Min_Tests!$A$1:AA$1000,11,FALSE)","v":"Tangential firing"},{"$f":"VLOOKUP($B206&\"_\"&$C206,Hg_Min_Tests!$A$1:AAB$1000,R$1,FALSE)","v":"Selective Catalytic Reduction"},{"$f":"VLOOKUP($B206&\"_\"&$C206,Hg_Min_Tests!$A$1:AAC$1000,S$1,FALSE)","v":"Electrostatic precipitator, cold side, w/o flue gas conditioning"},{"$f":"VLOOKUP($B206&\"_\"&$C206,Hg_Min_Tests!$A$1:AAD$1000,T$1,FALSE)","v":"Wet FGD - Spray Type"},{"$f":"VLOOKUP($B206&\"_\"&$C206,Hg_Min_Tests!$A$1:AAE$1000,U$1,FALSE)","v":""}]
[{"$f":"VLOOKUP(B207&\"_\"&C207,Hg_Min_Tests!$A:$AZ,6,FALSE)","v":"AES Cayuga, LLC"},2535,"1","Unit_1","Mercury",4.4299999999999998E-7,"lb/MMBtu",3.9491829268292676E-6,"lb/MW","Part II","11_902519LME_a",98,null,null,null,3.9491829268292677E-3,{"$f":"VLOOKUP(B207&\"_\"&C207,Hg_Min_Tests!$A$1:AA$1000,11,FALSE)","v":"Tangential firing"},{"$f":"VLOOKUP($B207&\"_\"&$C207,Hg_Min_Tests!$A$1:AAB$1000,R$1,FALSE)","v":"Selective Catalytic Reduction"},{"$f":"VLOOKUP($B207&\"_\"&$C207,Hg_Min_Tests!$A$1:AAC$1000,S$1,FALSE)","v":"Electrostatic precipitator, cold side, w/o flue gas conditioning"},{"$f":"VLOOKUP($B207&\"_\"&$C207,Hg_Min_Tests!$A$1:AAD$1000,T$1,FALSE)","v":"Wet FGD - Spray Type"},{"$f":"VLOOKUP($B207&\"_\"&$C207,Hg_Min_Tests!$A$1:AAE$1000,U$1,FALSE)","v":""}]
[{"$f":"VLOOKUP(B208&\"_\"&C208,Hg_Min_Tests!$A:$AZ,6,FALSE)","v":"AES Cayuga, LLC"},2535,"1","Unit_1","Mercury",4.8599999999999998E-7,"lb/MMBtu",4.3325121951219506E-6,"lb/MW","Part II","19_902572_e",98,null,null,null,4.3325121951219509E-3,{"$f":"VLOOKUP(B208&\"_\"&C208,Hg_Min_Tests!$A$1:AA$1000,11,FALSE)","v":"Tangential firing"},{"$f":"VLOOKUP($B208&\"_\"&$C208,Hg_Min_Tests!$A$1:AAB$1000,R$1,FALSE)","v":"Selective Catalytic Reduction"},{"$f":"VLOOKUP($B208&\"_\"&$C208,Hg_Min_Tests!$A$1:AAC$1000,S$1,FALSE)","v":"Electrostatic precipitator, cold side, w/o flue gas conditioning"},{"$f":"VLOOKUP($B208&\"_\"&$C208,Hg_Min_Tests!$A$1:AAD$1000,T$1,FALSE)","v":"Wet FGD - Spray Type"},{"$f":"VLOOKUP($B208&\"_\"&$C208,Hg_Min_Tests!$A$1:AAE$1000,U$1,FALSE)","v":""}]
[{"$f":"VLOOKUP(B209&\"_\"&C209,Hg_Min_Tests!$A:$AZ,6,FALSE)","v":"AES Cayuga, LLC"},2535,"1","Unit_1","Mercury",5.1500000000000005E-7,"lb/MMBtu",4.5910365853658537E-6,"lb/MW","Part II","13_902519HG_a",98,null,null,null,4.5910365853658536E-3,{"$f":"VLOOKUP(B209&\"_\"&C209,Hg_Min_Tests!$A$1:AA$1000,11,FALSE)","v":"Tangential firing"},{"$f":"VLOOKUP($B209&\"_\"&$C209,Hg_Min_Tests!$A$1:AAB$1000,R$1,FALSE)","v":"Selective Catalytic Reduction"},{"$f":"VLOOKUP($B209&\"_\"&$C209,Hg_Min_Tests!$A$1:AAC$1000,S$1,FALSE)","v":"Electrostatic precipitator, cold side, w/o flue gas conditioning"},{"$f":"VLOOKUP($B209&\"_\"&$C209,Hg_Min_Tests!$A$1:AAD$1000,T$1,FALSE)","v":"Wet FGD - Spray Type"},{"$f":"VLOOKUP($B209&\"_\"&$C209,Hg_Min_Tests!$A$1:AAE$1000,U$1,FALSE)","v":""}]
[{"$f":"VLOOKUP(B210&\"_\"&C210,Hg_Min_Tests!$A:$AZ,6,FALSE)","v":"AES Cayuga, LLC"},2535,"1","Unit_1","Mercury",5.2900000000000004E-7,"lb/MMBtu",4.7158414634146345E-6,"lb/MW","Part II","21_902572_g",98,null,null,null,4.7158414634146341E-3,{"$f":"VLOOKUP(B210&\"_\"&C210,Hg_Min_Tests!$A$1:AA$1000,11,FALSE)","v":"Tangential firing"},{"$f":"VLOOKUP($B210&\"_\"&$C210,Hg_Min_Tests!$A$1:AAB$1000,R$1,FALSE)","v":"Selective Catalytic Reduction"},{"$f":"VLOOKUP($B210&\"_\"&$C210,Hg_Min_Tests!$A$1:AAC$1000,S$1,FALSE)","v":"Electrostatic precipitator, cold side, w/o flue gas conditioning"},{"$f":"VLOOKUP($B210&\"_\"&$C210,Hg_Min_Tests!$A$1:AAD$1000,T$1,FALSE)","v":"Wet FGD - Spray Type"},{"$f":"VLOOKUP($B210&\"_\"&$C210,Hg_Min_Tests!$A$1:AAE$1000,U$1,FALSE)","v":""}]
[{"$f":"VLOOKUP(B211&\"_\"&C211,Hg_Min_Tests!$A:$AZ,6,FALSE)","v":"AES Cayuga, LLC"},2535,"1","Unit_1","Mercury",5.5700000000000002E-7,"lb/MMBtu",4.9654512195121952E-6,"lb/MW","Part II","17_902572_c",98,null,null,null,4.9654512195121949E-3,{"$f":"VLOOKUP(B211&\"_\"&C211,Hg_Min_Tests!$A$1:AA$1000,11,FALSE)","v":"Tangential firing"},{"$f":"VLOOKUP($B211&\"_\"&$C211,Hg_Min_Tests!$A$1:AAB$1000,R$1,FALSE)","v":"Selective Catalytic Reduction"},{"$f":"VLOOKUP($B211&\"_\"&$C211,Hg_Min_Tests!$A$1:AAC$1000,S$1,FALSE)","v":"Electrostatic precipitator, cold side, w/o flue gas conditioning"},{"$f":"VLOOKUP($B211&\"_\"&$C211,Hg_Min_Tests!$A$1:AAD$1000,T$1,FALSE)","v":"Wet FGD - Spray Type"},{"$f":"VLOOKUP($B211&\"_\"&$C211,Hg_Min_Tests!$A$1:AAE$1000,U$1,FALSE)","v":""}]
[{"$f":"VLOOKUP(B212&\"_\"&C212,Hg_Min_Tests!$A:$AZ,6,FALSE)","v":"AES Cayuga, LLC"},2535,"1","Unit_1","Mercury",6.1699999999999998E-7,"lb/MMBtu",5.5003292682926825E-6,"lb/MW","Part II","15_902572_a",98,null,null,null,5.5003292682926823E-3,{"$f":"VLOOKUP(B212&\"_\"&C212,Hg_Min_Tests!$A$1:AA$1000,11,FALSE)","v":"Tangential firing"},{"$f":"VLOOKUP($B212&\"_\"&$C212,Hg_Min_Tests!$A$1:AAB$1000,R$1,FALSE)","v":"Selective Catalytic Reduction"},{"$f":"VLOOKUP($B212&\"_\"&$C212,Hg_Min_Tests!$A$1:AAC$1000,S$1,FALSE)","v":"Electrostatic precipitator, cold side, w/o flue gas conditioning"},{"$f":"VLOOKUP($B212&\"_\"&$C212,Hg_Min_Tests!$A$1:AAD$1000,T$1,FALSE)","v":"Wet FGD - Spray Type"},{"$f":"VLOOKUP($B212&\"_\"&$C212,Hg_Min_Tests!$A$1:AAE$1000,U$1,FALSE)","v":""}]
[{"$f":"VLOOKUP(B213&\"_\"&C213,Hg_Min_Tests!$A:$AZ,6,FALSE)","v":"Cross"},130,"4","C4","Mercury",2.7666666666666668E-7,"lb/MMBtu",3.009248E-6,"lb/MW","ETTS","",99,null,null,null,3.009248E-3,{"$f":"VLOOKUP(B213&\"_\"&C213,Hg_Min_Tests!$A$1:AA$1000,11,FALSE)","v":"Tangential firing"},{"$f":"VLOOKUP($B213&\"_\"&$C213,Hg_Min_Tests!$A$1:AAB$1000,R$1,FALSE)","v":"Selective Catalytic Reduction"},{"$f":"VLOOKUP($B213&\"_\"&$C213,Hg_Min_Tests!$A$1:AAC$1000,S$1,FALSE)","v":"Electrostatic precipitator, cold side, w/o flue gas conditioning"},{"$f":"VLOOKUP($B213&\"_\"&$C213,Hg_Min_Tests!$A$1:AAD$1000,T$1,FALSE)","v":"Wet FGD - Spray Type"},{"$f":"VLOOKUP($B213&\"_\"&$C213,Hg_Min_Tests!$A$1:AAE$1000,U$1,FALSE)","v":""}]
[{"$f":"VLOOKUP(B214&\"_\"&C214,Hg_Min_Tests!$A:$AZ,6,FALSE)","v":"Cross"},130,"4","C4","Mercury",3.8266666666666671E-7,"lb/MMBtu",4.1621887999999998E-6,"lb/MW","Part II","C4TV292009",99,null,null,null,4.1621888000000001E-3,{"$f":"VLOOKUP(B214&\"_\"&C214,Hg_Min_Tests!$A$1:AA$1000,11,FALSE)","v":"Tangential firing"},{"$f":"VLOOKUP($B214&\"_\"&$C214,Hg_Min_Tests!$A$1:AAB$1000,R$1,FALSE)","v":"Selective Catalytic Reduction"},{"$f":"VLOOKUP($B214&\"_\"&$C214,Hg_Min_Tests!$A$1:AAC$1000,S$1,FALSE)","v":"Electrostatic precipitator, cold side, w/o flue gas conditioning"},{"$f":"VLOOKUP($B214&\"_\"&$C214,Hg_Min_Tests!$A$1:AAD$1000,T$1,FALSE)","v":"Wet FGD - Spray Type"},{"$f":"VLOOKUP($B214&\"_\"&$C214,Hg_Min_Tests!$A$1:AAE$1000,U$1,FALSE)","v":""}]
[{"$f":"VLOOKUP(B215&\"_\"&C215,Hg_Min_Tests!$A:$AZ,6,FALSE)","v":"Cross"},130,"4","C4","Mercury",1.7433333333333333E-6,"lb/MMBtu",1.8961887999999999E-5,"lb/MW","Part II","C4TVIC2008",99,null,null,null,1.8961888E-2,{"$f":"VLOOKUP(B215&\"_\"&C215,Hg_Min_Tests!$A$1:AA$1000,11,FALSE)","v":"Tangential firing"},{"$f":"VLOOKUP($B215&\"_\"&$C215,Hg_Min_Tests!$A$1:AAB$1000,R$1,FALSE)","v":"Selective Catalytic Reduction"},{"$f":"VLOOKUP($B215&\"_\"&$C215,Hg_Min_Tests!$A$1:AAC$1000,S$1,FALSE)","v":"Electrostatic precipitator, cold side, w/o flue gas conditioning"},{"$f":"VLOOKUP($B215&\"_\"&$C215,Hg_Min_Tests!$A$1:AAD$1000,T$1,FALSE)","v":"Wet FGD - Spray Type"},{"$f":"VLOOKUP($B215&\"_\"&$C215,Hg_Min_Tests!$A$1:AAE$1000,U$1,FALSE)","v":""}]
[{"$f":"VLOOKUP(B216&\"_\"&C216,Hg_Min_Tests!$A:$AZ,6,FALSE)","v":"Cambria Cogen"},10641,"B1","001","Mercury",2.6333333333333334E-7,"lb/MMBtu",3.0095238095238094E-6,"lb/MW","ETTS","",100,null,null,null,3.0095238095238096E-3,{"$f":"VLOOKUP(B216&\"_\"&C216,Hg_Min_Tests!$A$1:AA$1000,11,FALSE)","v":"Fluidized bed firing"},{"$f":"VLOOKUP($B216&\"_\"&$C216,Hg_Min_Tests!$A$1:AAB$1000,R$1,FALSE)","v":"Selective Noncatalytic Reduction"},{"$f":"VLOOKUP($B216&\"_\"&$C216,Hg_Min_Tests!$A$1:AAC$1000,S$1,FALSE)","v":"Fabric Filter, unspecified"},{"$f":"VLOOKUP($B216&\"_\"&$C216,Hg_Min_Tests!$A$1:AAD$1000,T$1,FALSE)","v":""},{"$f":"VLOOKUP($B216&\"_\"&$C216,Hg_Min_Tests!$A$1:AAE$1000,U$1,FALSE)","v":""}]
[{"$f":"VLOOKUP(B217&\"_\"&C217,Hg_Min_Tests!$A:$AZ,6,FALSE)","v":"Cambria Cogen"},10641,"B2","002","Mercury",2.8500000000000002E-7,"lb/MMBtu",3.2571428571428577E-6,"lb/MW","ETTS","",101]
[{"$f":"VLOOKUP(B218&\"_\"&C218,Hg_Min_Tests!$A:$AZ,6,FALSE)","v":"Hayden"},525,"2","Unit 2","Mercury",3.4499999999999998E-7,"lb/MMBtu",3.2829473684210523E-6,"lb/MW","CEMS","",102]
[{"$f":"VLOOKUP(B219&\"_\"&C219,Hg_Min_Tests!$A:$AZ,6,FALSE)","v":"Hayden"},525,"2","Unit 2","Mercury",5.5166666666666664E-7,"lb/MMBtu",5.2495438596491223E-6,"lb/MW","ETTS","",102]
[{"$f":"VLOOKUP(B220&\"_\"&C220,Hg_Min_Tests!$A:$AZ,6,FALSE)","v":"Hayden"},525,"2","Unit 2","Mercury",7.4000000000000001E-7,"lb/MMBtu",7.0416842105263157E-6,"lb/MW","Part II","HAY2 Hg Jun07",102]
[{"$f":"VLOOKUP(B221&\"_\"&C221,Hg_Min_Tests!$A:$AZ,6,FALSE)","v":"Hayden"},525,"2","Unit 2","Mercury",1.75E-6,"lb/MMBtu",1.6652631578947367E-5,"lb/MW","Part II","HAY2 Hg Nov07",102]
[{"$f":"VLOOKUP(B222&\"_\"&C222,Hg_Min_Tests!$A:$AZ,6,FALSE)","v":"Sheldon Station"},2277,"2","U2","Mercury",3.3075371243317893E-7,"lb/MMBtu",3.551497309388886E-6,"lb/MW","ERT","",103]
[{"$f":"VLOOKUP(B223&\"_\"&C223,Hg_Min_Tests!$A:$AZ,6,FALSE)","v":"Southampton Power Station"},10774,"1","Unit 1 & 2","Mercury",2.7960188469666665E-7,"lb/MMBtu",3.6553834631667156E-6,"lb/MW","ETTS","",104]
[{"$f":"VLOOKUP(B224&\"_\"&C224,Hg_Min_Tests!$A:$AZ,6,FALSE)","v":"Southampton Power Station"},10774,"2","Unit 1 & 2","Mercury",2.7960188469666665E-7,"lb/MMBtu",3.6553834631667156E-6,"lb/MW","ETTS","",105]
[{"$f":"VLOOKUP(B225&\"_\"&C225,Hg_Min_Tests!$A:$AZ,6,FALSE)","v":"Waukegan"},883,"8","WK8CONFIG","Mercury",3.6899999999999998E-7,"lb/MMBtu",3.816107436031331E-6,"lb/MW","ETTS","",106]
[{"$f":"VLOOKUP(B226&\"_\"&C226,Hg_Min_Tests!$A:$AZ,6,FALSE)","v":"Waukegan"},883,"8","WK8CONFIG","Mercury",8.6864692767858023E-7,"lb/MMBtu",8.9833333333333343E-6,"lb/MW","Part II","Waukegan8 Hg",106]
[{"$f":"VLOOKUP(B227&\"_\"&C227,Hg_Min_Tests!$A:$AZ,6,FALSE)","v":"Vermilion"},897,"Unit 2","002","Mercury",3.9699999999999997E-7,"lb/MMBtu",3.883381818181818E-6,"lb/MW","ETTS","",107]
[{"$f":"VLOOKUP(B228&\"_\"&C228,Hg_Min_Tests!$A:$AZ,6,FALSE)","v":"Dallman"},963,"31","31","Mercury",3.7417369974639341E-7,"lb/MMBtu",3.9999999999999998E-6,"lb/MW","Part II","Dallman 31.32 Mercury 2009 Q3",108]
[{"$f":"VLOOKUP(B229&\"_\"&C229,Hg_Min_Tests!$A:$AZ,6,FALSE)","v":"Dallman"},963,"31","31","Mercury",7.4834739949278682E-7,"lb/MMBtu",7.9999999999999996E-6,"lb/MW","Part II","Dallman 31.32 Mercury 2009 Q4",108]
[{"$f":"VLOOKUP(B230&\"_\"&C230,Hg_Min_Tests!$A:$AZ,6,FALSE)","v":"Dallman"},963,"32","32","Mercury",3.7088548910523871E-7,"lb/MMBtu",3.9999999999999998E-6,"lb/MW","Part II","Dallman 31.32 Mercury 2009 Q3",109]
[{"$f":"VLOOKUP(B231&\"_\"&C231,Hg_Min_Tests!$A:$AZ,6,FALSE)","v":"Dallman"},963,"32","32","Mercury",7.4177097821047742E-7,"lb/MMBtu",7.9999999999999996E-6,"lb/MW","Part II","Dallman 31.32 Mercury 2009 Q4",109]
[{"$f":"VLOOKUP(B232&\"_\"&C232,Hg_Min_Tests!$A:$AZ,6,FALSE)","v":"PPL Montour"},3149,"2","U2","Mercury",4.4366666666666668E-7,"lb/MMBtu",4.0551805555555558E-6,"lb/MW","ETTS","",110]
[{"$f":"VLOOKUP(B233&\"_\"&C233,Hg_Min_Tests!$A:$AZ,6,FALSE)","v":"Hammond"},708,"2","Unit 2","Mercury",4.2526666666666673E-7,"lb/MMBtu",4.2084093495652176E-6,"lb/MW","CEMS","",111]
[{"$f":"VLOOKUP(B234&\"_\"&C234,Hg_Min_Tests!$A:$AZ,6,FALSE)","v":"Hammond"},708,"2","Unit 2","Mercury",6.049633333333333E-7,"lb/MMBtu",5.9866750622608685E-6,"lb/MW","ETTS","",111]
[{"$f":"VLOOKUP(B235&\"_\"&C235,Hg_Min_Tests!$A:$AZ,6,FALSE)","v":"Hammond"},708,"2","Unit 2","Mercury",1.0713442429767558E-6,"lb/MMBtu",1.0601948100202811E-5,"lb/MW","Part II","Hammond Scrubber Performance Hg Test Results (OH)",111]
[{"$f":"VLOOKUP(B236&\"_\"&C236,Hg_Min_Tests!$A:$AZ,6,FALSE)","v":"Hammond"},708,"2","Unit 2","Mercury",1.1721646612797015E-6,"lb/MMBtu",1.1599659946134445E-5,"lb/MW","Part II","Hammond Scrubber Performance Hg Test Results",111]
[{"$f":"VLOOKUP(B237&\"_\"&C237,Hg_Min_Tests!$A:$AZ,6,FALSE)","v":"Hammond"},708,"3","Unit 3","Mercury",4.2526666666666673E-7,"lb/MMBtu",4.2208345321739134E-6,"lb/MW","CEMS","",112]
[{"$f":"VLOOKUP(B238&\"_\"&C238,Hg_Min_Tests!$A:$AZ,6,FALSE)","v":"Hammond"},708,"3","Unit 3","Mercury",6.049633333333333E-7,"lb/MMBtu",6.0043505126956518E-6,"lb/MW","ETTS","",112]
[{"$f":"VLOOKUP(B239&\"_\"&C239,Hg_Min_Tests!$A:$AZ,6,FALSE)","v":"Hammond"},708,"3","Unit 3","Mercury",1.0713442429767558E-6,"lb/MMBtu",1.0633249984171524E-5,"lb/MW","Part II","Hammond Scrubber Performance Hg Test Results (OH)",112]
[{"$f":"VLOOKUP(B240&\"_\"&C240,Hg_Min_Tests!$A:$AZ,6,FALSE)","v":"Hammond"},708,"3","Unit 3","Mercury",1.1721646612797015E-6,"lb/MMBtu",1.1633907539716183E-5,"lb/MW","Part II","Hammond Scrubber Performance Hg Test Results",112]
[{"$f":"VLOOKUP(B241&\"_\"&C241,Hg_Min_Tests!$A:$AZ,6,FALSE)","v":"Willow Island"},3946,"2","Unit 2","Mercury",5.5300000000000004E-7,"lb/MMBtu",4.2435473684210533E-6,"lb/MW","Part II","U203222005",113]
[{"$f":"VLOOKUP(B242&\"_\"&C242,Hg_Min_Tests!$A:$AZ,6,FALSE)","v":"Willow Island"},3946,"2","Unit 2","Mercury",6.7433333333333335E-7,"lb/MMBtu",5.1746210526315792E-6,"lb/MW","Part II","U210252005",113]
[{"$f":"VLOOKUP(B243&\"_\"&C243,Hg_Min_Tests!$A:$AZ,6,FALSE)","v":"Willow Island"},3946,"2","Unit 2","Mercury",8.7133333333333343E-7,"lb/MMBtu",6.6863368421052645E-6,"lb/MW","Part II","U209282005",113]
[{"$f":"VLOOKUP(B244&\"_\"&C244,Hg_Min_Tests!$A:$AZ,6,FALSE)","v":"Willow Island"},3946,"2","Unit 2","Mercury",9.6333333333333336E-7,"lb/MMBtu",7.3923157894736845E-6,"lb/MW","Part II","U208042005",113]
[{"$f":"VLOOKUP(B245&\"_\"&C245,Hg_Min_Tests!$A:$AZ,6,FALSE)","v":"Hammond"},708,"1","Unit 1","Mercury",4.2526666666666673E-7,"lb/MMBtu",4.2850313089855077E-6,"lb/MW","CEMS","",114]
[{"$f":"VLOOKUP(B246&\"_\"&C246,Hg_Min_Tests!$A:$AZ,6,FALSE)","v":"Hammond"},708,"1","Unit 1","Mercury",6.049633333333333E-7,"lb/MMBtu",6.0956736732753624E-6,"lb/MW","ETTS","",114]
[{"$f":"VLOOKUP(B247&\"_\"&C247,Hg_Min_Tests!$A:$AZ,6,FALSE)","v":"Hammond"},708,"1","Unit 1","Mercury",1.0713442429767558E-6,"lb/MMBtu",1.0794976384676537E-5,"lb/MW","Part II","Hammond Scrubber Performance Hg Test Results (OH)",114]
[{"$f":"VLOOKUP(B248&\"_\"&C248,Hg_Min_Tests!$A:$AZ,6,FALSE)","v":"Hammond"},708,"1","Unit 1","Mercury",1.1721646612797015E-6,"lb/MMBtu",1.1810853439888493E-5,"lb/MW","Part II","Hammond Scrubber Performance Hg Test Results",114]
[{"$f":"VLOOKUP(B249&\"_\"&C249,Hg_Min_Tests!$A:$AZ,6,FALSE)","v":"Hammond"},708,"4","Unit 4","Mercury",4.2526666666666673E-7,"lb/MMBtu",4.4640978038461545E-6,"lb/MW","CEMS","",115]
[{"$f":"VLOOKUP(B250&\"_\"&C250,Hg_Min_Tests!$A:$AZ,6,FALSE)","v":"Hammond"},708,"4","Unit 4","Mercury",6.049633333333333E-7,"lb/MMBtu",6.3504048151923066E-6,"lb/MW","ETTS","",115]
[{"$f":"VLOOKUP(B251&\"_\"&C251,Hg_Min_Tests!$A:$AZ,6,FALSE)","v":"Hammond"},708,"4","Unit 4","Mercury",1.0713442429767558E-6,"lb/MMBtu",1.1246085943492136E-5,"lb/MW","Part II","Hammond Scrubber Performance Hg Test Results (OH)",115]
[{"$f":"VLOOKUP(B252&\"_\"&C252,Hg_Min_Tests!$A:$AZ,6,FALSE)","v":"Hammond"},708,"4","Unit 4","Mercury",1.1721646612797015E-6,"lb/MMBtu",1.2304415324105939E-5,"lb/MW","Part II","Hammond Scrubber Performance Hg Test Results",115]
[{"$f":"VLOOKUP(B253&\"_\"&C253,Hg_Min_Tests!$A:$AZ,6,FALSE)","v":"Stanton Energy Center"},564,"2","2 coal","Mercury",4.912786695754839E-7,"lb/MMBtu",4.499188841454111E-6,"lb/MW","Part II","Unit 2 Hg 2009",116]
[{"$f":"VLOOKUP(B254&\"_\"&C254,Hg_Min_Tests!$A:$AZ,6,FALSE)","v":"Stanton Energy Center"},564,"2","2 coal","Mercury",6.1500000000000004E-7,"lb/MMBtu",5.6322435897435896E-6,"lb/MW","ETTS","",116]
[{"$f":"VLOOKUP(B255&\"_\"&C255,Hg_Min_Tests!$A:$AZ,6,FALSE)","v":"Vermilion"},897,"Unit 1","001","Mercury",3.9699999999999997E-7,"lb/MMBtu",4.5820416666666663E-6,"lb/MW","ETTS","",117]
[{"$f":"VLOOKUP(B256&\"_\"&C256,Hg_Min_Tests!$A:$AZ,6,FALSE)","v":"Comanche"},470,"2","Unit 2","Mercury",4.8799999999999992E-7,"lb/MMBtu",4.6553863013698617E-6,"lb/MW","ETTS","",118]
[{"$f":"VLOOKUP(B257&\"_\"&C257,Hg_Min_Tests!$A:$AZ,6,FALSE)","v":"Comanche"},470,"2","Unit 2","Mercury",7.5625789642898419E-7,"lb/MMBtu",7.2144931379882817E-6,"lb/MW","Part II","COM2 Hg Apr09",118]
[{"$f":"VLOOKUP(B258&\"_\"&C258,Hg_Min_Tests!$A:$AZ,6,FALSE)","v":"Comanche"},470,"2","Unit 2","Mercury",5.6799999999999998E-6,"lb/MMBtu",5.418564383561643E-5,"lb/MW","CEMS","",118]
[{"$f":"VLOOKUP(B259&\"_\"&C259,Hg_Min_Tests!$A:$AZ,6,FALSE)","v":"Prairie Creek"},1073,"3","Unit 3","Mercury",4.15E-7,"lb/MMBtu",4.7142323232323227E-6,"lb/MW","Part II","PC3-Hg-20060920",119]
[{"$f":"VLOOKUP(B260&\"_\"&C260,Hg_Min_Tests!$A:$AZ,6,FALSE)","v":"Salem Harbor"},1626,"1","Unit 1","Mercury",3.9819992437000003E-7,"lb/MMBtu",4.7978251490066201E-6,"lb/MW","ETTS","",120]
[{"$f":"VLOOKUP(B261&\"_\"&C261,Hg_Min_Tests!$A:$AZ,6,FALSE)","v":"Martin Drake"},492,"6","Unit 6 - Coal","Mercury",4.5333333333333337E-7,"lb/MMBtu",4.9600000000000008E-6,"lb/MW","Part II","APT CSU5384 D",121]
[{"$f":"VLOOKUP(B262&\"_\"&C262,Hg_Min_Tests!$A:$AZ,6,FALSE)","v":"Martin Drake"},492,"6","Unit 6 - Coal","Mercury",1.28E-6,"lb/MMBtu",1.4004705882352942E-5,"lb/MW","Part II","Airtech 2480D",121]
[{"$f":"VLOOKUP(B263&\"_\"&C263,Hg_Min_Tests!$A:$AZ,6,FALSE)","v":"Colbert"},47,"4","4","Mercury",4.8433333333333326E-7,"lb/MMBtu",5.136354999999999E-6,"lb/MW","ETTS","",122]
[{"$f":"VLOOKUP(B264&\"_\"&C264,Hg_Min_Tests!$A:$AZ,6,FALSE)","v":"Sunbury Generation LP"},3152,"4","Boiler 4","Mercury",4.8510975317915704E-7,"lb/MMBtu",5.1542911275285431E-6,"lb/MW","Part II","Hg_031407",123]
[{"$f":"VLOOKUP(B265&\"_\"&C265,Hg_Min_Tests!$A:$AZ,6,FALSE)","v":"Sunbury Generation LP"},3152,"4","Boiler 4","Mercury",2.8966666666666667E-6,"lb/MMBtu",3.0777083333333337E-5,"lb/MW","ETTS","",123]
[{"$f":"VLOOKUP(B266&\"_\"&C266,Hg_Min_Tests!$A:$AZ,6,FALSE)","v":"Reid Gardner"},2324,"4","4","Mercury",4.8999999999999997E-7,"lb/MMBtu",5.1545907473309605E-6,"lb/MW","Part II","U4_2006_HG",124]
[{"$f":"VLOOKUP(B267&\"_\"&C267,Hg_Min_Tests!$A:$AZ,6,FALSE)","v":"North Valmy"},8224,"2","2","Mercury",4.9999999999999998E-7,"lb/MMBtu",5.3312361213915621E-6,"lb/MW","Part II","U2_2006_HG",125]
[{"$f":"VLOOKUP(B268&\"_\"&C268,Hg_Min_Tests!$A:$AZ,6,FALSE)","v":"H L Spurlock Station"},6041,"1","Unit 01","Mercury",5.2199999999999994E-7,"lb/MMBtu",5.5250058139534875E-6,"lb/MW","ETTS","",126]
[{"$f":"VLOOKUP(B269&\"_\"&C269,Hg_Min_Tests!$A:$AZ,6,FALSE)","v":"Alma"},4140,"B4","B4","Mercury",5.5533333333333341E-7,"lb/MMBtu",5.7697507613897705E-6,"lb/MW","Part II","4",127]
[{"$f":"VLOOKUP(B270&\"_\"&C270,Hg_Min_Tests!$A:$AZ,6,FALSE)","v":"Tanners Creek"},988,"4","TC-4","Mercury",6.7624614569333329E-7,"lb/MMBtu",5.8210596291352992E-6,"lb/MW","ETTS","",128]
[{"$f":"VLOOKUP(B271&\"_\"&C271,Hg_Min_Tests!$A:$AZ,6,FALSE)","v":"G G Allen"},2718,"ES-3","3-2009","Mercury",7.3787019894333335E-7,"lb/MMBtu",5.8400525870186384E-6,"lb/MW","ETTS","",129]
[{"$f":"VLOOKUP(B272&\"_\"&C272,Hg_Min_Tests!$A:$AZ,6,FALSE)","v":"G G Allen"},2718,"ES-4","4-2009","Mercury",7.3787019894333335E-7,"lb/MMBtu",5.9069326386987329E-6,"lb/MW","ETTS","",130]
[{"$f":"VLOOKUP(B273&\"_\"&C273,Hg_Min_Tests!$A:$AZ,6,FALSE)","v":"HB Robinson / Darlington Electric Power Plant"},3251,"1","Rob_Cfg_1","Mercury",6.6000000000000003E-7,"lb/MMBtu",6.1164705882352942E-6,"lb/MW","ETTS","",131]
[{"$f":"VLOOKUP(B274&\"_\"&C274,Hg_Min_Tests!$A:$AZ,6,FALSE)","v":"Consumers Energy - J.H. Campbell"},1710,"Unit 2","JHC2-Conf","Mercury",6.8796225004041256E-7,"lb/MMBtu",6.2394865030403196E-6,"lb/MW","ERT","",132]
[{"$f":"VLOOKUP(B275&\"_\"&C275,Hg_Min_Tests!$A:$AZ,6,FALSE)","v":"East Bend Station"},6018,"2","2","Mercury",6.5066666666666667E-7,"lb/MMBtu",6.3124375944720224E-6,"lb/MW","ETTS","",133]
[{"$f":"VLOOKUP(B276&\"_\"&C276,Hg_Min_Tests!$A:$AZ,6,FALSE)","v":"Consumers Energy - J.H. Campbell"},1710,"Unit 1","JHC1-Conf","Mercury",6.8796225004041256E-7,"lb/MMBtu",6.4301873078594764E-6,"lb/MW","ERT","",134]
[{"$f":"VLOOKUP(B277&\"_\"&C277,Hg_Min_Tests!$A:$AZ,6,FALSE)","v":"Willow Island"},3946,"1","Unit 1","Mercury",8.5933333333333338E-7,"lb/MMBtu",6.4598160919540238E-6,"lb/MW","Part II","U110262005",135]
[{"$f":"VLOOKUP(B278&\"_\"&C278,Hg_Min_Tests!$A:$AZ,6,FALSE)","v":"Willow Island"},3946,"1","Unit 1","Mercury",8.7833333333333322E-7,"lb/MMBtu",6.6026436781609188E-6,"lb/MW","Part II","U103232005",135]
[{"$f":"VLOOKUP(B279&\"_\"&C279,Hg_Min_Tests!$A:$AZ,6,FALSE)","v":"Willow Island"},3946,"1","Unit 1","Mercury",1.0233333333333332E-6,"lb/MMBtu",7.6926436781609194E-6,"lb/MW","Part II","U109272005",135]
[{"$f":"VLOOKUP(B280&\"_\"&C280,Hg_Min_Tests!$A:$AZ,6,FALSE)","v":"Willow Island"},3946,"1","Unit 1","Mercury",1.3066666666666665E-6,"lb/MMBtu",9.8225287356321832E-6,"lb/MW","Part II","U108032005",135]
[{"$f":"VLOOKUP(B281&\"_\"&C281,Hg_Min_Tests!$A:$AZ,6,FALSE)","v":"Walter Scott Jr. Energy Center"},1082,"4","4","Mercury",7.1999999999999999E-7,"lb/MMBtu",6.5011764705882348E-6,"lb/MW","Part II","5/2007 HG",136]
[{"$f":"VLOOKUP(B282&\"_\"&C282,Hg_Min_Tests!$A:$AZ,6,FALSE)","v":"Walter Scott Jr. Energy Center"},1082,"4","4","Mercury",1.1999999999999999E-6,"lb/MMBtu",1.0835294117647059E-5,"lb/MW","Part II","8/2007 HG",136]
[{"$f":"VLOOKUP(B283&\"_\"&C283,Hg_Min_Tests!$A:$AZ,6,FALSE)","v":"Walter Scott Jr. Energy Center"},1082,"4","4","Mercury",1.3999999999999999E-6,"lb/MMBtu",1.2641176470588235E-5,"lb/MW","Part II","12/2009 HG6",136]
[{"$f":"VLOOKUP(B284&\"_\"&C284,Hg_Min_Tests!$A:$AZ,6,FALSE)","v":"Walter Scott Jr. Energy Center"},1082,"4","4","Mercury",1.5E-6,"lb/MMBtu",1.3544117647058824E-5,"lb/MW","Part II","12/2009 HG5",136]
[{"$f":"VLOOKUP(B285&\"_\"&C285,Hg_Min_Tests!$A:$AZ,6,FALSE)","v":"Walter Scott Jr. Energy Center"},1082,"4","4","Mercury",2.0999999999999998E-6,"lb/MMBtu",1.896176470588235E-5,"lb/MW","Part II","12/2009 HG3",136]
[{"$f":"VLOOKUP(B286&\"_\"&C286,Hg_Min_Tests!$A:$AZ,6,FALSE)","v":"Walter Scott Jr. Energy Center"},1082,"4","4","Mercury",2.0999999999999998E-6,"lb/MMBtu",1.896176470588235E-5,"lb/MW","Part II","12/2009 HG4",136]
[{"$f":"VLOOKUP(B287&\"_\"&C287,Hg_Min_Tests!$A:$AZ,6,FALSE)","v":"Walter Scott Jr. Energy Center"},1082,"4","4","Mercury",2.9381345626222745E-6,"lb/MMBtu",2.6529626786030538E-5,"lb/MW","ERT","",136]
[{"$f":"VLOOKUP(B288&\"_\"&C288,Hg_Min_Tests!$A:$AZ,6,FALSE)","v":"Walter Scott Jr. Energy Center"},1082,"4","4","Mercury",3.0000000000000001E-6,"lb/MMBtu",2.7088235294117647E-5,"lb/MW","Part II","12/2009 HG2",136]
[{"$f":"VLOOKUP(B289&\"_\"&C289,Hg_Min_Tests!$A:$AZ,6,FALSE)","v":"Walter Scott Jr. Energy Center"},1082,"4","4","Mercury",4.0999999999999997E-6,"lb/MMBtu",3.7020588235294114E-5,"lb/MW","Part II","12/2009 HG1",136]
[{"$f":"VLOOKUP(B290&\"_\"&C290,Hg_Min_Tests!$A:$AZ,6,FALSE)","v":"Springerville"},8223,"4","4","Mercury",6.9999999999999997E-7,"lb/MMBtu",6.5333333333333332E-6,"lb/MW","Part II","U4 PERF DEC09 (ALT HG)",137]
[{"$f":"VLOOKUP(B291&\"_\"&C291,Hg_Min_Tests!$A:$AZ,6,FALSE)","v":"Springerville"},8223,"4","4","Mercury",8.9999999999999996E-7,"lb/MMBtu",8.4000000000000009E-6,"lb/MW","Part II","U4 INITIAL PERF 09DEC13 (HG, PB)",137]
[{"$f":"VLOOKUP(B292&\"_\"&C292,Hg_Min_Tests!$A:$AZ,6,FALSE)","v":"Springerville"},8223,"4","4","Mercury",3.5833333333333335E-6,"lb/MMBtu",3.344444444444445E-5,"lb/MW","ETTS","",137]
[{"$f":"VLOOKUP(B293&\"_\"&C293,Hg_Min_Tests!$A:$AZ,6,FALSE)","v":"Colbert"},47,"3","3","Mercury",6.4433333333333332E-7,"lb/MMBtu",6.8331550000000003E-6,"lb/MW","ETTS","",138]
[{"$f":"VLOOKUP(B294&\"_\"&C294,Hg_Min_Tests!$A:$AZ,6,FALSE)","v":"Lake Road"},2098,"6","6","Mercury",7.0699999999999996E-7,"lb/MMBtu",6.9985858585858583E-6,"lb/MW","Part II","ESP Performance and Mercury Test Apr. 2005",139]
[{"$f":"VLOOKUP(B295&\"_\"&C295,Hg_Min_Tests!$A:$AZ,6,FALSE)","v":"Lake Road"},2098,"6","6","Mercury",1.4733333333333333E-6,"lb/MMBtu",1.4584511784511786E-5,"lb/MW","ETTS","",139]
[{"$f":"VLOOKUP(B296&\"_\"&C296,Hg_Min_Tests!$A:$AZ,6,FALSE)","v":"Danskammer Generating Station"},2480,"3","3","Mercury",7.5327333333333339E-7,"lb/MMBtu",7.0960531400966181E-6,"lb/MW","Part II","2008_U3",140]
[{"$f":"VLOOKUP(B297&\"_\"&C297,Hg_Min_Tests!$A:$AZ,6,FALSE)","v":"Danskammer Generating Station"},2480,"3","3","Mercury",1.1960066666666667E-6,"lb/MMBtu",1.1266729468599033E-5,"lb/MW","Part II","2009_U3",140]
[{"$f":"VLOOKUP(B298&\"_\"&C298,Hg_Min_Tests!$A:$AZ,6,FALSE)","v":"Comanche"},470,"1","Unit 1","Mercury",7.3485842084461381E-7,"lb/MMBtu",7.2077363444509207E-6,"lb/MW","Part II","COM1 Hg Mar09",141]
[{"$f":"VLOOKUP(B299&\"_\"&C299,Hg_Min_Tests!$A:$AZ,6,FALSE)","v":"Will County"},884,"4","WC4CONFIG","Mercury",7.4955007076433715E-7,"lb/MMBtu",7.2666666666666668E-6,"lb/MW","Part II","WillCo4 Hg",142]
[{"$f":"VLOOKUP(B300&\"_\"&C300,Hg_Min_Tests!$A:$AZ,6,FALSE)","v":"Will County"},884,"4","WC4CONFIG","Mercury",1.0676666666666668E-6,"lb/MMBtu",1.0350713154981552E-5,"lb/MW","ETTS","",142]
[{"$f":"VLOOKUP(B301&\"_\"&C301,Hg_Min_Tests!$A:$AZ,6,FALSE)","v":"Escalante"},87,"1","1","Mercury",8.0586080586080591E-7,"lb/MMBtu",7.3333333333333331E-6,"lb/MW","Part II","Mar 2009 Hg performance test",143]
[{"$f":"VLOOKUP(B302&\"_\"&C302,Hg_Min_Tests!$A:$AZ,6,FALSE)","v":"Escalante"},87,"1","1","Mercury",1.0268792566069933E-6,"lb/MMBtu",9.3446012351236386E-6,"lb/MW","Part II","Dec 2008 Hg testing",143]
[{"$f":"VLOOKUP(B303&\"_\"&C303,Hg_Min_Tests!$A:$AZ,6,FALSE)","v":"Escalante"},87,"1","1","Mercury",1.0622710622710622E-6,"lb/MMBtu",9.6666666666666667E-6,"lb/MW","Part II","Sept 2009 Hg performance test",143]
[{"$f":"VLOOKUP(B304&\"_\"&C304,Hg_Min_Tests!$A:$AZ,6,FALSE)","v":"TS Power Plant"},56224,"BLR100","TSPower","Mercury",8.6701388888888898E-7,"lb/MMBtu",7.5666666666666665E-6,"lb/MW","Part II","TRC 08/2008",144]
[{"$f":"VLOOKUP(B305&\"_\"&C305,Hg_Min_Tests!$A:$AZ,6,FALSE)","v":"TS Power Plant"},56224,"BLR100","TSPower","Mercury",9.0314717987723086E-7,"lb/MMBtu",7.8820117516558331E-6,"lb/MW","ERT","",144]
[{"$f":"VLOOKUP(B306&\"_\"&C306,Hg_Min_Tests!$A:$AZ,6,FALSE)","v":"TS Power Plant"},56224,"BLR100","TSPower","Mercury",1.26E-6,"lb/MMBtu",1.0996363636363636E-5,"lb/MW","ETTS","",144]
[{"$f":"VLOOKUP(B307&\"_\"&C307,Hg_Min_Tests!$A:$AZ,6,FALSE)","v":"TS Power Plant"},56224,"BLR100","TSPower","Mercury",1.7149305555555556E-6,"lb/MMBtu",1.4966666666666667E-5,"lb/MW","Part II","Western 08/2009",144]
[{"$f":"VLOOKUP(B308&\"_\"&C308,Hg_Min_Tests!$A:$AZ,6,FALSE)","v":"TS Power Plant"},56224,"BLR100","TSPower","Mercury",4.6406250000000001E-6,"lb/MMBtu",4.0499999999999995E-5,"lb/MW","Part II","TRC 04/2008",144]
[{"$f":"VLOOKUP(B309&\"_\"&C309,Hg_Min_Tests!$A:$AZ,6,FALSE)","v":"Dunkirk Generating Plant"},2554,"4","4","Mercury",8.0507664672333333E-7,"lb/MMBtu",7.5801062737643082E-6,"lb/MW","ETTS","",145]
[{"$f":"VLOOKUP(B310&\"_\"&C310,Hg_Min_Tests!$A:$AZ,6,FALSE)","v":"Weston"},4078,"4","W4","Mercury",8.9333333333333329E-7,"lb/MMBtu",8.0439962866260495E-6,"lb/MW","Part II","W4 Hg 1-2009",146]
[{"$f":"VLOOKUP(B311&\"_\"&C311,Hg_Min_Tests!$A:$AZ,6,FALSE)","v":"Weston"},4078,"4","W4","Mercury",1.0763333333333334E-6,"lb/MMBtu",9.6918149289237005E-6,"lb/MW","ETTS","",146]
[{"$f":"VLOOKUP(B312&\"_\"&C312,Hg_Min_Tests!$A:$AZ,6,FALSE)","v":"Weston"},4078,"4","W4","Mercury",1.1333333333333334E-6,"lb/MMBtu",1.020506991586887E-5,"lb/MW","Part II","W4 Hg 7-2008",146]
[{"$f":"VLOOKUP(B313&\"_\"&C313,Hg_Min_Tests!$A:$AZ,6,FALSE)","v":"Weston"},4078,"4","W4","Mercury",1.6933333333333331E-6,"lb/MMBtu",1.5247575050768781E-5,"lb/MW","Part II","W4 Hg 7-2009",146]
[{"$f":"VLOOKUP(B314&\"_\"&C314,Hg_Min_Tests!$A:$AZ,6,FALSE)","v":"Joliet 9"},874,"5","JOL5 CONFIG","Mercury",7.5285985973488832E-7,"lb/MMBtu",8.2500000000000023E-6,"lb/MW","Part II","Jo5 Hg",147]
[{"$f":"VLOOKUP(B315&\"_\"&C315,Hg_Min_Tests!$A:$AZ,6,FALSE)","v":"Joliet 9"},874,"5","JOL5 CONFIG","Mercury",1.029E-6,"lb/MMBtu",1.1276002950920245E-5,"lb/MW","ETTS","",147]
[{"$f":"VLOOKUP(B316&\"_\"&C316,Hg_Min_Tests!$A:$AZ,6,FALSE)","v":"Gibson"},6113,"2","2-2007-FGDIN","Mercury",8.4633333333333335E-7,"lb/MMBtu",8.2507897125567317E-6,"lb/MW","ETTS","",148]
[{"$f":"VLOOKUP(B317&\"_\"&C317,Hg_Min_Tests!$A:$AZ,6,FALSE)","v":"Gibson"},6113,"1","1-2007-FGDIN","Mercury",8.8316666666666656E-7,"lb/MMBtu",8.50832879475542E-6,"lb/MW","ETTS","",149]
[{"$f":"VLOOKUP(B318&\"_\"&C318,Hg_Min_Tests!$A:$AZ,6,FALSE)","v":"Harding Street"},990,"70","70ss","Mercury",9.8860392026999999E-7,"lb/MMBtu",8.8034858817995894E-6,"lb/MW","ETTS","",150]
[{"$f":"VLOOKUP(B319&\"_\"&C319,Hg_Min_Tests!$A:$AZ,6,FALSE)","v":"Crist"},641,"5","Unit 5","Mercury",8.906666666666667E-7,"lb/MMBtu",8.8830965853658525E-6,"lb/MW","ETTS","",151]
[{"$f":"VLOOKUP(B320&\"_\"&C320,Hg_Min_Tests!$A:$AZ,6,FALSE)","v":"Crist"},641,"6","Unit 6","Mercury",8.906666666666667E-7,"lb/MMBtu",8.8881519333333328E-6,"lb/MW","ETTS","",152]
[{"$f":"VLOOKUP(B321&\"_\"&C321,Hg_Min_Tests!$A:$AZ,6,FALSE)","v":"AES Cayuga, LLC"},2535,"2","Unit_2","Mercury",1.0300000000000001E-6,"lb/MMBtu",8.8898809523809536E-6,"lb/MW","Part II","8_902495_b",153]
[{"$f":"VLOOKUP(B322&\"_\"&C322,Hg_Min_Tests!$A:$AZ,6,FALSE)","v":"AES Cayuga, LLC"},2535,"2","Unit_2","Mercury",1.2899999999999999E-6,"lb/MMBtu",1.1133928571428572E-5,"lb/MW","Part II","6_902426Hg_b",153]
[{"$f":"VLOOKUP(B323&\"_\"&C323,Hg_Min_Tests!$A:$AZ,6,FALSE)","v":"AES Cayuga, LLC"},2535,"2","Unit_2","Mercury",1.61E-6,"lb/MMBtu",1.3895833333333335E-5,"lb/MW","Part II","12_902519LME_b",153]
[{"$f":"VLOOKUP(B324&\"_\"&C324,Hg_Min_Tests!$A:$AZ,6,FALSE)","v":"AES Cayuga, LLC"},2535,"2","Unit_2","Mercury",1.84E-6,"lb/MMBtu",1.5880952380952382E-5,"lb/MW","Part II","16_902572_b",153]
[{"$f":"VLOOKUP(B325&\"_\"&C325,Hg_Min_Tests!$A:$AZ,6,FALSE)","v":"AES Cayuga, LLC"},2535,"2","Unit_2","Mercury",2.0899999999999999E-6,"lb/MMBtu",1.8038690476190478E-5,"lb/MW","Part II","20_902572_f",153]
[{"$f":"VLOOKUP(B326&\"_\"&C326,Hg_Min_Tests!$A:$AZ,6,FALSE)","v":"AES Cayuga, LLC"},2535,"2","Unit_2","Mercury",2.0999999999999998E-6,"lb/MMBtu",1.8125E-5,"lb/MW","Part II","18_902572_d",153]
[{"$f":"VLOOKUP(B327&\"_\"&C327,Hg_Min_Tests!$A:$AZ,6,FALSE)","v":"AES Cayuga, LLC"},2535,"2","Unit_2","Mercury",2.1600000000000001E-6,"lb/MMBtu",1.8642857142857144E-5,"lb/MW","Part II","23_902572_i",153]
[{"$f":"VLOOKUP(B328&\"_\"&C328,Hg_Min_Tests!$A:$AZ,6,FALSE)","v":"AES Cayuga, LLC"},2535,"2","Unit_2","Mercury",2.3E-6,"lb/MMBtu",1.9851190476190478E-5,"lb/MW","Part II","14_902519HG_b",153]
[{"$f":"VLOOKUP(B329&\"_\"&C329,Hg_Min_Tests!$A:$AZ,6,FALSE)","v":"Weston"},4078,"3","W3","Mercury",9.9133333333333334E-7,"lb/MMBtu",9.2828496717724277E-6,"lb/MW","ETTS","",154]
[{"$f":"VLOOKUP(B330&\"_\"&C330,Hg_Min_Tests!$A:$AZ,6,FALSE)","v":"Weston"},4078,"3","W3","Mercury",7.3766666666666666E-6,"lb/MMBtu",6.9075138949671768E-5,"lb/MW","Part II","W3 Hg 2006",154]
[{"$f":"VLOOKUP(B331&\"_\"&C331,Hg_Min_Tests!$A:$AZ,6,FALSE)","v":"Crist"},641,"7","Unit 7","Mercury",8.906666666666667E-7,"lb/MMBtu",9.4050694826666674E-6,"lb/MW","ETTS","",155]
[{"$f":"VLOOKUP(B332&\"_\"&C332,Hg_Min_Tests!$A:$AZ,6,FALSE)","v":"Crist"},641,"4","Unit 4","Mercury",8.906666666666667E-7,"lb/MMBtu",9.4371781463414637E-6,"lb/MW","ETTS","",156]
[{"$f":"VLOOKUP(B333&\"_\"&C333,Hg_Min_Tests!$A:$AZ,6,FALSE)","v":"Seminole Generating Station"},136,"1","Unit 1","Mercury",9.3333333333333333E-7,"lb/MMBtu",9.6453410182516807E-6,"lb/MW","Part II","Multi-Pollutant Test Report 2009 (Unit 1)",157]
[{"$f":"VLOOKUP(B334&\"_\"&C334,Hg_Min_Tests!$A:$AZ,6,FALSE)","v":"Hardin Generator Project"},55749,"PC1","PC1","Mercury",8.8293333333333335E-7,"lb/MMBtu",9.6751686274509815E-6,"lb/MW","CEMS","",158]
[{"$f":"VLOOKUP(B335&\"_\"&C335,Hg_Min_Tests!$A:$AZ,6,FALSE)","v":"Colstrip"},6076,"3","Unit3","Mercury",1.0501816885833334E-6,"lb/MMBtu",9.8795353138404758E-6,"lb/MW","ETTS","",159]
[{"$f":"VLOOKUP(B336&\"_\"&C336,Hg_Min_Tests!$A:$AZ,6,FALSE)","v":"Grant Town Power Plant"},10151,"BLR1A","GEN1","Mercury",7.1166666666666681E-7,"lb/MMBtu",1.0113157894736844E-5,"lb/MW","ETTS","",160]
[{"$f":"VLOOKUP(B337&\"_\"&C337,Hg_Min_Tests!$A:$AZ,6,FALSE)","v":"Grant Town Power Plant"},10151,"BLR1B","GEN1","Mercury",7.1166666666666681E-7,"lb/MMBtu",1.0113157894736844E-5,"lb/MW","ETTS","",161]
[{"$f":"VLOOKUP(B338&\"_\"&C338,Hg_Min_Tests!$A:$AZ,6,FALSE)","v":"W H Zimmer"},6019,"1","1","Mercury",1.1516666666666667E-6,"lb/MMBtu",1.0351912878787878E-5,"lb/MW","ETTS","",162]
[{"$f":"VLOOKUP(B339&\"_\"&C339,Hg_Min_Tests!$A:$AZ,6,FALSE)","v":"Seminole Generating Station"},136,"2","Unit 2","Mercury",1.0133333333333333E-6,"lb/MMBtu",1.0472084534101824E-5,"lb/MW","Part II","Multi-Pollutant Test Report 2009 (Unit 2)",163]
[{"$f":"VLOOKUP(B340&\"_\"&C340,Hg_Min_Tests!$A:$AZ,6,FALSE)","v":"Wateree"},3297,"WAT1","WAT001","Mercury",1.2300000000000001E-6,"lb/MMBtu",1.0693292428198433E-5,"lb/MW","Part II","Hg-12/08-WAT1",164]
[{"$f":"VLOOKUP(B341&\"_\"&C341,Hg_Min_Tests!$A:$AZ,6,FALSE)","v":"Wateree"},3297,"WAT1","WAT001","Mercury",1.57E-6,"lb/MMBtu",1.364916187989556E-5,"lb/MW","Part II","PM-HCL-HF-HG-07/06-WAT1",164]
[{"$f":"VLOOKUP(B342&\"_\"&C342,Hg_Min_Tests!$A:$AZ,6,FALSE)","v":"Wateree"},3297,"WAT1","WAT001","Mercury",3.3799999999999998E-6,"lb/MMBtu",2.9384819843342031E-5,"lb/MW","Part II","Hg-02/09-WAT1",164]
[{"$f":"VLOOKUP(B343&\"_\"&C343,Hg_Min_Tests!$A:$AZ,6,FALSE)","v":"Wateree"},3297,"WAT1","WAT001","Mercury",3.7699999999999999E-6,"lb/MMBtu",3.2775375979112268E-5,"lb/MW","Part II","Hg-05/06-WAT1",164]
[{"$f":"VLOOKUP(B344&\"_\"&C344,Hg_Min_Tests!$A:$AZ,6,FALSE)","v":"Dallman"},963,"33","33","Mercury",1.0649822949564551E-6,"lb/MMBtu",1.0699999999999999E-5,"lb/MW","Part II","Dallman 33 Mercury 2009 Q4",165]
[{"$f":"VLOOKUP(B345&\"_\"&C345,Hg_Min_Tests!$A:$AZ,6,FALSE)","v":"Dallman"},963,"33","33","Mercury",1.5626375729734901E-6,"lb/MMBtu",1.5699999999999999E-5,"lb/MW","Part II","Dallman 33 Mercury 2009 Q3",165]
[{"$f":"VLOOKUP(B346&\"_\"&C346,Hg_Min_Tests!$A:$AZ,6,FALSE)","v":"Dunkirk Generating Plant"},2554,"1","1","Mercury",1.0072666666666667E-6,"lb/MMBtu",1.0928250823529413E-5,"lb/MW","ETTS","",166]
[{"$f":"VLOOKUP(B347&\"_\"&C347,Hg_Min_Tests!$A:$AZ,6,FALSE)","v":"Springerville"},8223,"1","1","Mercury",1.2333333333333333E-6,"lb/MMBtu",1.1062451209992194E-5,"lb/MW","Part II","U1 HG SPEC TEST STM",167]
[{"$f":"VLOOKUP(B348&\"_\"&C348,Hg_Min_Tests!$A:$AZ,6,FALSE)","v":"Springerville"},8223,"1","1","Mercury",1.3179999999999999E-6,"lb/MMBtu",1.1821873536299767E-5,"lb/MW","Part II","U1 HG SPECIAL TEST OHM",167]
[{"$f":"VLOOKUP(B349&\"_\"&C349,Hg_Min_Tests!$A:$AZ,6,FALSE)","v":"North Valmy"},8224,"1","1","Mercury",1.0699999999999999E-6,"lb/MMBtu",1.1249281314168376E-5,"lb/MW","Part II","U1_2006_HG",168]
[{"$f":"VLOOKUP(B350&\"_\"&C350,Hg_Min_Tests!$A:$AZ,6,FALSE)","v":"Yates"},728,"Y6BR","Y6BR","Mercury",1.1702976164963144E-6,"lb/MMBtu",1.1260958301568901E-5,"lb/MW","Part II","Unit 6 Sorbent Injection Mercury Study (Part 2)",169]
[{"$f":"VLOOKUP(B351&\"_\"&C351,Hg_Min_Tests!$A:$AZ,6,FALSE)","v":"Yates"},728,"Y6BR","Y6BR","Mercury",2.2526743968294552E-6,"lb/MMBtu",2.167591567489812E-5,"lb/MW","Part II","Unit 6 Sorbent Injection Mercury Study (Part 3)",169]
[{"$f":"VLOOKUP(B352&\"_\"&C352,Hg_Min_Tests!$A:$AZ,6,FALSE)","v":"PPL Brunner Island"},3140,"2","U2","Mercury",1.1768378347290564E-6,"lb/MMBtu",1.1349148584282757E-5,"lb/MW","ERT","",170]
[{"$f":"VLOOKUP(B353&\"_\"&C353,Hg_Min_Tests!$A:$AZ,6,FALSE)","v":"Elrama Power Plant"},3098,"4","ELR4-2","Mercury",1.113215305668746E-6,"lb/MMBtu",1.1559387038863033E-5,"lb/MW","ERT","",171]
[{"$f":"VLOOKUP(B354&\"_\"&C354,Hg_Min_Tests!$A:$AZ,6,FALSE)","v":"Elrama Power Plant"},3098,"4","ELR4-2","Mercury",1.5433333333333333E-6,"lb/MMBtu",1.6025639639639638E-5,"lb/MW","Part II","Hg Diagnostic",171]
[{"$f":"VLOOKUP(B355&\"_\"&C355,Hg_Min_Tests!$A:$AZ,6,FALSE)","v":"Elrama Power Plant"},3098,"3","ELR3-2","Mercury",1.113215305668746E-6,"lb/MMBtu",1.1604156346291007E-5,"lb/MW","ERT","",172]
[{"$f":"VLOOKUP(B356&\"_\"&C356,Hg_Min_Tests!$A:$AZ,6,FALSE)","v":"Elrama Power Plant"},3098,"3","ELR3-2","Mercury",1.5433333333333333E-6,"lb/MMBtu",1.6087706666666664E-5,"lb/MW","Part II","Hg Diagnostic",172]
[{"$f":"VLOOKUP(B357&\"_\"&C357,Hg_Min_Tests!$A:$AZ,6,FALSE)","v":"Lansing"},1047,"3","Unit 3","Mercury",8.3699999999999999E-7,"lb/MMBtu",1.188330094043887E-5,"lb/MW","Part II","LANS3-Hg-20060504",173]
[{"$f":"VLOOKUP(B358&\"_\"&C358,Hg_Min_Tests!$A:$AZ,6,FALSE)","v":"Asheville Steam Electric Plant"},2706,"2","Ash_Cfg_2","Mercury",1.2766666666666666E-6,"lb/MMBtu",1.1903039215686275E-5,"lb/MW","ETTS","",174]
[{"$f":"VLOOKUP(B359&\"_\"&C359,Hg_Min_Tests!$A:$AZ,6,FALSE)","v":"PPL Brunner Island"},3140,"1","U1","Mercury",1.1768378347290564E-6,"lb/MMBtu",1.1928856233844528E-5,"lb/MW","ERT","",175]
[{"$f":"VLOOKUP(B360&\"_\"&C360,Hg_Min_Tests!$A:$AZ,6,FALSE)","v":"Eddystone Generating Station"},3161,"2","Unit 2","Mercury",1.4609715566800002E-6,"lb/MMBtu",1.2101498911968852E-5,"lb/MW","ETTS","",176]
[{"$f":"VLOOKUP(B361&\"_\"&C361,Hg_Min_Tests!$A:$AZ,6,FALSE)","v":"R.M. Schahfer"},6085,"14","R.M.0014","Mercury",1.2266666666666666E-6,"lb/MMBtu",1.2188034188034188E-5,"lb/MW","ETTS","",177]
[{"$f":"VLOOKUP(B362&\"_\"&C362,Hg_Min_Tests!$A:$AZ,6,FALSE)","v":"Sibley"},2094,"3","3","Mercury",1.2966666666666666E-6,"lb/MMBtu",1.2669887828162291E-5,"lb/MW","ETTS","",178]
[{"$f":"VLOOKUP(B363&\"_\"&C363,Hg_Min_Tests!$A:$AZ,6,FALSE)","v":"AES Puerto Rico Cogeneration Facility"},68029,"BLR1","Unit_1","Mercury",1.33E-6,"lb/MMBtu",1.2837890196078431E-5,"lb/MW","ETTS","",179]
[{"$f":"VLOOKUP(B364&\"_\"&C364,Hg_Min_Tests!$A:$AZ,6,FALSE)","v":"Eastlake"},2837,"3","Unit 3","Mercury",1.5700000000000002E-6,"lb/MMBtu",1.3137847222222224E-5,"lb/MW","ETTS","",180]
[{"$f":"VLOOKUP(B365&\"_\"&C365,Hg_Min_Tests!$A:$AZ,6,FALSE)","v":"Morgantown Energy Facility"},10743,"CFB1","Unit 1&2","Mercury",8.5800000000000009E-7,"lb/MMBtu",1.3461724137931036E-5,"lb/MW","ETTS","",181]
[{"$f":"VLOOKUP(B366&\"_\"&C366,Hg_Min_Tests!$A:$AZ,6,FALSE)","v":"Morgantown Energy Facility"},10743,"CFB2","Unit 1&2","Mercury",8.5800000000000009E-7,"lb/MMBtu",1.3461724137931036E-5,"lb/MW","ETTS","",182]
[{"$f":"VLOOKUP(B367&\"_\"&C367,Hg_Min_Tests!$A:$AZ,6,FALSE)","v":"Duck Creek"},6016,"1","001","Mercury",1.1999999999999999E-6,"lb/MMBtu",1.3499999999999999E-5,"lb/MW","Part II","2",183]
[{"$f":"VLOOKUP(B368&\"_\"&C368,Hg_Min_Tests!$A:$AZ,6,FALSE)","v":"Duck Creek"},6016,"1","001","Mercury",3.05E-6,"lb/MMBtu",3.4312500000000001E-5,"lb/MW","Part II","3",183]
[{"$f":"VLOOKUP(B369&\"_\"&C369,Hg_Min_Tests!$A:$AZ,6,FALSE)","v":"Duck Creek"},6016,"1","001","Mercury",3.0833333333333332E-6,"lb/MMBtu",3.4687499999999996E-5,"lb/MW","ETTS","",183]
[{"$f":"VLOOKUP(B370&\"_\"&C370,Hg_Min_Tests!$A:$AZ,6,FALSE)","v":"Sioux"},2107,"2","002","Mercury",1.4399999999999998E-6,"lb/MMBtu",1.35206106870229E-5,"lb/MW","ETTS","",184]
[{"$f":"VLOOKUP(B371&\"_\"&C371,Hg_Min_Tests!$A:$AZ,6,FALSE)","v":"Scholz"},642,"1","Unit 1","Mercury",1.1523333333333334E-6,"lb/MMBtu",1.3665521000000001E-5,"lb/MW","ETTS","",185]
[{"$f":"VLOOKUP(B372&\"_\"&C372,Hg_Min_Tests!$A:$AZ,6,FALSE)","v":"Elrama Power Plant"},3098,"2","ELR2-2","Mercury",1.113215305668746E-6,"lb/MMBtu",1.3959719933086074E-5,"lb/MW","ERT","",186]
[{"$f":"VLOOKUP(B373&\"_\"&C373,Hg_Min_Tests!$A:$AZ,6,FALSE)","v":"Elrama Power Plant"},3098,"2","ELR2-2","Mercury",1.5433333333333333E-6,"lb/MMBtu",1.93534E-5,"lb/MW","Part II","Hg Diagnostic",186]
[{"$f":"VLOOKUP(B374&\"_\"&C374,Hg_Min_Tests!$A:$AZ,6,FALSE)","v":"Elrama Power Plant"},3098,"1","ELR1-2","Mercury",1.113215305668746E-6,"lb/MMBtu",1.3959719933086074E-5,"lb/MW","ERT","",187]
[{"$f":"VLOOKUP(B375&\"_\"&C375,Hg_Min_Tests!$A:$AZ,6,FALSE)","v":"Elrama Power Plant"},3098,"1","ELR1-2","Mercury",1.5433333333333333E-6,"lb/MMBtu",1.93534E-5,"lb/MW","Part II","Hg Diagnostic",187]
[{"$f":"VLOOKUP(B376&\"_\"&C376,Hg_Min_Tests!$A:$AZ,6,FALSE)","v":"PSEG Hudson Generating Station"},2403,"U2","HUDU2E2PT2OS1-Coal","Mercury",1.4163333333333331E-6,"lb/MMBtu",1.4169774139760494E-5,"lb/MW","Part II","EG08026",188]
[{"$f":"VLOOKUP(B377&\"_\"&C377,Hg_Min_Tests!$A:$AZ,6,FALSE)","v":"PSEG Hudson Generating Station"},2403,"U2","HUDU2E2PT2OS1-Coal","Mercury",1.6713333333333332E-6,"lb/MMBtu",1.672093375776868E-5,"lb/MW","Part II","HUD2 1Q2009 ST Co Hg",188]
[{"$f":"VLOOKUP(B378&\"_\"&C378,Hg_Min_Tests!$A:$AZ,6,FALSE)","v":"PSEG Hudson Generating Station"},2403,"U2","HUDU2E2PT2OS1-Coal","Mercury",1.6723333333333335E-6,"lb/MMBtu",1.6730938305290285E-5,"lb/MW","Part II","EG07046",188]
[{"$f":"VLOOKUP(B379&\"_\"&C379,Hg_Min_Tests!$A:$AZ,6,FALSE)","v":"PSEG Hudson Generating Station"},2403,"U2","HUDU2E2PT2OS1-Coal","Mercury",1.68425E-6,"lb/MMBtu",1.6850159163256027E-5,"lb/MW","Part II","EG08026-4Q",188]
[{"$f":"VLOOKUP(B380&\"_\"&C380,Hg_Min_Tests!$A:$AZ,6,FALSE)","v":"PSEG Hudson Generating Station"},2403,"U2","HUDU2E2PT2OS1-Coal","Mercury",1.8093333333333332E-6,"lb/MMBtu",1.8101561315749583E-5,"lb/MW","Part II","HUD2 3Q2009 STCoHg",188]
[{"$f":"VLOOKUP(B381&\"_\"&C381,Hg_Min_Tests!$A:$AZ,6,FALSE)","v":"PSEG Hudson Generating Station"},2403,"U2","HUDU2E2PT2OS1-Coal","Mercury",1.829E-6,"lb/MMBtu",1.8298317417007731E-5,"lb/MW","Part II","HUD2 4Q2009 HgStCo",188]
[{"$f":"VLOOKUP(B382&\"_\"&C382,Hg_Min_Tests!$A:$AZ,6,FALSE)","v":"PSEG Hudson Generating Station"},2403,"U2","HUDU2E2PT2OS1-Coal","Mercury",1.8779919310222745E-6,"lb/MMBtu",1.8788459519095061E-5,"lb/MW","Part II","EG07044",188]
[{"$f":"VLOOKUP(B383&\"_\"&C383,Hg_Min_Tests!$A:$AZ,6,FALSE)","v":"PSEG Hudson Generating Station"},2403,"U2","HUDU2E2PT2OS1-Coal","Mercury",2.0463333333333332E-6,"lb/MMBtu",2.0472639078368953E-5,"lb/MW","Part II","HUD2 2009 CD St Co NG",188]
[{"$f":"VLOOKUP(B384&\"_\"&C384,Hg_Min_Tests!$A:$AZ,6,FALSE)","v":"PSEG Hudson Generating Station"},2403,"U2","HUDU2E2PT2OS1-Coal","Mercury",3.7019999999999999E-6,"lb/MMBtu",3.7036834924965891E-5,"lb/MW","Part II","EG08008",188]
[{"$f":"VLOOKUP(B385&\"_\"&C385,Hg_Min_Tests!$A:$AZ,6,FALSE)","v":"PSEG Hudson Generating Station"},2403,"U2","HUDU2E2PT2OS1-Coal","Mercury",3.7333333333333333E-6,"lb/MMBtu",3.7350310747309381E-5,"lb/MW","Part II","EG08009",188]
[{"$f":"VLOOKUP(B386&\"_\"&C386,Hg_Min_Tests!$A:$AZ,6,FALSE)","v":"PSEG Hudson Generating Station"},2403,"U2","HUDU2E2PT2OS1-Coal","Mercury",3.7896666666666665E-6,"lb/MMBtu",3.7913900257692891E-5,"lb/MW","Part II","EG05030",188]
[{"$f":"VLOOKUP(B387&\"_\"&C387,Hg_Min_Tests!$A:$AZ,6,FALSE)","v":"PSEG Hudson Generating Station"},2403,"U2","HUDU2E2PT2OS1-Coal","Mercury",4.1555561416507607E-6,"lb/MMBtu",4.1574458897824802E-5,"lb/MW","Part II","EG06031A",188]
[{"$f":"VLOOKUP(B388&\"_\"&C388,Hg_Min_Tests!$A:$AZ,6,FALSE)","v":"PSEG Hudson Generating Station"},2403,"U2","HUDU2E2PT2OS1-Coal","Mercury",4.3703333333333337E-6,"lb/MMBtu",4.3723207518569048E-5,"lb/MW","Part II","EG06028",188]
[{"$f":"VLOOKUP(B389&\"_\"&C389,Hg_Min_Tests!$A:$AZ,6,FALSE)","v":"PSEG Hudson Generating Station"},2403,"U2","HUDU2E2PT2OS1-Coal","Mercury",4.3833333333333334E-6,"lb/MMBtu",4.3853266636349856E-5,"lb/MW","Part II","EG08026-3Q",188]
[{"$f":"VLOOKUP(B390&\"_\"&C390,Hg_Min_Tests!$A:$AZ,6,FALSE)","v":"Sibley"},2094,"1","1","Mercury",1.2966666666666666E-6,"lb/MMBtu",1.4371781818181817E-5,"lb/MW","ETTS","",189]
[{"$f":"VLOOKUP(B391&\"_\"&C391,Hg_Min_Tests!$A:$AZ,6,FALSE)","v":"Sibley"},2094,"1","1","Mercury",3.0608441588417888E-6,"lb/MMBtu",3.392528362236281E-5,"lb/MW","Part II","Mercury2008",189]
[{"$f":"VLOOKUP(B392&\"_\"&C392,Hg_Min_Tests!$A:$AZ,6,FALSE)","v":"Crawford"},867,"7","CRA7 CONFIG","Mercury",1.4245191755890408E-6,"lb/MMBtu",1.448E-5,"lb/MW","Part II","Crawford 7 Hg",190]
[{"$f":"VLOOKUP(B393&\"_\"&C393,Hg_Min_Tests!$A:$AZ,6,FALSE)","v":"Wateree"},3297,"WAT2","WAT002","Mercury",1.6700000000000001E-6,"lb/MMBtu",1.4525044736842105E-5,"lb/MW","Part II","Hg-02/06-WAT2",191]
[{"$f":"VLOOKUP(B394&\"_\"&C394,Hg_Min_Tests!$A:$AZ,6,FALSE)","v":"Wateree"},3297,"WAT2","WAT002","Mercury",1.8199999999999999E-6,"lb/MMBtu",1.5829689473684207E-5,"lb/MW","Part II","Hg-02/09-WAT2",191]
[{"$f":"VLOOKUP(B395&\"_\"&C395,Hg_Min_Tests!$A:$AZ,6,FALSE)","v":"Wateree"},3297,"WAT2","WAT002","Mercury",2.5399999999999998E-6,"lb/MMBtu",2.2091984210526313E-5,"lb/MW","Part II","PM-HCL-HF-HG-07/06-WAT2",191]
[{"$f":"VLOOKUP(B396&\"_\"&C396,Hg_Min_Tests!$A:$AZ,6,FALSE)","v":"Springerville"},8223,"2","2","Mercury",1.6699999999999999E-6,"lb/MMBtu",1.4874651162790696E-5,"lb/MW","Part II","U2 HG SPEC TEST STM",192]
[{"$f":"VLOOKUP(B397&\"_\"&C397,Hg_Min_Tests!$A:$AZ,6,FALSE)","v":"Springerville"},8223,"2","2","Mercury",1.8136666666666667E-6,"lb/MMBtu",1.6154286821705426E-5,"lb/MW","Part II","U2 HG SPECIAL TEST OHM",192]
[{"$f":"VLOOKUP(B398&\"_\"&C398,Hg_Min_Tests!$A:$AZ,6,FALSE)","v":"AES Petersburg"},994,"1","1s","Mercury",1.7393333333333332E-6,"lb/MMBtu",1.5006013071895424E-5,"lb/MW","Part II","Unit 1 - Hg 08/2007",193]
[{"$f":"VLOOKUP(B399&\"_\"&C399,Hg_Min_Tests!$A:$AZ,6,FALSE)","v":"R. Gallagher"},1008,"2","2-2007","Mercury",1.5472032135267466E-6,"lb/MMBtu",1.5059444611660332E-5,"lb/MW","Part II","U2091409-BAGOUT",194]
[{"$f":"VLOOKUP(B400&\"_\"&C400,Hg_Min_Tests!$A:$AZ,6,FALSE)","v":"R. Gallagher"},1008,"2","2-2007","Mercury",1.5483802334049256E-6,"lb/MMBtu",1.5070900938474608E-5,"lb/MW","Part II","U2091409-BASE",194]
[{"$f":"VLOOKUP(B401&\"_\"&C401,Hg_Min_Tests!$A:$AZ,6,FALSE)","v":"Scholz"},642,"2","Unit 2","Mercury",1.1523333333333334E-6,"lb/MMBtu",1.5162402E-5,"lb/MW","ETTS","",195]
[{"$f":"VLOOKUP(B402&\"_\"&C402,Hg_Min_Tests!$A:$AZ,6,FALSE)","v":"Frank E. Ratts"},1043,"2SG1","2SG1conf1","Mercury",1.8229861474794852E-6,"lb/MMBtu",1.5891986110088338E-5,"lb/MW","Part II","R2AQSHG",196]
[{"$f":"VLOOKUP(B403&\"_\"&C403,Hg_Min_Tests!$A:$AZ,6,FALSE)","v":"Sibley"},2094,"2","2","Mercury",1.2966666666666666E-6,"lb/MMBtu",1.5948999999999999E-5,"lb/MW","ETTS","",197]
[{"$f":"VLOOKUP(B404&\"_\"&C404,Hg_Min_Tests!$A:$AZ,6,FALSE)","v":"Sibley"},2094,"2","2","Mercury",3.0608441588417888E-6,"lb/MMBtu",3.7648383153754E-5,"lb/MW","Part II","Mercury2008",197]
[{"$f":"VLOOKUP(B405&\"_\"&C405,Hg_Min_Tests!$A:$AZ,6,FALSE)","v":"Newton"},6017,"2","002","Mercury",1.8200000000000002E-6,"lb/MMBtu",1.6145161290322581E-5,"lb/MW","Part II","5",198]
[{"$f":"VLOOKUP(B406&\"_\"&C406,Hg_Min_Tests!$A:$AZ,6,FALSE)","v":"Newton"},6017,"2","002","Mercury",2.7999999999999999E-6,"lb/MMBtu",2.4838709677419354E-5,"lb/MW","Part II","3",198]
[{"$f":"VLOOKUP(B407&\"_\"&C407,Hg_Min_Tests!$A:$AZ,6,FALSE)","v":"Newton"},6017,"2","002","Mercury",3.7233333333333334E-6,"lb/MMBtu",3.3029569892473122E-5,"lb/MW","ETTS","",198]
[{"$f":"VLOOKUP(B408&\"_\"&C408,Hg_Min_Tests!$A:$AZ,6,FALSE)","v":"Joliet 29"},384,"81","JOL8CONFIG","Mercury",1.6424876264660718E-6,"lb/MMBtu",1.6466666666666666E-5,"lb/MW","Part II","Joliet 8 Hg",199]
[{"$f":"VLOOKUP(B409&\"_\"&C409,Hg_Min_Tests!$A:$AZ,6,FALSE)","v":"Joliet 29"},384,"82","JOL8CONFIG","Mercury",1.6424876264660718E-6,"lb/MMBtu",1.6466666666666666E-5,"lb/MW","Part II","Joliet 8 Hg",200]
[{"$f":"VLOOKUP(B410&\"_\"&C410,Hg_Min_Tests!$A:$AZ,6,FALSE)","v":"Winyah"},6249,"3","W3","Mercury",1.7549271417866014E-6,"lb/MMBtu",1.6553853727606728E-5,"lb/MW","Part II","W3LME2008",201]
[{"$f":"VLOOKUP(B411&\"_\"&C411,Hg_Min_Tests!$A:$AZ,6,FALSE)","v":"Chamois Power Plant"},2169,"2","Unit 2","Mercury",1.4866666666666665E-6,"lb/MMBtu",1.6739866666666665E-5,"lb/MW","Part II","Hg122005",202]
[{"$f":"VLOOKUP(B412&\"_\"&C412,Hg_Min_Tests!$A:$AZ,6,FALSE)","v":"Cholla"},113,"4","004","Mercury",1.7309768447999998E-6,"lb/MMBtu",1.7383080408485645E-5,"lb/MW","ETTS","",203]
[{"$f":"VLOOKUP(B413&\"_\"&C413,Hg_Min_Tests!$A:$AZ,6,FALSE)","v":"Springerville"},8223,"3","3","Mercury",1.9E-6,"lb/MMBtu",1.7733333333333335E-5,"lb/MW","Part II","U3 PERF 09MAY18",204]
[{"$f":"VLOOKUP(B414&\"_\"&C414,Hg_Min_Tests!$A:$AZ,6,FALSE)","v":"Springerville"},8223,"3","3","Mercury",2.2500000000000001E-6,"lb/MMBtu",2.1000000000000002E-5,"lb/MW","Part II","U3 INITIAL PERF TESTS (PB, HG)",204]
[{"$f":"VLOOKUP(B415&\"_\"&C415,Hg_Min_Tests!$A:$AZ,6,FALSE)","v":"Springerville"},8223,"3","3","Mercury",2.7E-6,"lb/MMBtu",2.5200000000000003E-5,"lb/MW","Part II","U3 PERF 08MAY07",204]
[{"$f":"VLOOKUP(B416&\"_\"&C416,Hg_Min_Tests!$A:$AZ,6,FALSE)","v":"Springerville"},8223,"3","3","Mercury",3.01E-6,"lb/MMBtu",2.8093333333333334E-5,"lb/MW","Part II","U3 PERF 07JUL09",204]
[{"$f":"VLOOKUP(B417&\"_\"&C417,Hg_Min_Tests!$A:$AZ,6,FALSE)","v":"Springerville"},8223,"3","3","Mercury",3.1045943376E-6,"lb/MMBtu",2.8976213817600004E-5,"lb/MW","ETTS","",204]
[{"$f":"VLOOKUP(B418&\"_\"&C418,Hg_Min_Tests!$A:$AZ,6,FALSE)","v":"AES Petersburg"},994,"2","2ss","Mercury",1.9143333333333334E-6,"lb/MMBtu",1.7826960299625468E-5,"lb/MW","Part II","Unit 2 - Hg 08/2007",205]
[{"$f":"VLOOKUP(B419&\"_\"&C419,Hg_Min_Tests!$A:$AZ,6,FALSE)","v":"Gibson"},6113,"4","4","Mercury",1.9110137131773658E-6,"lb/MMBtu",1.8112709399479872E-5,"lb/MW","Part II","U4010506",206]
[{"$f":"VLOOKUP(B420&\"_\"&C420,Hg_Min_Tests!$A:$AZ,6,FALSE)","v":"Dale Station"},1385,"3","03","Mercury",1.59E-6,"lb/MMBtu",1.8762000000000001E-5,"lb/MW","ETTS","",207]
[{"$f":"VLOOKUP(B421&\"_\"&C421,Hg_Min_Tests!$A:$AZ,6,FALSE)","v":"Mitchell Power Station"},3181,"33","033","Mercury",2.1319999999999997E-6,"lb/MMBtu",1.89076678200692E-5,"lb/MW","Part II","OHM/Hg CEMS Testing Overview",208]
[{"$f":"VLOOKUP(B422&\"_\"&C422,Hg_Min_Tests!$A:$AZ,6,FALSE)","v":"Winyah"},6249,"4","W4","Mercury",1.9061645469663879E-6,"lb/MMBtu",1.9067895189489999E-5,"lb/MW","Part II","W4LME2008",209]
[{"$f":"VLOOKUP(B423&\"_\"&C423,Hg_Min_Tests!$A:$AZ,6,FALSE)","v":"Fayette Power Project"},6179,"3","3","Mercury",1.9299999999999997E-6,"lb/MMBtu",1.913574468085106E-5,"lb/MW","Part II","FPP3-May08-ModuleC-Out",210]
[{"$f":"VLOOKUP(B424&\"_\"&C424,Hg_Min_Tests!$A:$AZ,6,FALSE)","v":"Fayette Power Project"},6179,"3","3","Mercury",2.12E-6,"lb/MMBtu",2.1019574468085104E-5,"lb/MW","Part II","FPP3-June09-ModuleC-Out",210]
[{"$f":"VLOOKUP(B425&\"_\"&C425,Hg_Min_Tests!$A:$AZ,6,FALSE)","v":"Fayette Power Project"},6179,"3","3","Mercury",3.32E-6,"lb/MMBtu",3.2917446808510638E-5,"lb/MW","Part II","FPP3-Nov08-ModuleC-Out",210]
[{"$f":"VLOOKUP(B426&\"_\"&C426,Hg_Min_Tests!$A:$AZ,6,FALSE)","v":"Fayette Power Project"},6179,"3","3","Mercury",3.98E-6,"lb/MMBtu",3.9461276595744681E-5,"lb/MW","Part II","FPP3-Nov08-ModuleA-Out",210]
[{"$f":"VLOOKUP(B427&\"_\"&C427,Hg_Min_Tests!$A:$AZ,6,FALSE)","v":"Fayette Power Project"},6179,"3","3","Mercury",4.1200000000000004E-6,"lb/MMBtu",4.0849361702127662E-5,"lb/MW","Part II","FPP3-June2009-ModuleB-Out",210]
[{"$f":"VLOOKUP(B428&\"_\"&C428,Hg_Min_Tests!$A:$AZ,6,FALSE)","v":"Fayette Power Project"},6179,"3","3","Mercury",4.6500000000000004E-6,"lb/MMBtu",4.6104255319148938E-5,"lb/MW","Part II","FPP3-Sept09-ModuleB-Out",210]
[{"$f":"VLOOKUP(B429&\"_\"&C429,Hg_Min_Tests!$A:$AZ,6,FALSE)","v":"Fayette Power Project"},6179,"3","3","Mercury",5.9100000000000002E-6,"lb/MMBtu",5.8597021276595742E-5,"lb/MW","Part II","FPP3-Sept09-ModuleC-Out",210]
[{"$f":"VLOOKUP(B430&\"_\"&C430,Hg_Min_Tests!$A:$AZ,6,FALSE)","v":"Fayette Power Project"},6179,"3","3","Mercury",6.3099999999999997E-6,"lb/MMBtu",6.2562978723404244E-5,"lb/MW","Part II","FPP3-May08-Module A-Out",210]
[{"$f":"VLOOKUP(B431&\"_\"&C431,Hg_Min_Tests!$A:$AZ,6,FALSE)","v":"Fayette Power Project"},6179,"3","3","Mercury",6.4400000000000002E-6,"lb/MMBtu",6.3851914893617024E-5,"lb/MW","Part II","FPP3-Nov08-ModuleA-In",210]
[{"$f":"VLOOKUP(B432&\"_\"&C432,Hg_Min_Tests!$A:$AZ,6,FALSE)","v":"Fayette Power Project"},6179,"3","3","Mercury",7.2999999999999996E-6,"lb/MMBtu",7.2378723404255312E-5,"lb/MW","Part II","FPP3-June2009-ModuleB-In",210]
[{"$f":"VLOOKUP(B433&\"_\"&C433,Hg_Min_Tests!$A:$AZ,6,FALSE)","v":"Fayette Power Project"},6179,"3","3","Mercury",9.4299999999999995E-6,"lb/MMBtu",9.349744680851063E-5,"lb/MW","Part II","FPP3-Sept09-ModuleB-In",210]
[{"$f":"VLOOKUP(B434&\"_\"&C434,Hg_Min_Tests!$A:$AZ,6,FALSE)","v":"Fayette Power Project"},6179,"3","3","Mercury",1.2262963413718064E-5,"lb/MMBtu",1.2158597767643868E-4,"lb/MW","Part II","FPP3-May08-ModuleA-In",210]
[{"$f":"VLOOKUP(B435&\"_\"&C435,Hg_Min_Tests!$A:$AZ,6,FALSE)","v":"AES Petersburg"},994,"3","3ss","Mercury",2.0420000000000001E-6,"lb/MMBtu",1.9504620689655172E-5,"lb/MW","Part II","Unit 3 - Hg 08/2007",211]
[{"$f":"VLOOKUP(B436&\"_\"&C436,Hg_Min_Tests!$A:$AZ,6,FALSE)","v":"Cane Run"},1363,"5","CR5","Mercury",1.64343842457395E-6,"lb/MMBtu",1.9812058797902534E-5,"lb/MW","ERT","",212]
[{"$f":"VLOOKUP(B437&\"_\"&C437,Hg_Min_Tests!$A:$AZ,6,FALSE)","v":"Joppa Steam"},887,"1","1","Mercury",2.03E-6,"lb/MMBtu",1.9934533551554828E-5,"lb/MW","ETTS","",213]
[{"$f":"VLOOKUP(B438&\"_\"&C438,Hg_Min_Tests!$A:$AZ,6,FALSE)","v":"Canadys Steam"},3280,"CAN1","CAN001","Mercury",2.1500000000000002E-6,"lb/MMBtu",2.0282851239669424E-5,"lb/MW","Part II","Hg-02/06-CAN1",214]
[{"$f":"VLOOKUP(B439&\"_\"&C439,Hg_Min_Tests!$A:$AZ,6,FALSE)","v":"South Oak Creek"},4041,"5","OCPP-B5","Mercury",2.2320333333333334E-6,"lb/MMBtu",2.0341754334554334E-5,"lb/MW","Part II","OCPP-PM.Hg-B5-7.2005",215]
[{"$f":"VLOOKUP(B440&\"_\"&C440,Hg_Min_Tests!$A:$AZ,6,FALSE)","v":"South Oak Creek"},4041,"5","OCPP-B5","Mercury",2.8626133333333336E-6,"lb/MMBtu",2.6088578656898658E-5,"lb/MW","Part II","OCPP-Hg-B5B6-9.2005",215]
[{"$f":"VLOOKUP(B441&\"_\"&C441,Hg_Min_Tests!$A:$AZ,6,FALSE)","v":"Winyah"},6249,"1","W1","Mercury",2.0668257469573148E-6,"lb/MMBtu",2.034597277682726E-5,"lb/MW","Part II","W1LME2008",216]
[{"$f":"VLOOKUP(B442&\"_\"&C442,Hg_Min_Tests!$A:$AZ,6,FALSE)","v":"AES Puerto Rico Cogeneration Facility"},68029,"BLR2","Unit_2","Mercury",2.1333333333333334E-6,"lb/MMBtu",2.0592104575163398E-5,"lb/MW","ETTS","",217]
[{"$f":"VLOOKUP(B443&\"_\"&C443,Hg_Min_Tests!$A:$AZ,6,FALSE)","v":"South Oak Creek"},4041,"8","OCPP-B8","Mercury",2.3E-6,"lb/MMBtu",2.0597321428571428E-5,"lb/MW","Part II","OCPP-Hg-B8-6.2005",218]
[{"$f":"VLOOKUP(B444&\"_\"&C444,Hg_Min_Tests!$A:$AZ,6,FALSE)","v":"South Oak Creek"},4041,"8","OCPP-B8","Mercury",4.4633333333333335E-6,"lb/MMBtu",3.9970744047619047E-5,"lb/MW","ETTS","",218]
[{"$f":"VLOOKUP(B445&\"_\"&C445,Hg_Min_Tests!$A:$AZ,6,FALSE)","v":"South Oak Creek"},4041,"8","OCPP-B8","Mercury",5.4466233333333332E-6,"lb/MMBtu",4.8776457172619045E-5,"lb/MW","Part II","OCPP-Hg-B7B8-9.2005",218]
[{"$f":"VLOOKUP(B446&\"_\"&C446,Hg_Min_Tests!$A:$AZ,6,FALSE)","v":"Alma"},4140,"B5","B5","Mercury",2.0246666666666665E-6,"lb/MMBtu",2.0917110179640713E-5,"lb/MW","Part II","3",219]
[{"$f":"VLOOKUP(B447&\"_\"&C447,Hg_Min_Tests!$A:$AZ,6,FALSE)","v":"James River Power Station"},2161,"5","Unit_5_JRPS","Mercury",2.1931527773258427E-6,"lb/MMBtu",2.109604100094382E-5,"lb/MW","ERT","",220]
[{"$f":"VLOOKUP(B448&\"_\"&C448,Hg_Min_Tests!$A:$AZ,6,FALSE)","v":"James River Power Station"},2161,"4","Unit_4_JRPS","Mercury",2.1099999999999997E-6,"lb/MMBtu",2.1099999999999998E-5,"lb/MW","Part II","Hg Emissions\\3753-2007",221]
[{"$f":"VLOOKUP(B449&\"_\"&C449,Hg_Min_Tests!$A:$AZ,6,FALSE)","v":"James River Power Station"},2161,"4","Unit_4_JRPS","Mercury",2.7242533571051943E-6,"lb/MMBtu",2.7242533571051943E-5,"lb/MW","ERT","",221]
[{"$f":"VLOOKUP(B450&\"_\"&C450,Hg_Min_Tests!$A:$AZ,6,FALSE)","v":"AES Petersburg"},994,"4","4s","Mercury",2.249E-6,"lb/MMBtu",2.137320205479452E-5,"lb/MW","Part II","Unit 4 - Hg 08/2007",222]
[{"$f":"VLOOKUP(B451&\"_\"&C451,Hg_Min_Tests!$A:$AZ,6,FALSE)","v":"Frank E. Ratts"},1043,"1SG1","1SG1conf1","Mercury",2.4481859150713032E-6,"lb/MMBtu",2.1506371653934066E-5,"lb/MW","Part II","R1AQSHG",223]
[{"$f":"VLOOKUP(B452&\"_\"&C452,Hg_Min_Tests!$A:$AZ,6,FALSE)","v":"New Madrid"},2167,"2","con2","Mercury",2.1899999999999998E-6,"lb/MMBtu",2.1899999999999997E-5,"lb/MW","Part II","sept2005mercury",224]
[{"$f":"VLOOKUP(B453&\"_\"&C453,Hg_Min_Tests!$A:$AZ,6,FALSE)","v":"New Madrid"},2167,"1","con1","Mercury",2.2266666666666668E-6,"lb/MMBtu",2.2266666666666668E-5,"lb/MW","Part II","nov2005mercury",225]
[{"$f":"VLOOKUP(B454&\"_\"&C454,Hg_Min_Tests!$A:$AZ,6,FALSE)","v":"Nebraska City"},6096,"NC2","NC2","Mercury",2.2200000000000003E-6,"lb/MMBtu",2.2526340000000004E-5,"lb/MW","ETTS","",226]
[{"$f":"VLOOKUP(B455&\"_\"&C455,Hg_Min_Tests!$A:$AZ,6,FALSE)","v":"Eastlake"},2837,"1","Unit 1","Mercury",2.7866666666666665E-6,"lb/MMBtu",2.3318981481481479E-5,"lb/MW","ETTS","",227]
[{"$f":"VLOOKUP(B456&\"_\"&C456,Hg_Min_Tests!$A:$AZ,6,FALSE)","v":"WPS Westwood Generation, LLC"},50611,"031","001","Mercury",1.3986666666666666E-6,"lb/MMBtu",2.3893888888888886E-5,"lb/MW","Part II","2007 Mercury Compliance Test",228]
[{"$f":"VLOOKUP(B457&\"_\"&C457,Hg_Min_Tests!$A:$AZ,6,FALSE)","v":"Newton"},6017,"1","001","Mercury",2.7499999999999999E-6,"lb/MMBtu",2.404610492845787E-5,"lb/MW","Part II","4",229]
[{"$f":"VLOOKUP(B458&\"_\"&C458,Hg_Min_Tests!$A:$AZ,6,FALSE)","v":"Newton"},6017,"1","001","Mercury",2.83E-6,"lb/MMBtu",2.47456279809221E-5,"lb/MW","Part II","2",229]
[{"$f":"VLOOKUP(B459&\"_\"&C459,Hg_Min_Tests!$A:$AZ,6,FALSE)","v":"Newton"},6017,"1","001","Mercury",7.2999999999999996E-6,"lb/MMBtu",6.3831478537360894E-5,"lb/MW","Part II","1",229]
[{"$f":"VLOOKUP(B460&\"_\"&C460,Hg_Min_Tests!$A:$AZ,6,FALSE)","v":"Yates"},728,"Y1BR","Y1BR","Mercury",2.3702982181828919E-6,"lb/MMBtu",2.4251074878224069E-5,"lb/MW","Part II","Field Testing of a Wet FGD Additive (Part 2)",230]
[{"$f":"VLOOKUP(B461&\"_\"&C461,Hg_Min_Tests!$A:$AZ,6,FALSE)","v":"Yates"},728,"Y1BR","Y1BR","Mercury",2.4059418004112079E-6,"lb/MMBtu",2.4615752695941746E-5,"lb/MW","Part II","Field Testing of a Wet FGD Additive",230]
[{"$f":"VLOOKUP(B462&\"_\"&C462,Hg_Min_Tests!$A:$AZ,6,FALSE)","v":"Erickson Station"},1832,"EU001","001","Mercury",2.416708760917895E-6,"lb/MMBtu",2.4430728564915447E-5,"lb/MW","ERT","",231]
[{"$f":"VLOOKUP(B463&\"_\"&C463,Hg_Min_Tests!$A:$AZ,6,FALSE)","v":"Erickson Station"},1832,"EU001","001","Mercury",3.5233333333333328E-6,"lb/MMBtu",3.5617696969696964E-5,"lb/MW","Part II","Hg-5/05",231]
[{"$f":"VLOOKUP(B464&\"_\"&C464,Hg_Min_Tests!$A:$AZ,6,FALSE)","v":"Meredosia"},864,"5","005","Mercury",1.7972248056333335E-6,"lb/MMBtu",2.4526832641584314E-5,"lb/MW","ETTS","",232]
[{"$f":"VLOOKUP(B465&\"_\"&C465,Hg_Min_Tests!$A:$AZ,6,FALSE)","v":"Titus"},3115,"1","TI-1-2","Mercury",2.3877187500000001E-6,"lb/MMBtu",2.4929778132250581E-5,"lb/MW","Part II","T-53",233]
[{"$f":"VLOOKUP(B466&\"_\"&C466,Hg_Min_Tests!$A:$AZ,6,FALSE)","v":"Urquhart"},3295,"URQ3","URQ003","Mercury",2.4600000000000002E-6,"lb/MMBtu",2.5029902912621362E-5,"lb/MW","Part II","Hg-12/05",234]
[{"$f":"VLOOKUP(B467&\"_\"&C467,Hg_Min_Tests!$A:$AZ,6,FALSE)","v":"Urquhart"},3295,"URQ3","URQ003","Mercury",5.4768988464175028E-6,"lb/MMBtu",5.5726116417917896E-5,"lb/MW","ERT","",234]
[{"$f":"VLOOKUP(B468&\"_\"&C468,Hg_Min_Tests!$A:$AZ,6,FALSE)","v":"Cape Fear Steam Electric Plant"},2708,"5","Cap_Cfg_5b","Mercury",3.0994088050799997E-6,"lb/MMBtu",2.5159906770649409E-5,"lb/MW","ETTS","",235]
[{"$f":"VLOOKUP(B469&\"_\"&C469,Hg_Min_Tests!$A:$AZ,6,FALSE)","v":"Hoot Lake"},1943,"003","3","Mercury",2.1733333333333334E-6,"lb/MMBtu",2.5473548902195613E-5,"lb/MW","Part II","Mercury DOE Research Test",236]
[{"$f":"VLOOKUP(B470&\"_\"&C470,Hg_Min_Tests!$A:$AZ,6,FALSE)","v":"Danskammer Generating Station"},2480,"4","4","Mercury",2.4496266666666668E-6,"lb/MMBtu",2.5628574494428394E-5,"lb/MW","Part II","2008_U4",237]
[{"$f":"VLOOKUP(B471&\"_\"&C471,Hg_Min_Tests!$A:$AZ,6,FALSE)","v":"Danskammer Generating Station"},2480,"4","4","Mercury",3.0078666666666666E-6,"lb/MMBtu",3.1469013619479981E-5,"lb/MW","Part II","2009_U4",237]
[{"$f":"VLOOKUP(B472&\"_\"&C472,Hg_Min_Tests!$A:$AZ,6,FALSE)","v":"Ames Electric Services Power Plant"},1122,"Boiler 7","007","Mercury",2.9900000000000002E-6,"lb/MMBtu",2.5949658314350798E-5,"lb/MW","Part II","4",238]
[{"$f":"VLOOKUP(B473&\"_\"&C473,Hg_Min_Tests!$A:$AZ,6,FALSE)","v":"Ames Electric Services Power Plant"},1122,"Boiler 7","007","Mercury",6.9099999999999999E-6,"lb/MMBtu",5.9970615034168563E-5,"lb/MW","Part II","3",238]
[{"$f":"VLOOKUP(B474&\"_\"&C474,Hg_Min_Tests!$A:$AZ,6,FALSE)","v":"Joliet 29"},384,"71","JOL7CONFIG","Mercury",2.5547016047453528E-6,"lb/MMBtu",2.6039999999999998E-5,"lb/MW","Part II","Joliet 7 Hg",239]
[{"$f":"VLOOKUP(B475&\"_\"&C475,Hg_Min_Tests!$A:$AZ,6,FALSE)","v":"Joliet 29"},384,"72","JOL7CONFIG","Mercury",2.5547016047453528E-6,"lb/MMBtu",2.6039999999999998E-5,"lb/MW","Part II","Joliet 7 Hg",240]
[{"$f":"VLOOKUP(B476&\"_\"&C476,Hg_Min_Tests!$A:$AZ,6,FALSE)","v":"Lawrence Energy Center"},1250,"3","3","Mercury",2.3485200052821324E-6,"lb/MMBtu",2.6117162127706474E-5,"lb/MW","Part II","MERC 0708/3",241]
[{"$f":"VLOOKUP(B477&\"_\"&C477,Hg_Min_Tests!$A:$AZ,6,FALSE)","v":"Lawrence Energy Center"},1250,"3","3","Mercury",4.3266666666666662E-6,"lb/MMBtu",4.8115517241379308E-5,"lb/MW","ETTS","",241]
[{"$f":"VLOOKUP(B478&\"_\"&C478,Hg_Min_Tests!$A:$AZ,6,FALSE)","v":"Canadys Steam"},3280,"CAN2","CAN002","Mercury",2.74E-6,"lb/MMBtu",2.6190390243902441E-5,"lb/MW","Part II","Hg-01/06-CAN2",242]
[{"$f":"VLOOKUP(B479&\"_\"&C479,Hg_Min_Tests!$A:$AZ,6,FALSE)","v":"Canadys Steam"},3280,"CAN2","CAN002","Mercury",3.8999999999999999E-6,"lb/MMBtu",3.7278292682926829E-5,"lb/MW","Part II","Hg-03/06-CAN2",242]
[{"$f":"VLOOKUP(B480&\"_\"&C480,Hg_Min_Tests!$A:$AZ,6,FALSE)","v":"Will County"},884,"3","WC3CONFIG","Mercury",2.8477903298829569E-6,"lb/MMBtu",2.6450000000000003E-5,"lb/MW","Part II","WillCo3  Hg",243]
[{"$f":"VLOOKUP(B481&\"_\"&C481,Hg_Min_Tests!$A:$AZ,6,FALSE)","v":"St. Nicholas Cogen Project"},54634,"1","1","Mercury",2.0603076923076927E-6,"lb/MMBtu",2.7000000000000002E-5,"lb/MW","Part II","Mercury",244]
[{"$f":"VLOOKUP(B482&\"_\"&C482,Hg_Min_Tests!$A:$AZ,6,FALSE)","v":"R D Green"},6639,"G2","2","Mercury",2.3966666666666664E-6,"lb/MMBtu",2.7342055788005576E-5,"lb/MW","ETTS","",245]
[{"$f":"VLOOKUP(B483&\"_\"&C483,Hg_Min_Tests!$A:$AZ,6,FALSE)","v":"O H Hutchings"},2848,"H-6","H-6","Mercury",2.5966666666666667E-6,"lb/MMBtu",2.7726391184573004E-5,"lb/MW","Part II","2007 H-6 Hg",246]
[{"$f":"VLOOKUP(B484&\"_\"&C484,Hg_Min_Tests!$A:$AZ,6,FALSE)","v":"Stanton"},2824,"1","u1","Mercury",2.0701228415176761E-6,"lb/MMBtu",2.8228947838877401E-5,"lb/MW","Part II","2009 Mercury and Trace Metals",247]
[{"$f":"VLOOKUP(B485&\"_\"&C485,Hg_Min_Tests!$A:$AZ,6,FALSE)","v":"Stanton"},2824,"1","u1","Mercury",2.2736160698412916E-6,"lb/MMBtu",3.1003855497835795E-5,"lb/MW","Part II","2007 Mercury Research",247]
[{"$f":"VLOOKUP(B486&\"_\"&C486,Hg_Min_Tests!$A:$AZ,6,FALSE)","v":"Stanton"},2824,"1","u1","Mercury",5.2699211048004746E-6,"lb/MMBtu",7.1862560520006478E-5,"lb/MW","Part II","2005 Mercury Research",247]
[{"$f":"VLOOKUP(B487&\"_\"&C487,Hg_Min_Tests!$A:$AZ,6,FALSE)","v":"ED Edwards"},856,"3","003","Mercury",2.2699999999999999E-6,"lb/MMBtu",2.8492841530054646E-5,"lb/MW","Part II","6",248]
[{"$f":"VLOOKUP(B488&\"_\"&C488,Hg_Min_Tests!$A:$AZ,6,FALSE)","v":"ED Edwards"},856,"3","003","Mercury",2.3199999999999998E-6,"lb/MMBtu",2.9120437158469945E-5,"lb/MW","Part II","7",248]
[{"$f":"VLOOKUP(B489&\"_\"&C489,Hg_Min_Tests!$A:$AZ,6,FALSE)","v":"ED Edwards"},856,"3","003","Mercury",4.6199999999999998E-6,"lb/MMBtu",5.7989836065573771E-5,"lb/MW","Part II","3",248]
[{"$f":"VLOOKUP(B490&\"_\"&C490,Hg_Min_Tests!$A:$AZ,6,FALSE)","v":"ED Edwards"},856,"3","003","Mercury",8.599999999999999E-6,"lb/MMBtu",1.0794644808743169E-4,"lb/MW","Part II","2",248]
[{"$f":"VLOOKUP(B491&\"_\"&C491,Hg_Min_Tests!$A:$AZ,6,FALSE)","v":"Portland"},3113,"1","POR-1","Mercury",2.9269999999999997E-6,"lb/MMBtu",2.925298255813953E-5,"lb/MW","Part II","U1-Hg-1",249]
[{"$f":"VLOOKUP(B492&\"_\"&C492,Hg_Min_Tests!$A:$AZ,6,FALSE)","v":"Portland"},3113,"1","POR-1","Mercury",3.9746666666666668E-6,"lb/MMBtu",3.972355813953488E-5,"lb/MW","Part II","U1-Hg-2",249]
[{"$f":"VLOOKUP(B493&\"_\"&C493,Hg_Min_Tests!$A:$AZ,6,FALSE)","v":"Boswell Energy Center"},1893,"2","BEC2","Mercury",2.8200000000000001E-6,"lb/MMBtu",2.9374999999999999E-5,"lb/MW","Part II","1,2-Mar2006-Hg",250]
[{"$f":"VLOOKUP(B494&\"_\"&C494,Hg_Min_Tests!$A:$AZ,6,FALSE)","v":"Cherokee"},469,"2","Unit 2","Mercury",2.4399999999999999E-6,"lb/MMBtu",2.9793684210526317E-5,"lb/MW","Part II","CHE2 Hg Aug05",251]
[{"$f":"VLOOKUP(B495&\"_\"&C495,Hg_Min_Tests!$A:$AZ,6,FALSE)","v":"Titus"},3115,"3","TI-3-2","Mercury",2.8600499999999998E-6,"lb/MMBtu",2.9861310904872388E-5,"lb/MW","Part II","T-53",252]
[{"$f":"VLOOKUP(B496&\"_\"&C496,Hg_Min_Tests!$A:$AZ,6,FALSE)","v":"Elmer Smith Station"},1374,"1374","Unit001","Mercury",3.6100000000000002E-6,"lb/MMBtu",2.9943914510686167E-5,"lb/MW","ETTS","",253]
[{"$f":"VLOOKUP(B497&\"_\"&C497,Hg_Min_Tests!$A:$AZ,6,FALSE)","v":"Elmer Smith Station"},1374,"1374-2","Unit001","Mercury",3.6100000000000002E-6,"lb/MMBtu",2.9943914510686167E-5,"lb/MW","ETTS","",254]
[{"$f":"VLOOKUP(B498&\"_\"&C498,Hg_Min_Tests!$A:$AZ,6,FALSE)","v":"Hatfield's Ferry Power Station"},3179,"1","001","Mercury",3.1566666666666664E-6,"lb/MMBtu",3.0496610169491519E-5,"lb/MW","ETTS","",255]
[{"$f":"VLOOKUP(B499&\"_\"&C499,Hg_Min_Tests!$A:$AZ,6,FALSE)","v":"Hatfield's Ferry Power Station"},3179,"1","001","Mercury",3.1633333333333328E-6,"lb/MMBtu",3.0561016949152532E-5,"lb/MW","Part II","H2SO4-Hg-11/09-1",255]
[{"$f":"VLOOKUP(B500&\"_\"&C500,Hg_Min_Tests!$A:$AZ,6,FALSE)","v":"Dubuque"},1046,"1","Unit 1","Mercury",1.9E-6,"lb/MMBtu",3.0612234042553191E-5,"lb/MW","Part II","DBQ1-Hg-20060411",256]
[{"$f":"VLOOKUP(B501&\"_\"&C501,Hg_Min_Tests!$A:$AZ,6,FALSE)","v":"Dubuque"},1046,"1","Unit 1","Mercury",4.0720000000000001E-6,"lb/MMBtu",6.5606851063829783E-5,"lb/MW","Part II","DBQ1-Hg-20070502",256]
[{"$f":"VLOOKUP(B502&\"_\"&C502,Hg_Min_Tests!$A:$AZ,6,FALSE)","v":"South Oak Creek"},4041,"7","OCPP-B7","Mercury",3.4733333333333333E-6,"lb/MMBtu",3.09995E-5,"lb/MW","ETTS","",257]
[{"$f":"VLOOKUP(B503&\"_\"&C503,Hg_Min_Tests!$A:$AZ,6,FALSE)","v":"South Oak Creek"},4041,"7","OCPP-B7","Mercury",3.9999999999999998E-6,"lb/MMBtu",3.57E-5,"lb/MW","Part II","OCPP-Hg-B7-6.2005",257]
[{"$f":"VLOOKUP(B504&\"_\"&C504,Hg_Min_Tests!$A:$AZ,6,FALSE)","v":"South Oak Creek"},4041,"7","OCPP-B7","Mercury",5.1315600000000007E-6,"lb/MMBtu",4.5799173000000013E-5,"lb/MW","Part II","OCPP-Hg-B7B8-9.2005",257]
[{"$f":"VLOOKUP(B505&\"_\"&C505,Hg_Min_Tests!$A:$AZ,6,FALSE)","v":"Cholla"},113,"3","003","Mercury",3.2773891007666669E-6,"lb/MMBtu",3.1473680905395301E-5,"lb/MW","ETTS","",258]
[{"$f":"VLOOKUP(B506&\"_\"&C506,Hg_Min_Tests!$A:$AZ,6,FALSE)","v":"Crystal River Power Plant"},628,"1","CryR_Cfg_1","Mercury",3.3699999999999999E-6,"lb/MMBtu",3.2326724999999998E-5,"lb/MW","ETTS","",259]
[{"$f":"VLOOKUP(B507&\"_\"&C507,Hg_Min_Tests!$A:$AZ,6,FALSE)","v":"Taconite Harbor Energy Center"},10075,"2","THEC2","Mercury",2.8658244823811291E-6,"lb/MMBtu",3.3036587783004682E-5,"lb/MW","ERT","",260]
[{"$f":"VLOOKUP(B508&\"_\"&C508,Hg_Min_Tests!$A:$AZ,6,FALSE)","v":"New Castle Plant"},3138,"5","NC5-2","Mercury",3.3775000000000003E-6,"lb/MMBtu",3.3963555478018143E-5,"lb/MW","Part II","nc-52",261]
[{"$f":"VLOOKUP(B509&\"_\"&C509,Hg_Min_Tests!$A:$AZ,6,FALSE)","v":"Sheldon Station"},2277,"1","U1","Mercury",3.173435164018487E-6,"lb/MMBtu",3.4064843088760946E-5,"lb/MW","ERT","",262]
[{"$f":"VLOOKUP(B510&\"_\"&C510,Hg_Min_Tests!$A:$AZ,6,FALSE)","v":"Earl F Wisdom"},1217,"1","1","Mercury",2.8759300536660698E-6,"lb/MMBtu",3.4295465889967883E-5,"lb/MW","Part II","2009 Stack (Hg)",263]
[{"$f":"VLOOKUP(B511&\"_\"&C511,Hg_Min_Tests!$A:$AZ,6,FALSE)","v":"Earl F Wisdom"},1217,"1","1","Mercury",3.2157266501333978E-6,"lb/MMBtu",3.8347540302840768E-5,"lb/MW","Part II","2007 Stack (Hg)",263]
[{"$f":"VLOOKUP(B512&\"_\"&C512,Hg_Min_Tests!$A:$AZ,6,FALSE)","v":"Harding Street"},990,"60","60s","Mercury",3.8033744110999998E-6,"lb/MMBtu",3.4535998000791959E-5,"lb/MW","ETTS","",264]
[{"$f":"VLOOKUP(B513&\"_\"&C513,Hg_Min_Tests!$A:$AZ,6,FALSE)","v":"J K Spruce"},7097,"BLR1","1","Mercury",3.1733333333333336E-6,"lb/MMBtu",3.4802712643678162E-5,"lb/MW","ETTS","",265]
[{"$f":"VLOOKUP(B514&\"_\"&C514,Hg_Min_Tests!$A:$AZ,6,FALSE)","v":"J K Spruce"},7097,"BLR1","1","Mercury",3.9999999999999998E-6,"lb/MMBtu",4.3868965517241375E-5,"lb/MW","Part II","JKS Unit 1 Test Report June 2009",265]
[{"$f":"VLOOKUP(B515&\"_\"&C515,Hg_Min_Tests!$A:$AZ,6,FALSE)","v":"Michigan City"},997,"12","12","Mercury",3.7366666666666663E-6,"lb/MMBtu",3.5102020202020202E-5,"lb/MW","ETTS","",266]
[{"$f":"VLOOKUP(B516&\"_\"&C516,Hg_Min_Tests!$A:$AZ,6,FALSE)","v":"James H. Miller Jr."},6002,"4","Unit 4","Mercury",3.67E-6,"lb/MMBtu",3.541336357066667E-5,"lb/MW","ETTS","",267]
[{"$f":"VLOOKUP(B517&\"_\"&C517,Hg_Min_Tests!$A:$AZ,6,FALSE)","v":"James H. Miller Jr."},6002,"4","Unit 4","Mercury",3.8117666171220663E-6,"lb/MMBtu",3.6781328898821229E-5,"lb/MW","Part II","Mercury Control Evaluation (U4) (2008)",267]
[{"$f":"VLOOKUP(B518&\"_\"&C518,Hg_Min_Tests!$A:$AZ,6,FALSE)","v":"Fisk"},886,"19","FISK19 CONFIG","Mercury",3.4404711549300173E-6,"lb/MMBtu",3.5433333333333332E-5,"lb/MW","Part II","Fisk Hg",268]
[{"$f":"VLOOKUP(B519&\"_\"&C519,Hg_Min_Tests!$A:$AZ,6,FALSE)","v":"Prairie Creek"},1073,"4","Unit 4","Mercury",3.3000000000000002E-6,"lb/MMBtu",3.5848280512474712E-5,"lb/MW","Part II","PC4-Metals-20060822",269]
[{"$f":"VLOOKUP(B520&\"_\"&C520,Hg_Min_Tests!$A:$AZ,6,FALSE)","v":"Prairie Creek"},1073,"4","Unit 4","Mercury",4.6999999999999999E-6,"lb/MMBtu",5.1056641942009438E-5,"lb/MW","Part II","PC4-Hg-20071016",269]
[{"$f":"VLOOKUP(B521&\"_\"&C521,Hg_Min_Tests!$A:$AZ,6,FALSE)","v":"O H Hutchings"},2848,"H-4","H-4","Mercury",3.3000000000000002E-6,"lb/MMBtu",3.5887500000000005E-5,"lb/MW","Part II","2007 H-4 Hg",270]
[{"$f":"VLOOKUP(B522&\"_\"&C522,Hg_Min_Tests!$A:$AZ,6,FALSE)","v":"Fair Station"},1218,"2","U2","Mercury",3.4000000000000001E-6,"lb/MMBtu",3.593181818181818E-5,"lb/MW","Part II","MERCU206",271]
[{"$f":"VLOOKUP(B523&\"_\"&C523,Hg_Min_Tests!$A:$AZ,6,FALSE)","v":"Fair Station"},1218,"2","U2","Mercury",4.8999999999999997E-6,"lb/MMBtu",5.1784090909090908E-5,"lb/MW","Part II","MERCU209",271]
[{"$f":"VLOOKUP(B524&\"_\"&C524,Hg_Min_Tests!$A:$AZ,6,FALSE)","v":"Fair Station"},1218,"2","U2","Mercury",5.4700000000000001E-6,"lb/MMBtu",5.7807954545454551E-5,"lb/MW","ETTS","",271]
[{"$f":"VLOOKUP(B525&\"_\"&C525,Hg_Min_Tests!$A:$AZ,6,FALSE)","v":"Stanton"},2824,"10","u10","Mercury",3.3599333037493146E-6,"lb/MMBtu",3.5951286350117665E-5,"lb/MW","Part II","2009 Mercury and Trace Metals",272]
[{"$f":"VLOOKUP(B526&\"_\"&C526,Hg_Min_Tests!$A:$AZ,6,FALSE)","v":"Stanton"},2824,"10","u10","Mercury",5.4025157083510157E-6,"lb/MMBtu",5.7806918079355867E-5,"lb/MW","Part II","MerCap testing",272]
[{"$f":"VLOOKUP(B527&\"_\"&C527,Hg_Min_Tests!$A:$AZ,6,FALSE)","v":"Cane Run"},1363,"4","CR4","Mercury",2.6250063194587077E-6,"lb/MMBtu",3.6093836892557229E-5,"lb/MW","ERT","",273]
[{"$f":"VLOOKUP(B528&\"_\"&C528,Hg_Min_Tests!$A:$AZ,6,FALSE)","v":"Sutherland"},1077,"2","Unit 2","Mercury",2.9799999999999998E-6,"lb/MMBtu",3.6222912621359228E-5,"lb/MW","Part II","SUTH2-Hg-20060517",274]
[{"$f":"VLOOKUP(B529&\"_\"&C529,Hg_Min_Tests!$A:$AZ,6,FALSE)","v":"Sutherland"},1077,"1","Unit 1","Mercury",2.83E-6,"lb/MMBtu",3.6653064516129028E-5,"lb/MW","Part II","SUTH1-Hg-20060516",275]
[{"$f":"VLOOKUP(B530&\"_\"&C530,Hg_Min_Tests!$A:$AZ,6,FALSE)","v":"Eagle Valley"},991,"6","6","Mercury",3.8124783944333337E-6,"lb/MMBtu",3.6926576448939999E-5,"lb/MW","ETTS","",276]
[{"$f":"VLOOKUP(B531&\"_\"&C531,Hg_Min_Tests!$A:$AZ,6,FALSE)","v":"Eagle Valley"},991,"6","6","Mercury",4.1300000000000003E-6,"lb/MMBtu",4.0002000000000001E-5,"lb/MW","Part II","Unit 5/6 - Hg 8/28/2007",276]
[{"$f":"VLOOKUP(B532&\"_\"&C532,Hg_Min_Tests!$A:$AZ,6,FALSE)","v":"Jim Bridger Plant Units 1-4"},8066,"BW74","JB4","Mercury",3.96601237145584E-6,"lb/MMBtu",3.7109836116413315E-5,"lb/MW","Part II","BW74",277]
[{"$f":"VLOOKUP(B533&\"_\"&C533,Hg_Min_Tests!$A:$AZ,6,FALSE)","v":"Portland"},3113,"2","POR-2","Mercury",3.8283333333333328E-6,"lb/MMBtu",3.8163228758169932E-5,"lb/MW","Part II","U2-Hg-1",278]
[{"$f":"VLOOKUP(B534&\"_\"&C534,Hg_Min_Tests!$A:$AZ,6,FALSE)","v":"Portland"},3113,"2","POR-2","Mercury",4.0260000000000001E-6,"lb/MMBtu",4.0133694117647057E-5,"lb/MW","Part II","U2-Hg-2",278]
[{"$f":"VLOOKUP(B535&\"_\"&C535,Hg_Min_Tests!$A:$AZ,6,FALSE)","v":"O H Hutchings"},2848,"H-1","H-1","Mercury",3.3466666666666667E-6,"lb/MMBtu",3.8328805031446544E-5,"lb/MW","Part II","2007 H-1 Hg",279]
[{"$f":"VLOOKUP(B536&\"_\"&C536,Hg_Min_Tests!$A:$AZ,6,FALSE)","v":"Harding Street"},990,"50","50s","Mercury",4.2216666666666672E-6,"lb/MMBtu",3.8334241071428576E-5,"lb/MW","Part II","Unit 50 - Hg 08/2007",280]
[{"$f":"VLOOKUP(B537&\"_\"&C537,Hg_Min_Tests!$A:$AZ,6,FALSE)","v":"W.H. Weatherspoon Plant"},2716,"1","Wea_Cfg_1","Mercury",4.3333333333333339E-6,"lb/MMBtu",3.8591194968553465E-5,"lb/MW","ETTS","",281]
[{"$f":"VLOOKUP(B538&\"_\"&C538,Hg_Min_Tests!$A:$AZ,6,FALSE)","v":"W.H. Weatherspoon Plant"},2716,"2","Wea_Cfg_1","Mercury",4.3333333333333339E-6,"lb/MMBtu",3.8591194968553465E-5,"lb/MW","ETTS","",282]
[{"$f":"VLOOKUP(B539&\"_\"&C539,Hg_Min_Tests!$A:$AZ,6,FALSE)","v":"Otto E. Eckert Station"},1831,"EUBoiler1","001","Mercury",3.0599999999999999E-6,"lb/MMBtu",3.89385E-5,"lb/MW","Part II","Hg-1--7/05",283]
[{"$f":"VLOOKUP(B540&\"_\"&C540,Hg_Min_Tests!$A:$AZ,6,FALSE)","v":"Tecumseh Energy Center"},1252,"9","9","Mercury",3.787320749083932E-6,"lb/MMBtu",3.9074065289329348E-5,"lb/MW","Part II","MERC 0908/9",284]
[{"$f":"VLOOKUP(B541&\"_\"&C541,Hg_Min_Tests!$A:$AZ,6,FALSE)","v":"Winyah"},6249,"2","W2","Mercury",4.131065537396696E-6,"lb/MMBtu",3.9387339615572434E-5,"lb/MW","Part II","W2LME2008",285]
[{"$f":"VLOOKUP(B542&\"_\"&C542,Hg_Min_Tests!$A:$AZ,6,FALSE)","v":"Muscatine #1"},1167,"8","8","Mercury",3.6005887799150009E-6,"lb/MMBtu",3.9510460878267271E-5,"lb/MW","ERT","",286]
[{"$f":"VLOOKUP(B543&\"_\"&C543,Hg_Min_Tests!$A:$AZ,6,FALSE)","v":"ED Edwards"},856,"2","002","Mercury",3.3799999999999998E-6,"lb/MMBtu",4.0377625899280575E-5,"lb/MW","Part II","4",287]
[{"$f":"VLOOKUP(B544&\"_\"&C544,Hg_Min_Tests!$A:$AZ,6,FALSE)","v":"ED Edwards"},856,"2","002","Mercury",3.4199999999999999E-6,"lb/MMBtu",4.0855467625899281E-5,"lb/MW","Part II","5",287]
[{"$f":"VLOOKUP(B545&\"_\"&C545,Hg_Min_Tests!$A:$AZ,6,FALSE)","v":"ED Edwards"},856,"2","002","Mercury",1.01E-5,"lb/MMBtu",1.2065503597122303E-4,"lb/MW","Part II","1",287]
[{"$f":"VLOOKUP(B546&\"_\"&C546,Hg_Min_Tests!$A:$AZ,6,FALSE)","v":"Sixth Street"},1058,"4","Unit 4","Mercury",1.9806999999999999E-6,"lb/MMBtu",4.0684648648648647E-5,"lb/MW","Part II","SXTH4-Hg-20071009",288]
[{"$f":"VLOOKUP(B547&\"_\"&C547,Hg_Min_Tests!$A:$AZ,6,FALSE)","v":"Sixth Street"},1058,"4","Unit 4","Mercury",6.4999999999999996E-6,"lb/MMBtu",1.3351351351351351E-4,"lb/MW","Part II","SXTH4-Hg-20060623",288]
[{"$f":"VLOOKUP(B548&\"_\"&C548,Hg_Min_Tests!$A:$AZ,6,FALSE)","v":"Tecumseh Energy Center"},1252,"10","10","Mercury",4.1946281813437354E-6,"lb/MMBtu",4.1165213117600935E-5,"lb/MW","Part II","MERC 0908/10",289]
[{"$f":"VLOOKUP(B549&\"_\"&C549,Hg_Min_Tests!$A:$AZ,6,FALSE)","v":"TransAlta Centralia Generation"},3845,"BD21","BW21CONFIG","Mercury",3.2483333333333329E-6,"lb/MMBtu",4.1711185737976778E-5,"lb/MW","CEMS","",290]
[{"$f":"VLOOKUP(B550&\"_\"&C550,Hg_Min_Tests!$A:$AZ,6,FALSE)","v":"ED Edwards"},856,"1","001","Mercury",3.3799999999999998E-6,"lb/MMBtu",4.1851544715447156E-5,"lb/MW","Part II","4",291]
[{"$f":"VLOOKUP(B551&\"_\"&C551,Hg_Min_Tests!$A:$AZ,6,FALSE)","v":"ED Edwards"},856,"1","001","Mercury",1.01E-5,"lb/MMBtu",1.2505934959349593E-4,"lb/MW","Part II","1",291]
[{"$f":"VLOOKUP(B552&\"_\"&C552,Hg_Min_Tests!$A:$AZ,6,FALSE)","v":"Silver Bay Power"},10849,"BLR1","GEN1","Mercury",5.0955396376465634E-6,"lb/MMBtu",4.2113148552797113E-5,"lb/MW","ERT","",292]
[{"$f":"VLOOKUP(B553&\"_\"&C553,Hg_Min_Tests!$A:$AZ,6,FALSE)","v":"Powerton"},879,"51","Pow5CONFIG","Mercury",4.2271882376674412E-6,"lb/MMBtu",4.2166666666666671E-5,"lb/MW","Part II","Pow56 Hg",293]
[{"$f":"VLOOKUP(B554&\"_\"&C554,Hg_Min_Tests!$A:$AZ,6,FALSE)","v":"Powerton"},879,"52","Pow5CONFIG","Mercury",4.2271882376674412E-6,"lb/MMBtu",4.2166666666666671E-5,"lb/MW","Part II","Pow56 Hg",294]
[{"$f":"VLOOKUP(B555&\"_\"&C555,Hg_Min_Tests!$A:$AZ,6,FALSE)","v":"Powerton"},879,"61","Pow6CONFIG","Mercury",4.2489487827097961E-6,"lb/MMBtu",4.2166666666666671E-5,"lb/MW","Part II","Pow56 Hg",295]
[{"$f":"VLOOKUP(B556&\"_\"&C556,Hg_Min_Tests!$A:$AZ,6,FALSE)","v":"Powerton"},879,"62","Pow6CONFIG","Mercury",4.2489487827097961E-6,"lb/MMBtu",4.2166666666666671E-5,"lb/MW","Part II","Pow56 Hg",296]
[{"$f":"VLOOKUP(B557&\"_\"&C557,Hg_Min_Tests!$A:$AZ,6,FALSE)","v":"Bay Front"},3982,"5","5","Mercury",3.5720000000000003E-6,"lb/MMBtu",4.3422125000000001E-5,"lb/MW","Part II","Mercury Diagnostic Test 2006",297]
[{"$f":"VLOOKUP(B558&\"_\"&C558,Hg_Min_Tests!$A:$AZ,6,FALSE)","v":"Avon Lake"},2836,"10","AL10","Mercury",3.0345125578111006E-6,"lb/MMBtu",4.34746502094323E-5,"lb/MW","Part II","AL-HG-10-1207",298]
[{"$f":"VLOOKUP(B559&\"_\"&C559,Hg_Min_Tests!$A:$AZ,6,FALSE)","v":"Avon Lake"},2836,"10","AL10","Mercury",6.4215618521078093E-6,"lb/MMBtu",9.2E-5,"lb/MW","Part II","AL-HG-10-806",298]
[{"$f":"VLOOKUP(B560&\"_\"&C560,Hg_Min_Tests!$A:$AZ,6,FALSE)","v":"Dubuque"},1046,"5","Unit 5","Mercury",3.8E-6,"lb/MMBtu",4.3895205479452056E-5,"lb/MW","Part II","DBQ5-Hg-20060411",299]
[{"$f":"VLOOKUP(B561&\"_\"&C561,Hg_Min_Tests!$A:$AZ,6,FALSE)","v":"Ames Electric Services Power Plant"},1122,"Boiler 8","008","Mercury",4.78E-6,"lb/MMBtu",4.4183768913342496E-5,"lb/MW","Part II","6",300]
[{"$f":"VLOOKUP(B562&\"_\"&C562,Hg_Min_Tests!$A:$AZ,6,FALSE)","v":"Ames Electric Services Power Plant"},1122,"Boiler 8","008","Mercury",4.8500000000000002E-6,"lb/MMBtu",4.4830811554332873E-5,"lb/MW","Part II","7",300]
[{"$f":"VLOOKUP(B563&\"_\"&C563,Hg_Min_Tests!$A:$AZ,6,FALSE)","v":"Ames Electric Services Power Plant"},1122,"Boiler 8","008","Mercury",6.6000000000000003E-6,"lb/MMBtu",6.1006877579092158E-5,"lb/MW","Part II","5",300]
[{"$f":"VLOOKUP(B564&\"_\"&C564,Hg_Min_Tests!$A:$AZ,6,FALSE)","v":"TransAlta Centralia Generation"},3845,"BD22","BW22CONFIG","Mercury",3.2596551724137933E-6,"lb/MMBtu",4.4514126984126991E-5,"lb/MW","CEMS","",301]
[{"$f":"VLOOKUP(B565&\"_\"&C565,Hg_Min_Tests!$A:$AZ,6,FALSE)","v":"Walter Scott Jr. Energy Center"},1082,"3","3","Mercury",4.4599999999999996E-6,"lb/MMBtu",4.4891503267973852E-5,"lb/MW","Part II","7/2009 HG",302]
[{"$f":"VLOOKUP(B566&\"_\"&C566,Hg_Min_Tests!$A:$AZ,6,FALSE)","v":"Eagle Valley"},991,"5","5","Mercury",4.1300000000000003E-6,"lb/MMBtu",4.6368636363636361E-5,"lb/MW","Part II","Unit 5/6 - Hg 8/28/2007",303]
[{"$f":"VLOOKUP(B567&\"_\"&C567,Hg_Min_Tests!$A:$AZ,6,FALSE)","v":"Titus"},3115,"2","TI-2","Mercury",4.5000000000000001E-6,"lb/MMBtu",4.6983758700696053E-5,"lb/MW","Part II","T-51",304]
[{"$f":"VLOOKUP(B568&\"_\"&C568,Hg_Min_Tests!$A:$AZ,6,FALSE)","v":"Lawrence Energy Center"},1250,"5","5","Mercury",4.8655759528058134E-6,"lb/MMBtu",4.7279637036355482E-5,"lb/MW","Part II","MERC 0808/5",305]
[{"$f":"VLOOKUP(B569&\"_\"&C569,Hg_Min_Tests!$A:$AZ,6,FALSE)","v":"Eagle Valley"},991,"3","3","Mercury",4.1999999999999996E-6,"lb/MMBtu",4.7843478260869563E-5,"lb/MW","Part II","Unit 3/4  - Hg 08/22/2007",306]
[{"$f":"VLOOKUP(B570&\"_\"&C570,Hg_Min_Tests!$A:$AZ,6,FALSE)","v":"South Oak Creek"},4041,"6","OCPP-B6","Mercury",5.2892666666666669E-6,"lb/MMBtu",4.7869765947242215E-5,"lb/MW","Part II","OCPP-PM.Hg-B6-6.2005",307]
[{"$f":"VLOOKUP(B571&\"_\"&C571,Hg_Min_Tests!$A:$AZ,6,FALSE)","v":"South Oak Creek"},4041,"6","OCPP-B6","Mercury",5.5566699999999993E-6,"lb/MMBtu",5.0289862302158272E-5,"lb/MW","Part II","OCPP-Hg-B5B6-9.2005",307]
[{"$f":"VLOOKUP(B572&\"_\"&C572,Hg_Min_Tests!$A:$AZ,6,FALSE)","v":"Lawrence Energy Center"},1250,"4","4","Mercury",4.7860316735648537E-6,"lb/MMBtu",4.8468066789434549E-5,"lb/MW","Part II","MERC 0808/4",308]
[{"$f":"VLOOKUP(B573&\"_\"&C573,Hg_Min_Tests!$A:$AZ,6,FALSE)","v":"Lawrence Energy Center"},1250,"4","4","Mercury",5.9361306424366724E-6,"lb/MMBtu",6.0115100791660265E-5,"lb/MW","Part II","MERC 0808/4",308]
[{"$f":"VLOOKUP(B574&\"_\"&C574,Hg_Min_Tests!$A:$AZ,6,FALSE)","v":"Welsh"},6139,"1","WE-1","Mercury",5.2533333333333336E-6,"lb/MMBtu",4.8541553166069294E-5,"lb/MW","ETTS","",309]
[{"$f":"VLOOKUP(B575&\"_\"&C575,Hg_Min_Tests!$A:$AZ,6,FALSE)","v":"Quindaro"},1295,"2","Unit 2","Mercury",4.2733333333333328E-6,"lb/MMBtu",4.9724763494713409E-5,"lb/MW","ETTS","",310]
[{"$f":"VLOOKUP(B576&\"_\"&C576,Hg_Min_Tests!$A:$AZ,6,FALSE)","v":"Wygen 1"},55479,"3","WYG1Cfg","Mercury",4.3200000000000001E-6,"lb/MMBtu",4.9988571428571429E-5,"lb/MW","ETTS","",311]
[{"$f":"VLOOKUP(B577&\"_\"&C577,Hg_Min_Tests!$A:$AZ,6,FALSE)","v":"Wygen 1"},55479,"3","WYG1Cfg","Mercury",6.7466666666666667E-6,"lb/MMBtu",7.8068571428571425E-5,"lb/MW","CEMS","",311]
[{"$f":"VLOOKUP(B578&\"_\"&C578,Hg_Min_Tests!$A:$AZ,6,FALSE)","v":"Jim Bridger Plant Units 1-4"},8066,"BW71","JB1","Mercury",5.3046904211604527E-6,"lb/MMBtu",5.1174329748445761E-5,"lb/MW","Part II","BW71",312]
[{"$f":"VLOOKUP(B579&\"_\"&C579,Hg_Min_Tests!$A:$AZ,6,FALSE)","v":"Rawhide"},6761,"101","Rawhide101","Mercury",5.6333333333333325E-6,"lb/MMBtu",5.1715846994535512E-5,"lb/MW","ETTS","",313]
[{"$f":"VLOOKUP(B580&\"_\"&C580,Hg_Min_Tests!$A:$AZ,6,FALSE)","v":"Otto E. Eckert Station"},1831,"EUBoiler4","004","Mercury",4.6199999999999998E-6,"lb/MMBtu",5.1782500000000001E-5,"lb/MW","Part II","Hg-4-7/05",314]
[{"$f":"VLOOKUP(B581&\"_\"&C581,Hg_Min_Tests!$A:$AZ,6,FALSE)","v":"Eagle Valley"},991,"4","4","Mercury",4.1999999999999996E-6,"lb/MMBtu",5.1869999999999996E-5,"lb/MW","Part II","Unit 3/4  - Hg 08/22/2007",315]
[{"$f":"VLOOKUP(B582&\"_\"&C582,Hg_Min_Tests!$A:$AZ,6,FALSE)","v":"ML Kapp"},1048,"2","Unit 2","Mercury",5.1749999999999996E-6,"lb/MMBtu",5.269912663755458E-5,"lb/MW","Part II","KAPP2-Hg-20071030",316]
[{"$f":"VLOOKUP(B583&\"_\"&C583,Hg_Min_Tests!$A:$AZ,6,FALSE)","v":"ML Kapp"},1048,"2","Unit 2","Mercury",1.01E-5,"lb/MMBtu",1.0285240174672489E-4,"lb/MW","Part II","KAPP2-Metals-20060608",316]
[{"$f":"VLOOKUP(B584&\"_\"&C584,Hg_Min_Tests!$A:$AZ,6,FALSE)","v":"Lansing"},1047,"4","Unit 4","Mercury",5.524E-6,"lb/MMBtu",5.4905465556396667E-5,"lb/MW","Part II","LANS4-Hg-20071002",317]
[{"$f":"VLOOKUP(B585&\"_\"&C585,Hg_Min_Tests!$A:$AZ,6,FALSE)","v":"Lansing"},1047,"4","Unit 4","Mercury",1.13E-5,"lb/MMBtu",1.1231566994700984E-4,"lb/MW","Part II","LANS4-Metals-20060502",317]
[{"$f":"VLOOKUP(B586&\"_\"&C586,Hg_Min_Tests!$A:$AZ,6,FALSE)","v":"Jefferies"},3319,"4","J4","Mercury",5.5619651997282806E-6,"lb/MMBtu",5.5001655863979667E-5,"lb/MW","Part II","J4LME2008",318]
[{"$f":"VLOOKUP(B587&\"_\"&C587,Hg_Min_Tests!$A:$AZ,6,FALSE)","v":"Waukegan"},883,"7","WK7CONFIG","Mercury",5.5072706768126152E-6,"lb/MMBtu",5.5599999999999996E-5,"lb/MW","Part II","Waukegan7 Hg",319]
[{"$f":"VLOOKUP(B588&\"_\"&C588,Hg_Min_Tests!$A:$AZ,6,FALSE)","v":"Gallatin"},3403,"2","2","Mercury",6.1999999999999991E-6,"lb/MMBtu",5.6833333333333323E-5,"lb/MW","ETTS","",320]
[{"$f":"VLOOKUP(B589&\"_\"&C589,Hg_Min_Tests!$A:$AZ,6,FALSE)","v":"Wabash River"},1010,"6","6","Mercury",6.3755750240333329E-6,"lb/MMBtu",5.7027104446803861E-5,"lb/MW","ETTS","",321]
[{"$f":"VLOOKUP(B590&\"_\"&C590,Hg_Min_Tests!$A:$AZ,6,FALSE)","v":"Dolphus M Grainger"},3317,"2","G2","Mercury",5.1520152306924566E-6,"lb/MMBtu",5.7560446025667447E-5,"lb/MW","Part II","G2LME2008",322]
[{"$f":"VLOOKUP(B591&\"_\"&C591,Hg_Min_Tests!$A:$AZ,6,FALSE)","v":"Taconite Harbor Energy Center"},10075,"1","THEC1","Mercury",5.7177814904421793E-6,"lb/MMBtu",5.8348926775958146E-5,"lb/MW","ERT","",323]
[{"$f":"VLOOKUP(B592&\"_\"&C592,Hg_Min_Tests!$A:$AZ,6,FALSE)","v":"Boardman"},6106,"1SG","1SG","Mercury",6.3433333333333333E-6,"lb/MMBtu",5.8753825136612023E-5,"lb/MW","Part II","M22E1283C",324]
[{"$f":"VLOOKUP(B593&\"_\"&C593,Hg_Min_Tests!$A:$AZ,6,FALSE)","v":"Hawthorn"},2079,"5A","5A","Mercury",5.3000000000000001E-6,"lb/MMBtu",5.8888888888888889E-5,"lb/MW","ETTS","",325]
[{"$f":"VLOOKUP(B594&\"_\"&C594,Hg_Min_Tests!$A:$AZ,6,FALSE)","v":"Jim Bridger Plant Units 1-4"},8066,"BW72","JB2","Mercury",5.9323446312977581E-6,"lb/MMBtu",5.8996108011000625E-5,"lb/MW","Part II","BW72",326]
[{"$f":"VLOOKUP(B595&\"_\"&C595,Hg_Min_Tests!$A:$AZ,6,FALSE)","v":"Jeffrey Energy Center"},6068,"3","3","Mercury",5.9310258546589497E-6,"lb/MMBtu",5.9196637361634343E-5,"lb/MW","Part II","MERC 0709/3",327]
[{"$f":"VLOOKUP(B596&\"_\"&C596,Hg_Min_Tests!$A:$AZ,6,FALSE)","v":"Big Stone"},6098,"001","001","Mercury",5.5331091179039743E-6,"lb/MMBtu",5.9343992539297371E-5,"lb/MW","ERT","",328]
[{"$f":"VLOOKUP(B597&\"_\"&C597,Hg_Min_Tests!$A:$AZ,6,FALSE)","v":"Gerald Gentleman"},6077,"1","U1","Mercury",5.7666666666666668E-6,"lb/MMBtu",6.0795990675990674E-5,"lb/MW","ETTS","",329]
[{"$f":"VLOOKUP(B598&\"_\"&C598,Hg_Min_Tests!$A:$AZ,6,FALSE)","v":"J T Deely"},6181,"1","1","Mercury",6.4449388976603874E-6,"lb/MMBtu",6.0883189453231796E-5,"lb/MW","ERT","",330]
[{"$f":"VLOOKUP(B599&\"_\"&C599,Hg_Min_Tests!$A:$AZ,6,FALSE)","v":"J T Deely"},6181,"1","1","Mercury",8.6006666666666671E-6,"lb/MMBtu",8.1247631111111115E-5,"lb/MW","Part II","JTD Mercury Emission Test Sept 2007",330]
[{"$f":"VLOOKUP(B600&\"_\"&C600,Hg_Min_Tests!$A:$AZ,6,FALSE)","v":"J T Deely"},6181,"2","2","Mercury",6.4449388976603874E-6,"lb/MMBtu",6.0883189453231796E-5,"lb/MW","ERT","",331]
[{"$f":"VLOOKUP(B601&\"_\"&C601,Hg_Min_Tests!$A:$AZ,6,FALSE)","v":"J T Deely"},6181,"2","2","Mercury",8.6006666666666671E-6,"lb/MMBtu",8.1247631111111115E-5,"lb/MW","Part II","JTD Mercury Emission Test Sept 2007",331]
[{"$f":"VLOOKUP(B602&\"_\"&C602,Hg_Min_Tests!$A:$AZ,6,FALSE)","v":"Gerald Gentleman"},6077,"2","U2","Mercury",6.0633333333333334E-6,"lb/MMBtu",6.0940542222222223E-5,"lb/MW","ETTS","",332]
[{"$f":"VLOOKUP(B603&\"_\"&C603,Hg_Min_Tests!$A:$AZ,6,FALSE)","v":"Cardinal"},2828,"3","CD-U3","Mercury",7.6487011217333335E-6,"lb/MMBtu",6.2072151410989742E-5,"lb/MW","ETTS","",333]
[{"$f":"VLOOKUP(B604&\"_\"&C604,Hg_Min_Tests!$A:$AZ,6,FALSE)","v":"Jim Bridger Plant Units 1-4"},8066,"BW73","JB3","Mercury",6.4123264244302823E-6,"lb/MMBtu",6.2513312288454796E-5,"lb/MW","Part II","BW73",334]
[{"$f":"VLOOKUP(B605&\"_\"&C605,Hg_Min_Tests!$A:$AZ,6,FALSE)","v":"Dolphus M Grainger"},3317,"1","G1","Mercury",5.8268303990045423E-6,"lb/MMBtu",6.2956558334072076E-5,"lb/MW","Part II","G1LME2008",335]
[{"$f":"VLOOKUP(B606&\"_\"&C606,Hg_Min_Tests!$A:$AZ,6,FALSE)","v":"Sixth Street"},1058,"3","Unit 3","Mercury",2.8849999999999999E-6,"lb/MMBtu",6.309640287769783E-5,"lb/MW","Part II","SXTH3-Hg-20071218",336]
[{"$f":"VLOOKUP(B607&\"_\"&C607,Hg_Min_Tests!$A:$AZ,6,FALSE)","v":"Sixth Street"},1058,"3","Unit 3","Mercury",5.22E-6,"lb/MMBtu",1.1416402877697841E-4,"lb/MW","Part II","SXTH3-Hg-20060921",336]
[{"$f":"VLOOKUP(B608&\"_\"&C608,Hg_Min_Tests!$A:$AZ,6,FALSE)","v":"Sixth Street"},1058,"3","Unit 3","Mercury",7.7999999999999999E-6,"lb/MMBtu",1.7058992805755395E-4,"lb/MW","Part II","SXTH3-Hg-20060411",336]
[{"$f":"VLOOKUP(B609&\"_\"&C609,Hg_Min_Tests!$A:$AZ,6,FALSE)","v":"La Cygne"},1241,"2","2","Mercury",5.6434E-6,"lb/MMBtu",6.3436759124087586E-5,"lb/MW","Part II","LC2Hg/PMTest2005",337]
[{"$f":"VLOOKUP(B610&\"_\"&C610,Hg_Min_Tests!$A:$AZ,6,FALSE)","v":"La Cygne"},1241,"2","2","Mercury",5.9599999999999997E-6,"lb/MMBtu",6.6995620437956197E-5,"lb/MW","ETTS","",337]
[{"$f":"VLOOKUP(B611&\"_\"&C611,Hg_Min_Tests!$A:$AZ,6,FALSE)","v":"La Cygne"},1241,"2","2","Mercury",6.3127999999999999E-6,"lb/MMBtu",7.0961401459854008E-5,"lb/MW","Part II","LC2HgTestJuly2006",337]
[{"$f":"VLOOKUP(B612&\"_\"&C612,Hg_Min_Tests!$A:$AZ,6,FALSE)","v":"Sikeston Power Station"},6768,"1","1","Mercury",5.4040000000000003E-6,"lb/MMBtu",6.4476909871244643E-5,"lb/MW","Part II","2005 Hg",338]
[{"$f":"VLOOKUP(B613&\"_\"&C613,Hg_Min_Tests!$A:$AZ,6,FALSE)","v":"Sikeston Power Station"},6768,"1","1","Mercury",8.8266666666666663E-6,"lb/MMBtu",1.0531387696709585E-4,"lb/MW","Part II","081029",338]
[{"$f":"VLOOKUP(B614&\"_\"&C614,Hg_Min_Tests!$A:$AZ,6,FALSE)","v":"Pawnee"},6248,"1","Unit 1","Mercury",6.4699999999999999E-6,"lb/MMBtu",6.4531007462686565E-5,"lb/MW","Part II","PAW1 Hg Oct07",339]
[{"$f":"VLOOKUP(B615&\"_\"&C615,Hg_Min_Tests!$A:$AZ,6,FALSE)","v":"Pawnee"},6248,"1","Unit 1","Mercury",7.0400000000000004E-6,"lb/MMBtu",7.0216119402985078E-5,"lb/MW","Part II","PAW1 Hg Aug05",339]
[{"$f":"VLOOKUP(B616&\"_\"&C616,Hg_Min_Tests!$A:$AZ,6,FALSE)","v":"Pawnee"},6248,"1","Unit 1","Mercury",9.4978763229384367E-6,"lb/MMBtu",9.473068437020315E-5,"lb/MW","Part II","PAW1 Hg Oct09",339]
[{"$f":"VLOOKUP(B617&\"_\"&C617,Hg_Min_Tests!$A:$AZ,6,FALSE)","v":"Wabash River"},1010,"4","4","Mercury",6.3755750240333329E-6,"lb/MMBtu",6.5434297464716335E-5,"lb/MW","ETTS","",340]
[{"$f":"VLOOKUP(B618&\"_\"&C618,Hg_Min_Tests!$A:$AZ,6,FALSE)","v":"Merrimack Station"},2364,"2","mk2","Mercury",7.5799999999999986E-6,"lb/MMBtu",6.7860118694362001E-5,"lb/MW","ETTS","",341]
[{"$f":"VLOOKUP(B619&\"_\"&C619,Hg_Min_Tests!$A:$AZ,6,FALSE)","v":"Columbia"},8023,"1","Unit 1","Mercury",6.6900000000000003E-6,"lb/MMBtu",6.9019312214128423E-5,"lb/MW","Part II","COL-1-Stack-Metals-20050810",342]
[{"$f":"VLOOKUP(B620&\"_\"&C620,Hg_Min_Tests!$A:$AZ,6,FALSE)","v":"Columbia"},8023,"1","Unit 1","Mercury",6.9857000000000001E-3,"lb/MMBtu",7.206998644756904E-2,"lb/MW","Part II","COL1-Hg-20071023",342]
[{"$f":"VLOOKUP(B621&\"_\"&C621,Hg_Min_Tests!$A:$AZ,6,FALSE)","v":"Pulliam"},4072,"8","8","Mercury",6.3125000000000001E-6,"lb/MMBtu",6.9121646120377082E-5,"lb/MW","ETTS","",343]
[{"$f":"VLOOKUP(B622&\"_\"&C622,Hg_Min_Tests!$A:$AZ,6,FALSE)","v":"Pulliam"},4072,"8","8","Mercury",6.7933333333333324E-6,"lb/MMBtu",7.4386753686246065E-5,"lb/MW","Part II","P8 Hg 2006",343]
[{"$f":"VLOOKUP(B623&\"_\"&C623,Hg_Min_Tests!$A:$AZ,6,FALSE)","v":"Jefferies"},3319,"3","J3","Mercury",6.5152319324950722E-6,"lb/MMBtu",7.0714102681958708E-5,"lb/MW","Part II","J3LME2008",344]
[{"$f":"VLOOKUP(B624&\"_\"&C624,Hg_Min_Tests!$A:$AZ,6,FALSE)","v":"Otto E. Eckert Station"},1831,"EUBoiler2","002","Mercury",5.1900000000000003E-6,"lb/MMBtu",7.1294210526315794E-5,"lb/MW","Part II","Hg-2-7/05",345]
[{"$f":"VLOOKUP(B625&\"_\"&C625,Hg_Min_Tests!$A:$AZ,6,FALSE)","v":"Ottumwa"},6254,"1","Unit 1","Mercury",6.8399999999999997E-6,"lb/MMBtu",7.143066265847601E-5,"lb/MW","Part II","OGS1-Metals-20060615",346]
[{"$f":"VLOOKUP(B626&\"_\"&C626,Hg_Min_Tests!$A:$AZ,6,FALSE)","v":"Ottumwa"},6254,"1","Unit 1","Mercury",7.0400000000000004E-6,"lb/MMBtu",7.3519278525682917E-5,"lb/MW","Part II","OGS1-Hg-20070726",346]
[{"$f":"VLOOKUP(B627&\"_\"&C627,Hg_Min_Tests!$A:$AZ,6,FALSE)","v":"Ottumwa"},6254,"1","Unit 1","Mercury",7.3200000000000002E-6,"lb/MMBtu",7.6443340739772579E-5,"lb/MW","Part II","OGS1-Hg-20061012",346]
[{"$f":"VLOOKUP(B628&\"_\"&C628,Hg_Min_Tests!$A:$AZ,6,FALSE)","v":"RS Nelson"},1393,"6","001","Mercury",7.2666407084090982E-6,"lb/MMBtu",7.2177788139904858E-5,"lb/MW","ERT","",347]
[{"$f":"VLOOKUP(B629&\"_\"&C629,Hg_Min_Tests!$A:$AZ,6,FALSE)","v":"GRDA"},165,"1","1","Mercury",7.6151583200111156E-6,"lb/MMBtu",7.2358106185142656E-5,"lb/MW","Part II","Unit 1 Hg RATA",348]
[{"$f":"VLOOKUP(B630&\"_\"&C630,Hg_Min_Tests!$A:$AZ,6,FALSE)","v":"Wygen 2"},56319,"0001","WYG2Cfg","Mercury",5.3633333333333334E-6,"lb/MMBtu",7.2628472222222219E-5,"lb/MW","CEMS","",349]
[{"$f":"VLOOKUP(B631&\"_\"&C631,Hg_Min_Tests!$A:$AZ,6,FALSE)","v":"Wygen 2"},56319,"0001","WYG2Cfg","Mercury",5.913333333333334E-6,"lb/MMBtu",8.0076388888888889E-5,"lb/MW","ETTS","",349]
[{"$f":"VLOOKUP(B632&\"_\"&C632,Hg_Min_Tests!$A:$AZ,6,FALSE)","v":"Hoot Lake"},1943,"002","2","Mercury",5.9106752847536981E-6,"lb/MMBtu",7.2758757376737454E-5,"lb/MW","ERT","",350]
[{"$f":"VLOOKUP(B633&\"_\"&C633,Hg_Min_Tests!$A:$AZ,6,FALSE)","v":"Louisa"},6664,"101","101","Mercury",6.9049068737298125E-6,"lb/MMBtu",7.3972567551609824E-5,"lb/MW","ERT","",351]
[{"$f":"VLOOKUP(B634&\"_\"&C634,Hg_Min_Tests!$A:$AZ,6,FALSE)","v":"GRDA"},165,"2","2","Mercury",8.3082314880504681E-6,"lb/MMBtu",7.5862748208129784E-5,"lb/MW","Part II","Unit 2 Hg RATA",352]
[{"$f":"VLOOKUP(B635&\"_\"&C635,Hg_Min_Tests!$A:$AZ,6,FALSE)","v":"Albright Power Station"},3942,"2","Unit_2","Mercury",9.5833333333333336E-6,"lb/MMBtu",7.6075102880658439E-5,"lb/MW","ETTS","",353]
[{"$f":"VLOOKUP(B636&\"_\"&C636,Hg_Min_Tests!$A:$AZ,6,FALSE)","v":"Avon Lake"},2836,"12","AL12-2","Mercury",8.2662209390670126E-6,"lb/MMBtu",8.0000000000000007E-5,"lb/MW","Part II","AL-HG-12-806",354]
[{"$f":"VLOOKUP(B637&\"_\"&C637,Hg_Min_Tests!$A:$AZ,6,FALSE)","v":"Otto E. Eckert Station"},1831,"EUBoiler3","003","Mercury",6.2299999999999996E-6,"lb/MMBtu",8.1301499999999994E-5,"lb/MW","Part II","Hg-3-7/05",355]
[{"$f":"VLOOKUP(B638&\"_\"&C638,Hg_Min_Tests!$A:$AZ,6,FALSE)","v":"Arapahoe"},465,"4","Unit 4","Mercury",5.6900000000000006E-6,"lb/MMBtu",8.2427847457627133E-5,"lb/MW","Part II","ARA4 Hg Sep05",356]
[{"$f":"VLOOKUP(B639&\"_\"&C639,Hg_Min_Tests!$A:$AZ,6,FALSE)","v":"Weston"},4078,"2","W2","Mercury",7.3999999999999995E-6,"lb/MMBtu",8.323959505061865E-5,"lb/MW","Part II","W2 Hg 2006",357]
[{"$f":"VLOOKUP(B640&\"_\"&C640,Hg_Min_Tests!$A:$AZ,6,FALSE)","v":"State Line"},981,"3","Unit 3","Mercury",7.7032833333333329E-6,"lb/MMBtu",8.4878770061728396E-5,"lb/MW","ETTS","",358]
[{"$f":"VLOOKUP(B641&\"_\"&C641,Hg_Min_Tests!$A:$AZ,6,FALSE)","v":"Montrose"},2080,"2","2","Mercury",7.5650000000000004E-6,"lb/MMBtu",8.5709840425531931E-5,"lb/MW","Part II","M2-3Oct2006",359]
[{"$f":"VLOOKUP(B642&\"_\"&C642,Hg_Min_Tests!$A:$AZ,6,FALSE)","v":"Montrose"},2080,"2","2","Mercury",1.114E-5,"lb/MMBtu",1.2621382978723406E-4,"lb/MW","Part II","Mon2-3Oct-Nov2005",359]
[{"$f":"VLOOKUP(B643&\"_\"&C643,Hg_Min_Tests!$A:$AZ,6,FALSE)","v":"Whelan Energy Center Unit 1 (WEC1)"},60,"1","1","Mercury",8.7666666666666669E-6,"lb/MMBtu",8.8620933014354079E-5,"lb/MW","ETTS","",360]
[{"$f":"VLOOKUP(B644&\"_\"&C644,Hg_Min_Tests!$A:$AZ,6,FALSE)","v":"Weston"},4078,"1","W1","Mercury",6.7000000000000002E-6,"lb/MMBtu",9.0386792452830188E-5,"lb/MW","Part II","W1 Hg 2006",361]
[{"$f":"VLOOKUP(B645&\"_\"&C645,Hg_Min_Tests!$A:$AZ,6,FALSE)","v":"Sunbury Generation LP"},3152,"1A","Boiler 1A","Mercury",6.8971458943690864E-6,"lb/MMBtu",9.0525039863594256E-5,"lb/MW","Part II","Hg_051607",362]
[{"$f":"VLOOKUP(B646&\"_\"&C646,Hg_Min_Tests!$A:$AZ,6,FALSE)","v":"Sunbury Generation LP"},3152,"1A","Boiler 1A","Mercury",2.6071830782556723E-5,"lb/MMBtu",3.4219277902105698E-4,"lb/MW","Part II","Hg_051507",362]
[{"$f":"VLOOKUP(B647&\"_\"&C647,Hg_Min_Tests!$A:$AZ,6,FALSE)","v":"Sunbury Generation LP"},3152,"1B","Boiler1B","Mercury",6.8971458943690864E-6,"lb/MMBtu",9.0525039863594256E-5,"lb/MW","Part II","Hg_051607",363]
[{"$f":"VLOOKUP(B648&\"_\"&C648,Hg_Min_Tests!$A:$AZ,6,FALSE)","v":"Sunbury Generation LP"},3152,"1B","Boiler1B","Mercury",2.6071830782556723E-5,"lb/MMBtu",3.4219277902105698E-4,"lb/MW","Part II","Hg_051507",363]
[{"$f":"VLOOKUP(B649&\"_\"&C649,Hg_Min_Tests!$A:$AZ,6,FALSE)","v":"Montrose"},2080,"3","3","Mercury",7.5650000000000004E-6,"lb/MMBtu",9.0538563829787241E-5,"lb/MW","Part II","M2-3Oct2006",364]
[{"$f":"VLOOKUP(B650&\"_\"&C650,Hg_Min_Tests!$A:$AZ,6,FALSE)","v":"Montrose"},2080,"3","3","Mercury",1.114E-5,"lb/MMBtu",1.3332446808510639E-4,"lb/MW","Part II","Mon2-3Oct-Nov2005",364]
[{"$f":"VLOOKUP(B651&\"_\"&C651,Hg_Min_Tests!$A:$AZ,6,FALSE)","v":"Burlington"},1104,"1","Unit 1","Mercury",9.0799999999999995E-6,"lb/MMBtu",9.5416658805773019E-5,"lb/MW","Part II","BGS1-Metals-Stack-2006517",365]
[{"$f":"VLOOKUP(B652&\"_\"&C652,Hg_Min_Tests!$A:$AZ,6,FALSE)","v":"Burlington"},1104,"1","Unit 1","Mercury",3.6189999999999998E-3,"lb/MMBtu",3.8030053768512401E-2,"lb/MW","Part II","BGS-Hg-20071010",365]
[{"$f":"VLOOKUP(B653&\"_\"&C653,Hg_Min_Tests!$A:$AZ,6,FALSE)","v":"Sunbury Generation LP"},3152,"2A","Boiler 2A","Mercury",7.3363225411259757E-6,"lb/MMBtu",9.6289233352278431E-5,"lb/MW","Part II","Hg_0127092A",366]
[{"$f":"VLOOKUP(B654&\"_\"&C654,Hg_Min_Tests!$A:$AZ,6,FALSE)","v":"Sunbury Generation LP"},3152,"2A","Boiler 2A","Mercury",2.8720929160206945E-5,"lb/MMBtu",3.7696219522771615E-4,"lb/MW","Part II","Hg_041907",366]
[{"$f":"VLOOKUP(B655&\"_\"&C655,Hg_Min_Tests!$A:$AZ,6,FALSE)","v":"Sunbury Generation LP"},3152,"2A","Boiler 2A","Mercury",4.2176583726894462E-5,"lb/MMBtu",5.535676614154898E-4,"lb/MW","Part II","Hg_0117092A",366]
[{"$f":"VLOOKUP(B656&\"_\"&C656,Hg_Min_Tests!$A:$AZ,6,FALSE)","v":"Pulliam"},4072,"7","7","Mercury",8.5733333333333331E-6,"lb/MMBtu",9.7659749144811853E-5,"lb/MW","Part II","P7 Hg 2006",367]
[{"$f":"VLOOKUP(B657&\"_\"&C657,Hg_Min_Tests!$A:$AZ,6,FALSE)","v":"Sixth Street"},1058,"2","Unit 2","Mercury",4.3000000000000003E-6,"lb/MMBtu",9.8285714285714301E-5,"lb/MW","Part II","SXTH2-Hg-20060406",368]
[{"$f":"VLOOKUP(B658&\"_\"&C658,Hg_Min_Tests!$A:$AZ,6,FALSE)","v":"Fair Station"},1218,"1","U1","Mercury",7.3000000000000004E-6,"lb/MMBtu",9.8326530612244904E-5,"lb/MW","Part II","MERC09U1",369]
[{"$f":"VLOOKUP(B659&\"_\"&C659,Hg_Min_Tests!$A:$AZ,6,FALSE)","v":"Fair Station"},1218,"1","U1","Mercury",7.7000000000000008E-6,"lb/MMBtu",1.0371428571428573E-4,"lb/MW","Part II","MET05U1",369]
[{"$f":"VLOOKUP(B660&\"_\"&C660,Hg_Min_Tests!$A:$AZ,6,FALSE)","v":"Fair Station"},1218,"1","U1","Mercury",9.0000000000000002E-6,"lb/MMBtu",1.2122448979591837E-4,"lb/MW","Part II","MACT06U1",369]
[{"$f":"VLOOKUP(B661&\"_\"&C661,Hg_Min_Tests!$A:$AZ,6,FALSE)","v":"Pulliam"},4072,"6","6","Mercury",8.6066666666666667E-6,"lb/MMBtu",1.0218227046585255E-4,"lb/MW","Part II","P6 Hg 2006",370]
[{"$f":"VLOOKUP(B662&\"_\"&C662,Hg_Min_Tests!$A:$AZ,6,FALSE)","v":"Richard Gorsuch"},7253,"3","UNIT3","Mercury",1.0053333333333334E-5,"lb/MMBtu",1.0430569105691057E-4,"lb/MW","ETTS","",371]
[{"$f":"VLOOKUP(B663&\"_\"&C663,Hg_Min_Tests!$A:$AZ,6,FALSE)","v":"Gorgas"},8,"10","Unit 10","Mercury",1.1512877059745476E-5,"lb/MMBtu",1.0431616428438859E-4,"lb/MW","Part II","UNITS 8-10 FGD PERFORMANCE TESTING Part 2",372]
[{"$f":"VLOOKUP(B664&\"_\"&C664,Hg_Min_Tests!$A:$AZ,6,FALSE)","v":"Montrose"},2080,"1","1","Mercury",9.1679999999999993E-6,"lb/MMBtu",1.0435914893617021E-4,"lb/MW","Part II","M1Oct2006",373]
[{"$f":"VLOOKUP(B665&\"_\"&C665,Hg_Min_Tests!$A:$AZ,6,FALSE)","v":"Montrose"},2080,"1","1","Mercury",1.2689E-5,"lb/MMBtu",1.4443861702127659E-4,"lb/MW","Part II","M1OctNov-2005",373]
[{"$f":"VLOOKUP(B666&\"_\"&C666,Hg_Min_Tests!$A:$AZ,6,FALSE)","v":"Gorgas"},8,"8","Unit 8","Mercury",1.1512877059745476E-5,"lb/MMBtu",1.053196184285436E-4,"lb/MW","Part II","UNITS 8-10 FGD PERFORMANCE TESTING Part 2",374]
[{"$f":"VLOOKUP(B667&\"_\"&C667,Hg_Min_Tests!$A:$AZ,6,FALSE)","v":"Gorgas"},8,"9","Unit 9","Mercury",1.1512877059745476E-5,"lb/MMBtu",1.0819769188603915E-4,"lb/MW","Part II","UNITS 8-10 FGD PERFORMANCE TESTING Part 2",375]
[{"$f":"VLOOKUP(B668&\"_\"&C668,Hg_Min_Tests!$A:$AZ,6,FALSE)","v":"Pulliam"},4072,"5","5","Mercury",8.6066666666666667E-6,"lb/MMBtu",1.1121424575797129E-4,"lb/MW","Part II","P5 Hg 2006",376]
[{"$f":"VLOOKUP(B669&\"_\"&C669,Hg_Min_Tests!$A:$AZ,6,FALSE)","v":"Albright Power Station"},3942,"1","Unit_1","Mercury",1.1466666666666668E-5,"lb/MMBtu",1.1126913580246916E-4,"lb/MW","ETTS","",377]
[{"$f":"VLOOKUP(B670&\"_\"&C670,Hg_Min_Tests!$A:$AZ,6,FALSE)","v":"Conesville"},2840,"3","CV-3","Mercury",1.1625365328666668E-5,"lb/MMBtu",1.3119048631501416E-4,"lb/MW","ETTS","",378]
[{"$f":"VLOOKUP(B671&\"_\"&C671,Hg_Min_Tests!$A:$AZ,6,FALSE)","v":"O H Hutchings"},2848,"H-5","H-5","Mercury",1.395E-5,"lb/MMBtu",1.4193571428571428E-4,"lb/MW","Part II","2009 H-5 EF trail baseline metals",379]
[{"$f":"VLOOKUP(B672&\"_\"&C672,Hg_Min_Tests!$A:$AZ,6,FALSE)","v":"Riverbend"},2732,"7","7","Mercury",1.5445798474299997E-5,"lb/MMBtu",1.6439297069631854E-4,"lb/MW","ETTS","",380]
[{"$f":"VLOOKUP(B673&\"_\"&C673,Hg_Min_Tests!$A:$AZ,6,FALSE)","v":"New Castle Plant"},3138,"3","NC3-2","Mercury",1.6059999999999999E-5,"lb/MMBtu",1.6797448979591836E-4,"lb/MW","Part II","nc-52",381]
[{"$f":"VLOOKUP(B674&\"_\"&C674,Hg_Min_Tests!$A:$AZ,6,FALSE)","v":"Shawville"},3131,"3","SHAW3-2","Mercury",2.9938700257454531E-5,"lb/MMBtu",2.8569163969081608E-4,"lb/MW","ERT","",382]
[{"$f":"VLOOKUP(B675&\"_\"&C675,Hg_Min_Tests!$A:$AZ,6,FALSE)","v":"Shawville"},3131,"4","SHAW4-2","Mercury",2.9938700257454531E-5,"lb/MMBtu",2.8569163969081608E-4,"lb/MW","ERT","",383]
[{"$f":"VLOOKUP(B676&\"_\"&C676,Hg_Min_Tests!$A:$AZ,6,FALSE)","v":"Sunbury Generation LP"},3152,"2B","Boiler 2B","Mercury",2.8720929160206945E-5,"lb/MMBtu",3.7696219522771615E-4,"lb/MW","Part II","Hg_041907",384]

{"sheet":"SourceAchievingNewSourceLimit","index":2,"n_rows":107,"n_cols":16,"rows_kept":107,"cut":false,"hidden":false,"merged":[]}
[]
[]
[]
[]
[]
[]
[]
[]
[]
[]
[4,{"$f":"COUNTIF(D11:D107,A11)","v":3},null,4,5.0036363636363635E-5,"Fluidized bed firing","Selective Noncatalytic Reduction","Fabric Filter, shake and deflate","","","",null,null,null,29,4]
[7,{"$f":"COUNTIF(D12:D108,A12)","v":2},null,4,5.6290909090909097E-5,"Fluidized bed firing","Selective Noncatalytic Reduction","Fabric Filter, shake and deflate","","","",null,null,null,43,4]
[8,3,null,4,9.2442181818181815E-5,"Fluidized bed firing","Selective Noncatalytic Reduction","Fabric Filter, shake and deflate","","","",null,null,null,69,4]
[9,3,null,7,6.4428620055384655E-5,"Tangential firing","Selective Catalytic Reduction","Selective Noncatalytic Reduction","Activated carbon injection","Dry FGD - Circulating Dry Scrubber","Fabric Filter, pulse",null,null,null,4,3]
[10,1,null,7,7.6565344871122566E-4,"Tangential firing","Selective Catalytic Reduction","Selective Noncatalytic Reduction","Activated carbon injection","Dry FGD - Circulating Dry Scrubber","Fabric Filter, pulse",null,null,null,8,3]
[12,1,null,8,6.7299145299145295E-5,"Fluidized bed firing","Selective Noncatalytic Reduction","Fabric Filter, pulse","","","",null,null,null,9,3]
[13,2,null,8,4.027350427350427E-4,"Fluidized bed firing","Selective Noncatalytic Reduction","Fabric Filter, pulse","","","",null,null,null,14,3]
[14,3,null,8,5.8643874643874642E-4,"Fluidized bed firing","Selective Noncatalytic Reduction","Fabric Filter, pulse","","","",null,null,null,15,3]
[15,3,null,9,6.7299145299145295E-5,"Fluidized bed firing","Selective Noncatalytic Reduction","Fabric Filter, pulse","","","",null,null,null,35,3]
[16,1,null,9,4.027350427350427E-4,"Fluidized bed firing","Selective Noncatalytic Reduction","Fabric Filter, pulse","","","",null,null,null,53,3]
[17,1,null,9,5.8643874643874642E-4,"Fluidized bed firing","Selective Noncatalytic Reduction","Fabric Filter, pulse","","","",null,null,null,54,3]
[18,1,null,10,6.7844322344322346E-5,"Wall firing - front firing","Dry FGD - Spray Dryer","Fabric Filter, reverse air","","","",null,null,null,62,3]
[22,1,null,12,8.2876470588235288E-5,"Tangential firing","Selective Catalytic Reduction","Dry FGD - Spray Dryer","Fabric Filter, pulse","","",null,null,null,71,3]
[24,1,null,13,9.8467603305785135E-5,"Fluidized bed firing","Selective Noncatalytic Reduction","Fabric Filter, pulse","","",""]
[25,1,null,13,1.2191256830601093E-3,"Fluidized bed firing","Selective Noncatalytic Reduction","Fabric Filter, pulse","","",""]
[26,2,null,14,1.0116346153846155E-4,"Fluidized bed firing","Dry FGD - Circulating Dry Scrubber","Fabric Filter, pulse","","",""]
[27,1,null,14,1.1850576923076924E-4,"Fluidized bed firing","Dry FGD - Circulating Dry Scrubber","Fabric Filter, pulse","","",""]
[28,1,null,14,1.329576923076923E-4,"Fluidized bed firing","Dry FGD - Circulating Dry Scrubber","Fabric Filter, pulse","","",""]
[29,4,null,15,1.0116346153846155E-4,"Fluidized bed firing","Dry FGD - Circulating Dry Scrubber","Fabric Filter, pulse","","",""]
[30,1,null,15,1.1850576923076924E-4,"Fluidized bed firing","Dry FGD - Circulating Dry Scrubber","Fabric Filter, pulse","","",""]
[32,2,null,15,1.329576923076923E-4,"Fluidized bed firing","Dry FGD - Circulating Dry Scrubber","Fabric Filter, pulse","","",""]
[34,1,null,16,1.1784464575962368E-4,"Fluidized bed firing","Selective Noncatalytic Reduction","Fabric Filter, unspecified","","",""]
[35,3,null,17,1.2051199999999999E-4,"Wall firing - front firing","Selective Noncatalytic Reduction","Dry FGD - Spray Dryer","Fabric Filter, pulse","",""]
[37,1,null,18,1.2087445078235599E-4,"Fluidized bed firing","Selective Noncatalytic Reduction","Fabric Filter, unspecified","","",""]
[38,1,null,22,1.603383839460394E-4,"Tangential firing","Selective Catalytic Reduction","Dry FGD - Spray Dryer","Fabric Filter, reverse air","",""]
[43,4,null,24,1.8791822222222223E-4,"Wall firing - front firing","Selective Catalytic Reduction","Dry FGD - Spray Dryer","Fabric Filter, reverse air","",""]
[44,1,null,25,2.1972162162162159E-4,"Wall firing - front firing","Fabric Filter, pulse","Wet FGD - Venturi Type","","",""]
[47,2,null,26,2.198911786231884E-4,"Fluidized bed firing","Dry FGD - Circulating Dry Scrubber","Selective Noncatalytic Reduction","Fabric Filter, pulse","",""]
[48,1,null,26,5.6179775280898871E-4,"Fluidized bed firing","Dry FGD - Circulating Dry Scrubber","Selective Noncatalytic Reduction","Fabric Filter, pulse","",""]
[49,1,null,27,2.311102051878654E-4,"Tangential firing","Fabric Filter, reverse air","Wet FGD - Spray Type","","",""]
[50,1,null,28,2.3267222222222224E-4,"Wall firing - front firing","Fabric Filter, pulse","","","",""]
[51,1,null,29,2.3712772277227726E-4,"Fluidized bed firing","Selective Noncatalytic Reduction","Fabric Filter, pulse","","",""]
[52,1,null,29,2.0368663366336632E-3,"Fluidized bed firing","Selective Noncatalytic Reduction","Fabric Filter, pulse","","",""]
[53,3,null,29,2.3003415841584161E-3,"Fluidized bed firing","Selective Noncatalytic Reduction","Fabric Filter, pulse","","",""]
[54,3,null,29,2.6820429042904285E-3,"Fluidized bed firing","Selective Noncatalytic Reduction","Fabric Filter, pulse","","",""]
[56,1,null,30,2.523629629629629E-4,"Wall firing - front firing","Fabric Filter, pulse","","","",""]
[59,1,null,32,2.6655677097505662E-4,"Tangential firing","Selective Catalytic Reduction","Dry FGD - Spray Dryer","Fabric Filter, unspecified","",""]
[60,1,null,32,6.4887218481466465E-4,"Tangential firing","Selective Catalytic Reduction","Dry FGD - Spray Dryer","Fabric Filter, unspecified","",""]
[61,1,null,34,3.0619060253623187E-4,"Fluidized bed firing","Dry FGD - Circulating Dry Scrubber","Selective Noncatalytic Reduction","Fabric Filter, pulse",""]
[62,3,null,35,3.1935033834175087E-4,"Wall firing - front firing","Dry FGD - Spray Dryer","Fabric Filter, reverse air","",""]
[63,1,null,35,1.2454298405689874E-3,"Wall firing - front firing","Dry FGD - Spray Dryer","Fabric Filter, reverse air","",""]
[65,2,null,35,1.8201212121212122E-3,"Wall firing - front firing","Dry FGD - Spray Dryer","Fabric Filter, reverse air","",""]
[67,1,null,37,3.2888933333333323E-4,"Wall firing - front firing","Selective Catalytic Reduction","Dry FGD - Spray Dryer","Fabric Filter, reverse air",""]
[69,4,null,38,3.303222222222222E-4,"Wall firing - front firing","Fabric Filter, pulse","","",""]
[71,3,null,43,4.1657772972972972E-4,"Wall firing - unspecified","Fabric Filter, unspecified","","",""]
[72,1,null,43,4.2789074505645273E-4,"Wall firing - unspecified","Fabric Filter, unspecified","","",""]
[73,1,null,43,6.9035135135135141E-4,"Wall firing - unspecified","Fabric Filter, unspecified","","",""]
[74,1,null,43,2.2682972972972973E-3,"Wall firing - unspecified","Fabric Filter, unspecified","","",""]
[76,1,null,44,4.5489690721649484E-4,"Fluidized bed firing","Selective Noncatalytic Reduction","Selective Noncatalytic Reduction","Fabric Filter, pulse","Fabric Filter, pulse"]
[78,1,null,47,4.9571017156862748E-4,"Wall firing - opposed firing","Activated carbon injection","Fabric Filter, pulse","Wet FGD - Spray Type",""]
[81,1,null,47,2.646139705882353E-3,"Wall firing - opposed firing","Activated carbon injection","Fabric Filter, pulse","Wet FGD - Spray Type",""]
[82,1,null,48,5.089493914564575E-4,"Fluidized bed firing","Fabric Filter, pulse","","",""]
[83,1,null,49,5.089493914564575E-4,"Fluidized bed firing","Fabric Filter, pulse","","",""]
[84,1,null,50,5.089493914564575E-4,"Fluidized bed firing","Fabric Filter, pulse","","",""]
[85,1,null,51,5.089493914564575E-4,"Fluidized bed firing","Fabric Filter, pulse","","",""]
[88,1,null,52,5.2993548387096775E-4,"Wall firing - front firing","Selective Catalytic Reduction","Electrostatic precipitator, cold side, w/o flue gas conditioning","Dry FGD - Circulating Dry Scrubber","Fabric Filter, pulse"]
[91,1,null,53,5.3333333333333336E-4,"Fluidized bed firing","Selective Noncatalytic Reduction","Fabric Filter, pulse","",""]
[92,1,null,53,1.0451612903225808E-3,"Fluidized bed firing","Selective Noncatalytic Reduction","Fabric Filter, pulse","",""]
[93,1,null,53,2.3225806451612901E-3,"Fluidized bed firing","Selective Noncatalytic Reduction","Fabric Filter, pulse","",""]
[94,1,null,54,5.3333333333333336E-4,"Fluidized bed firing","Selective Noncatalytic Reduction","Fabric Filter, pulse","",""]
[97,1,null,54,7.7204301075268816E-4,"Fluidized bed firing","Selective Noncatalytic Reduction","Fabric Filter, pulse","",""]
[100,1,null,54,1.6451612903225804E-3,"Fluidized bed firing","Selective Noncatalytic Reduction","Fabric Filter, pulse","",""]
[null,null,null,56,5.6619324934711456E-4,"Tangential firing","Selective Noncatalytic Reduction","Fabric Filter, reverse air","Wet FGD - Spray Type",""]
[null,null,null,59,5.9999999999999995E-4,"Fluidized bed firing","Selective Noncatalytic Reduction","Dry FGD - Unspecified","Fabric Filter, pulse",""]
[null,null,null,60,6.0835387387387393E-4,"Wall firing - front firing","Activated carbon injection","Fabric Filter, pulse","Wet FGD - Spray Type",""]
[null,null,null,61,6.2066666666666661E-4,"Fluidized bed firing","Other (specify): Anhydrous ammonia injection","Dry FGD - Sorbent Injection","Fabric Filter, pulse",""]
[null,null,null,62,6.3585631578947375E-4,"Wall firing - opposed firing","Fabric Filter, pulse","Wet FGD - Spray Type","",""]
[null,null,null,62,7.8233793859649114E-4,"Wall firing - opposed firing","Fabric Filter, pulse","Wet FGD - Spray Type","",""]
[null,null,null,62,1.0079583333333334E-3,"Wall firing - opposed firing","Fabric Filter, pulse","Wet FGD - Spray Type","",""]
[null,null,null,63,7.2495814869522404E-4,"Wall firing - unspecified","Selective Catalytic Reduction","Fabric Filter, pulse","Wet FGD - Spray Type","Wet electrostatic precipitator"]
[null,null,null,65,7.6216216216216221E-4,"Fluidized bed firing","Selective Noncatalytic Reduction","Fabric Filter, pulse","",""]
[null,null,null,65,1.5916666666666668E-3,"Fluidized bed firing","Selective Noncatalytic Reduction","Fabric Filter, pulse","",""]
[null,null,null,67,8.848777777777779E-4,"Wall firing - front firing","Fabric Filter, pulse","","",""]
[null,null,null,69,9.1631100082712998E-4,"Tangential firing","Electrostatic precipitator, cold side, w/o flue gas conditioning","Activated carbon injection","Fabric Filter, pulse",""]
[null,null,null,69,1.1818444995864352E-3,"Tangential firing","Electrostatic precipitator, cold side, w/o flue gas conditioning","Activated carbon injection","Fabric Filter, pulse",""]
[null,null,null,69,1.2377998345740281E-3,"Tangential firing","Electrostatic precipitator, cold side, w/o flue gas conditioning","Activated carbon injection","Fabric Filter, pulse",""]
[null,null,null,69,2.3094292803970229E-3,"Tangential firing","Electrostatic precipitator, cold side, w/o flue gas conditioning","Activated carbon injection","Fabric Filter, pulse",""]
[null,null,null,71,9.9522222222222221E-4,"Wall firing - opposed firing","Fabric Filter, pulse","Wet FGD - Spray Type","",""]
[null,null,null,71,1.0217222222222223E-3,"Wall firing - opposed firing","Fabric Filter, pulse","Wet FGD - Spray Type","",""]
[null,null,null,71,1.9985416666666667E-3,"Wall firing - opposed firing","Fabric Filter, pulse","Wet FGD - Spray Type","",""]
[null,null,null,72,1.2176263219741482E-3,"Wall firing - opposed firing","Selective Catalytic Reduction","Dry sorbent injection","Electrostatic precipitator, unspecified","Wet FGD - Spray Type"]
[null,null,null,73,1.2618645962681559E-3,"Wall firing - opposed firing","Selective Catalytic Reduction","Electrostatic precipitator, cold side, w/o flue gas conditioning","Wet FGD - Spray/Tray Type",""]
[null,null,null,74,1.3114764864864867E-3,"Wall firing - front firing","Activated carbon injection","Fabric Filter, pulse","Wet FGD - Spray Type",""]
[null,null,null,76,1.5122456140350875E-3,"Wall firing - front firing","Dry FGD - Spray Dryer","Dry FGD - Spray Dryer","Fabric Filter, pulse","Fabric Filter, pulse"]
[null,null,null,78,1.5122456140350875E-3,"Wall firing - front firing","Dry FGD - Spray Dryer","Dry FGD - Spray Dryer","Fabric Filter, pulse","Fabric Filter, pulse"]
[null,null,null,81,1.6024054644808747E-3,"Wall firing - opposed firing","Selective Catalytic Reduction","Electrostatic precipitator, cold side, w/o flue gas conditioning","Wet FGD - Spray Type",""]
[null,null,null,82,1.6696950796950796E-3,"Wall firing - unspecified","Electrostatic precipitator, hot side, unspecified","Selective Catalytic Reduction","Activated carbon injection","Dry FGD - Spray Dryer"]
[null,null,null,83,1.6727111111111111E-3,"Tangential firing","Electrostatic precipitator, cold side, unspecified","Activated carbon injection","Fabric Filter, unspecified",""]
[null,null,null,84,1.727207977207977E-3,"Tangential firing","Electrostatic precipitator, cold side, unspecified","Activated carbon injection","Fabric Filter, unspecified",""]
[null,null,null,85,1.7934314009661839E-3,"Wall firing - unspecified","Selective Catalytic Reduction","Electrostatic precipitator, hot side, unspecified","Activated carbon injection","Other (specify): lime injection"]
[null,null,null,88,2.0758044458514427E-3,"Vertical firing","Selective Noncatalytic Reduction","Electrostatic precipitator, cold side, w/ flue gas conditioning","",""]
[null,null,null,91,2.4087072649572648E-3,"Cyclone firing","Selective Catalytic Reduction","Selective Catalytic Reduction","Activated carbon injection","Activated carbon injection"]
[null,null,null,92,2.4087072649572648E-3,"Cyclone firing","Selective Catalytic Reduction","Selective Catalytic Reduction","Activated carbon injection","Activated carbon injection"]
[null,null,null,93,2.4495981651376144E-3,"Tangential firing","Selective Catalytic Reduction","Electrostatic precipitator, cold side, unspecified","Wet FGD - Unspecified",""]
[null,null,null,94,2.5734629861982436E-3,"Tangential firing","Electrostatic precipitator, cold side, w/o flue gas conditioning","Selective Catalytic Reduction","Wet FGD - Tray Type",""]
[null,null,null,97,2.8988332855574336E-3,"Wall firing - opposed firing","Selective Catalytic Reduction","Fabric Filter, pulse","Wet FGD - Spray Type",""]
[null,null,null,100,3.0095238095238096E-3,"Fluidized bed firing","Selective Noncatalytic Reduction","Fabric Filter, unspecified","",""]

{"sheet":"UPL Pooled Template ","index":3,"n_rows":113,"n_cols":12,"rows_kept":113,"cut":false,"hidden":false,"merged":[[0,1,0,11],[37,0,37,3]]}
[null,"Emissions "]
["Runs","527\nNucla\n001"]
[1,5.0036363636363603E-8]
[2,5.62909090909091E-8]
[3,9.244218181818181E-8]
[4]
[5]
[6]
[7]
[8]
[9]
[10]
[11]
[12]
[13]
[14]
[15]
[16]
[17]
[18]
[19]
[20]
[21]
[22]
[23]
[24]
[25]
[26]
[27]
[28]
[29]
[30]
[31]
[32]
[33]
[34]
[35]
["Use for large sample sets and small sample sets that are Normal."]
[]
["Testing Normality","Raw Data"]
["Sample Size",{"$f":"COUNT(B3:L37)","v":3}]
["Kurtosis",{"$f":"KURT(B3:L37)","v":{"$error":"#DIV/0!"}}]
["SE Kurtosis",{"$f":"SQRT((B41^2-1)/((B41-3)*(B41+5)))","v":{"$error":"#DIV/0!"}}]
["Result Kurtosis",{"$f":"IF(ABS(B42/B43)>NORMSINV(1-0.05/2),\"non normal\",\"normal\")","v":{"$error":"#DIV/0!"}}]
["Skewness",{"$f":"SKEW(B3:L37)","v":1.5877301447567105}]
["SE Skewness",{"$f":"SQRT((6*B41*(B41-1))/((B41-2)*(B41+1)*(B41+3)))","v":1.2247448713915889}]
["Result Skewness",{"$f":"IF(ABS(B45/B46)>NORMSINV(1-0.05/2),\"non normal\",\"normal\")","v":"normal"},"Tested for normality in \"UPL_Calc_n=3_Results\"  DATA IS NORMAL"]
[]
[]
["ni = number test runs =",{"$f":"COUNT(B3:B37)","v":3},0,0,0,0,0,0,0,0,0,0]
[]
["Total Number of sources =",{"$f":"COUNTA(B2:L2)","v":1}]
[]
[]
["n =Total # test runs =",{"$f":"SUM(B50:L50)","v":3}]
[]
[]
[]
[]
[null,{"$f":"B55-1","v":2}]
[]
[]
[]
[]
["This step is for QC only:"]
[]
["means",{"$f":"AVERAGE(B3:B37)","v":6.6256484848484844E-8},{"$error":"#DIV/0!"},{"$error":"#DIV/0!"},{"$error":"#DIV/0!"},{"$error":"#DIV/0!"},{"$error":"#DIV/0!"},{"$error":"#DIV/0!"},{"$error":"#DIV/0!"},{"$error":"#DIV/0!"},{"$error":"#DIV/0!"},{"$error":"#DIV/0!"}]
[]
[]
[]
[]
[]
[]
[null,{"$f":"AVERAGE(B3:L37)","v":6.6256484848484844E-8}]
["Mean ="]
[]
[]
[]
["Pooled Variance = ",null,null,{"$f":"VAR(B3:L37)","v":5.2404787905234188E-16}]
[]
[]
[]
[]
[]
["m= number future runs =",1]
[]
[]
["Term1",{"$f":"1/B55+1/B85","v":1.3333333333333333}]
[]
[]
[]
["Term2",{"$f":"D79*B88","v":6.9873050540312244E-16}]
[]
[]
[]
[]
[]
["Squared root Term2",null,{"$f":"SQRT(B92)","v":2.6433511030567288E-8}]
[]
[]
["NOTE: the pvalue for the t-statistic is calculated as: 2*alpha, where 1-alpha is desired confidence, so if 99% confidence is desired then alpha=0.01 and 2*alpha=2*(0.01)"]
[]
[]
["t-statistic","= quantile t-distribution with df degrees of freedom at .99 confidence level =",null,null,null,null,null,{"$f":"TINV(2*0.01,B60)","v":6.9645567342832733}]
[]
[]
["UPL  POOLED VARIANCE = ",null,null,null,null,{"$f":"B74+H104*C98","v":2.5035417210717345E-7},"lb/MWh"]
[]
[null,null,null,null,null,{"$f":"F107*1000","v":2.5035417210717345E-4},"lb/GWh"]
[]
[null,null,null,null,"3 x RDL =",3.0000000000000001E-3,"lb/GWh"]
[]
[null,null,null,null,"Revised Floor after Reconsideration =",{"$f":"IF(F111<F109,F109,F111)","v":3.0000000000000001E-3},"lb/GWh"]

{"sheet":"UPL_Calc_n=3_Results","index":4,"n_rows":173,"n_cols":12,"rows_kept":173,"cut":false,"hidden":false,"merged":[[149,0,149,9],[0,1,0,11],[40,0,40,4],[43,0,43,4],[84,4,84,14],[85,4,85,14],[151,0,151,7],[153,0,153,7],[158,1,158,2],[159,1,159,6],[163,1,163,3]]}
[null,"Emissions (lb/MWh)"]
["tests","527\nNucla\n001"]
[1,5.0036363636363603E-8]
[2,5.62909090909091E-8]
[3,9.244218181818181E-8]
[4]
[5]
[6]
[7]
[]
[9]
[10]
[11]
[12]
[13]
[14]
[15]
[16]
[17]
[18]
[19]
[20]
[21]
[22]
[23]
[24]
[25]
[26]
[27]
[28]
[29]
[30]
[31]
[32]
[33]
[34]
[35]
[]
["n for each source",{"$f":"COUNT(B3:B37)","v":3},{"$f":"COUNT(C3:C37)","v":0},0,0,0,0,0,0,0,0,0]
["Sample size",{"$f":"SUM(B39:L39)","v":3}]
["If sample size is less than 4 test tests use the kurtosis calculation section below "]
["NOTE: Sample size is the number of test tests used to calculate the average"]
[]
["KURTOSIS CALCULATIONS WHEN TOTAL NUMBER TEST tests IS LESS THAN 4"]
["Average",{"$f":"AVERAGE(B3:L37)","v":6.6256484848484844E-8}]
["Standard Deviation",{"$f":"STDEV(B3:L37)","v":2.2892092063687448E-8}]
[1,{"$f":"((B3-$B$45)/($B$46))^4","v":0.25204288733447167}]
[2,{"$f":"((B4-$B$45)/($B$46))^4","v":3.5914319725767252E-2}]
[3,{"$f":"((B5-$B$45)/($B$46))^4","v":1.7120427929397601}]
[4]
[5]
[6]
[7]
[8]
[9]
[10]
[11]
[12]
[13]
[14]
[15]
[16]
[17]
[18]
[19]
[20]
[21]
[22]
[23]
[24]
[25]
[26]
[27]
[28]
[29]
[30]
[31]
[32]
[33]
[34]
[35]
[]
["Testing Normality","Raw Data"]
["Sample Size",{"$f":"COUNT(B3:L37)","v":3}]
["Kurtosis",{"$f":"SUM(B47:L81)/($B$84-1)-3","v":-2.0000000000000004},null,null,"### Make sure that kurtosis and skewness are copied in \"Calculations for Template n<3\", in cells H14 and H12 respectively"]
["SE Kurtosis",{"$f":"SQRT(24/B84)","v":2.8284271247461903},null,null,"### Using approximate kurtosis variance equal to 24/n"]
["Result Kurtosis",{"$f":"IF(ABS(B85/B86)>NORMSINV(1-0.05/2),\"non normal\",\"normal\")","v":"normal"}]
["Skewness",{"$f":"SKEW(B3:L37)","v":1.5877301447567105}]
["SE Skewness",{"$f":"SQRT((6*B84*(B84-1))/((B84-2)*(B84+1)*(B84+3)))","v":1.2247448713915889},null,"RESULT"]
["Result Skewness",{"$f":"IF(ABS(B88/B89)>NORMSINV(1-0.05/2),\"non normal\",\"normal\")","v":"normal"},null,{"$f":"IF(AND(B87=\"normal\", B90=\"normal\"),\"normal\", \"non normal\")","v":"normal"}]
[]
[]
["ni = number test tests =",{"$f":"COUNT(B3:B37)","v":3},{"$f":"COUNT(C3:C37)","v":0},0,0,0,0,0,0,0,0]
[]
["Total Number of sources =",{"$f":"COUNTA(B2:L2)","v":1}]
[]
[]
["n =Total # test tests =",{"$f":"COUNT(B3:L37)","v":3}]
[]
[]
[]
[]
[null,{"$f":"B98-1","v":2}]
[]
[]
[]
[]
["This step is for QC only:"]
[]
["means",{"$f":"AVERAGE(B3:B37)","v":6.6256484848484844E-8},{"$f":"AVERAGE(C3:C37)","v":{"$error":"#DIV/0!"}},{"$f":"AVERAGE(D3:D37)","v":{"$error":"#DIV/0!"}},{"$error":"#DIV/0!"},{"$error":"#DIV/0!"},{"$error":"#DIV/0!"},{"$error":"#DIV/0!"},{"$error":"#DIV/0!"},{"$error":"#DIV/0!"},{"$error":"#DIV/0!"}]
[]
[]
[]
[]
[]
[]
[null,{"$f":"AVERAGE(B3:L37)","v":6.6256484848484844E-8}]
["Mean ="]
[]
[]
[]
["Pooled Variance = ",null,null,{"$f":"VAR(B3:L37)","v":5.2404787905234188E-16}]
[]
[]
[]
[]
[]
["m= number future tests =",1]
[]
[]
["Term1",{"$f":"1/B98+1/B128","v":1.3333333333333333}]
[]
[]
[]
["Term2",{"$f":"D122*B131","v":6.9873050540312244E-16}]
[]
[]
[]
[]
[]
["Squared root Term2",null,{"$f":"SQRT(B135)","v":2.6433511030567288E-8}]
[]
[]
["NOTE: the pvalue for the t-statistic is calculated as: 2*alpha, where 1-alpha is desired confidence, so if 99% confidence is desired then alpha=0.01 and 2*alpha=2*(0.01)"]
[]
[]
["t-statistic","= quantile t-distribution with df degrees of freedom at .99 confidence level =",null,null,null,null,null,{"$f":"TINV(2*0.01,B103)","v":6.9645567342832733}]
[]
[]
["Adjustment for non-normality (skewness and kurtosis) for any sample size in particular for small samples "]
[]
["a) n = number of tests =",null,null,null,null,null,null,null,null,{"$f":"B98","v":3}]
[]
["b) Calculate u0",null,null,null,null,null,null,null,null,{"$f":"1/(1+$H$147^2/($J$152-1))","v":3.960000000000001E-2}]
[]
[]
[]
[]
[null,"Current Confidence Level is",null,null,{"$f":"(1-'Calculations for Template n=3'!J139)","v":0.96156350179165317}]
["Conclusion",{"$f":"IF( ABS(('Recalculations1 n=3'!J143) -0.01)<0.0001, \"Confidence Level is 99%\",\"Confidence Level is not 99%, Go to Recalculate t-stat n<3 tab to fix the Confidence Level\")","v":"Confidence Level is not 99%, Go to Recalculate t-stat n<3 tab to fix the Confidence Level"}]
[]
[]
[]
[null,"new t-statistic from tab Recalculate t-statistic",null,null,14.114556733963436]
[]
[]
["Adjusted UPL for skewness and kurtosis for all sample size",null,null,null,{"$f":"B117+C141*E164","v":4.3935377596727511E-7},"lb/MWh"]
[]
[null,null,null,null,{"$f":"E167*1000","v":4.393537759672751E-4},"lb/GWh"]
[]
[null,null,null,"3 x RDL =",3.0000000000000001E-3,"lb/GWh"]
[]
[null,null,null,"Revised Floor after Reconsideration =",{"$f":"E171","v":3.0000000000000001E-3},"lb/GWh"]

{"sheet":"Hg_QA_Calcs","index":5,"n_rows":204,"n_cols":110,"rows_kept":204,"cut":false,"hidden":false,"merged":[[8,0,8,4],[8,20,8,26],[8,27,8,35],[8,36,8,43]]}
[null,null,null,null,null,null,null,null,"Anthracite",null,"Anthracite",null,null,"fPM","30B",null,"μg/dscm","No",null,null,{"$f":"1/453592370","v":2.2046226218487758E-9},"lbs/μg",2.8316846592000001E-2,null,null,null,"cm/cf",null,null,null,null,"lb/hr",null,null,"lb/MMBtu",null,null,null,null,null,null,"Round to",null,null,null,"From ",null,"original database export===>"]
[null,null,null,null,null,null,null,null,"Bituminous",null,"Bituminous",null,null,"Se","M5",null,null,"Yes",null,null,{"$f":"U1/1000","v":2.2046226218487757E-12},"lb/mg",null,null,null,null,null,null,null,null,null,null,null,null,null,null,null,null,null,null,null,"Same ",null,null,null,"Min ",null,"original database export===>"]
[null,null,null,null,null,null,null,null,"Lignite",null,"Lignite",null,null,"Pb","M5B",null,null,null,null,null,null,null,null,null,null,null,null,null,null,null,null,null,null,null,null,null,null,null,null,null,null,"Sig Figs ",null,null,null,"Test",null,"original database export===>"]
[null,null,null,null,null,null,null,null,"Oil",null,"Oil",null,null,"Hg","M29",null,null,null,null,null,null,null,null,null,null,null,null,null,null,null,null,null,null,null,null,null,null,null,null,null,null,"as Submitted",null,null,null,"Sheet",null,"original database export===>"]
[null,null,null,null,null,null,null,null,"Pet Coke",null,"Pet Coke",null,null,"HCl","OTM27",null,null,null,null,null,null,null,null,null,null,null,null,null,null,null,null,null,null,null,null,null,null,null,null,null,null,"prior to ",null,null,null,null,null,"original database export===>"]
[null,null,null,null,null,null,null,null,"Subbituminous",null,"Sub Bituminous",null,null,"SO2",null,null,null,null,null,null,null,null,null,null,null,null,null,null,null,null,null,null,null,null,null,null,null,null,null,null,null,"Calc % Diff.",null,null,null,null,null,"original database export===>"]
[null,null,null,null,null,null,null,null,null,null,null,null,null,null,null,null,null,null,null,null,null,null,null,null,null,null,null,null,null,null,null,null,null,null,null,null,null,null,null,null,null,null,null,null,null,null,null,"original database export===>"]
["Part II Data","Part II Data","Part II Data","Part II Data","Part II Data","Part II Data","Part II Data","Part II Data","Part II Data","Part II Data","Part II Data","Part II Data","Part II Data","Part II Data","Part II Data","Part II Data","Part II Data","Part II Data","Part II Data","Part II Data","Part II Data","Part II Data","Part II Data","Part II Data","Part II Data","Part II Data","Part II Data","Part II Data","Part II Data","Part II Data","Part II Data","Part II Data","Part II Data","Part II Data","Part II Data","Part II Data","Part II Data","Part II Data","Part II Data","Part II Data","Part II Data","Part II Data","Part II Data","Part II Data","Part II Data","Part II Data","Part II Data","original database export===>","Part II Data","Part II Data","Part II Data","Part II Data","Part II Data","Part II Data","Part II Data","Part II Data","Part II Data","Part II Data","Part II Data","Part II Data","Part II Data","Part II Data","Part II Data","Part II Data","Part II Data","Part II Data","Part II Data","Part II Data","Part II Data","Part II Data","Part II Data","Part II Data","Part II Data","Part II Data","Part II Data","Part II Data","Part II Data","Part II Data","Part II Data","Part II Data","Part II Data","Part II Data","Part II Data","Part II Data","Part II Data"]
["RTI",null,null,null,null,null,"As Submitted",null,null,null,null,null,null,null,null,null,null,null,null,null,"RTI-QA",null,null,null,null,null,null,"As Submitted",null,null,null,null,null,null,null,null,"RTI-QA",null,null,null,null,null,null,null,"Final for UPL",null,"Final for UPL","original database export===>"]
["Comments","Original Data","Use Run in UPL Calc?","Grade","Key","Facility_Name","Facility_ID","Boiler_ID","Fuel1 Used","Fuel1 Fraction","Fuel2 Used","Fuel2 Fraction","\"Fuel Used/Fraction\" Data Source","Pollutant","Reference Method","Concentration","Concentration UOM","Non-Detect?","MDL","MDL UOM","HAP Conversion Value to lbs","HAP Conversion UOM","Volume Conversion Value to cubic feet","Reserve","Reserve","Reserve","Volume Conversion UOM","Bws (percent)","%O2d","%CO2d","Emission Rate Value","Emission Rate UOM","Emission Rate MDL","Emission Factor Value","Emission Factor UOM","Emission Factor MDL","Fd","Fw","Fc","Calculated conc lb/dscf","19-1\nlb/MMBtu","%diff\n19-1","19-6\nlb/MMBtu","%diff\n19-6","lb/MMBtu Value Used for UPL Calcs","Unit Heat Rate (MMBtu/MWh)","lb/MWh Value Used in UPL Calcs","original database export===>","facility_id","report_id","sampling_port_id","pollutant_id","pollutant_name","run_id","start_datetime","end_datetime","unit_load","fuel_flow_rate","fuel_heating_value","fg_moisture_content","fg_oxygen_content","fg_CO2_content","fg_temperature","test_method","conc","conc_units","conc_ND","conc_MDL","conc2","conc2_units","emission_rate","emission_rate_units","emission_rate_ND","emission_rate_MDL","emission_factor","emission_factor_units","emission_factor_ND","emission_factor_MDL","run_pollutant_comment","Fuel1","Fuel1%Btu","Fuel2","Fuel2%Btu","QA Comment","Questions for EPA"]
["Submittal did not include diluent concentrations for run. Used representative diluent concentrations from Part III submittal to perform QA calculations. QA calculations had excellent agreement with submitted values.","Part II","Yes","A","1_Hg_T2_R1","Nucla",{"$f":"AW11","v":527},"1","Bituminous",1,null,null,"Part II Submittal","Hg","30B",{"$f":"BM11","v":7.0000000000000001E-3},"μg/dscm","No",null,null,{"$f":"1/453592370","v":2.2046226218487758E-9},"lbs/μg",2.8316846592000001E-2,null,null,null,"cm/cf",{"$f":"BH11","v":6.14},null,null,{"$f":"BS11","v":6.9999999999999999E-6},"lb/hr",null,{"$f":"BW11","v":6.9999999999999998E-9},"lb/MMBtu",null,{"$f":"VLOOKUP(I11,$A$101:$J$117,3,FALSE)","v":9780},{"$f":"VLOOKUP(I11,$A$100:$K$117,4,FALSE)","v":10640},{"$f":"VLOOKUP(I11,$A$100:$K$117,5,FALSE)","v":1800},{"$f":"P11*U11*W11","v":4.3699572403301229E-13},{"$f":"IF(AC11<>\"\",AN11*AK11*20.9/(20.9-AC11),\"no O2 data for run\")","v":"no O2 data for run"},null,{"$f":"IF(AD11<>\"\",AN11*AM11*100/AD11,\"no CO2 data for run\")","v":"no CO2 data for run"},null,{"$f":"AH11","v":6.9999999999999998E-9},9.3800000000000008,{"$f":"AS11*AT11","v":6.5660000000000007E-8},"original database export===>",527,"2008 Hg","SP01",13,"Total Mercury (Hgt)","1","2008-12-16T11:30:00","2008-12-16T15:30:00",101,null,9868,6.14,7.3,null,null,"Method 30B, Method 4",7.0000000000000001E-3,"microgram per dry standard cubic meter (μg/dscm)",false,null,null,"",6.9999999999999999E-6,"pound per hour (lb/hr)",false,null,6.9999999999999998E-9,"pound per million British Thermal Unit (lb/MMBtu)",false,null,""]
["Submittal did not include diluent concentrations for run. Used representative diluent concentrations from Part III submittal to perform QA calculations. QA calculations had excellent agreement with submitted values.","Part II","Yes","A","1_Hg_T2_R2","Nucla",{"$f":"AW12","v":527},"1","Bituminous",1,null,null,"Part II Submittal","Hg","30B",{"$f":"BM12","v":6.0000000000000001E-3},"μg/dscm","No",null,null,{"$f":"1/453592370","v":2.2046226218487758E-9},"lbs/μg",2.8316846592000001E-2,null,null,null,"cm/cf",{"$f":"BH12","v":6.12},null,null,{"$f":"BS12","v":6.0000000000000002E-6},"lb/hr",null,{"$f":"BW12","v":6E-9},"lb/MMBtu",null,9780,{"$f":"VLOOKUP(I12,$A$100:$K$117,4,FALSE)","v":10640},{"$f":"VLOOKUP(I12,$A$100:$K$117,5,FALSE)","v":1800},{"$f":"P12*U12*W12","v":3.7456776345686769E-13},{"$f":"IF(AC12<>\"\",AN12*AK12*20.9/(20.9-AC12),\"no O2 data for run\")","v":"no O2 data for run"},null,{"$f":"IF(AD12<>\"\",AN12*AM12*100/AD12,\"no CO2 data for run\")","v":"no CO2 data for run"},null,6E-9,9.3800000000000008,{"$f":"AS12*AT12","v":5.6280000000000005E-8},"original database export===>",527,"2008 Hg","SP01",13,"Total Mercury (Hgt)","2","2008-12-16T16:05:00","2008-12-16T20:05:00",101,null,9868,6.12,7.3,null,null,"Method 30B, Method 4",6.0000000000000001E-3,"microgram per dry standard cubic meter (μg/dscm)",false,null,null,"",6.0000000000000002E-6,"pound per hour (lb/hr)",false,null,6E-9,"pound per million British Thermal Unit (lb/MMBtu)",false,null,""]
["Submittal did not include diluent concentrations for run. Used representative diluent concentrations from Part III submittal to perform QA calculations. QA calculations had excellent agreement with submitted values.","Part II","Yes","A","1_Hg_T2_R3","Nucla",527,"1","Bituminous",1,null,null,"Part II Submittal","Hg","30B",5.0000000000000001E-3,"μg/dscm","No",null,null,2.2046226218487758E-9,"lbs/μg",2.8316846592000001E-2,null,null,null,"cm/cf",5.9,null,null,5.0000000000000004E-6,"lb/hr",null,5.0000000000000001E-9,"lb/MMBtu",null,9780,10640,1800,3.1213980288072308E-13,"no O2 data for run",null,"no CO2 data for run",null,5.0000000000000001E-9,9.3800000000000008,4.6900000000000003E-8,"original database export===>",527,"2008 Hg","SP01",13,"Total Mercury (Hgt)","4","2008-12-17T08:30:00","2008-12-17T12:30:00",101,null,10234,5.9,7.8,null,null,"Method 30B, Method 4",5.0000000000000001E-3,"microgram per dry standard cubic meter (μg/dscm)",false,null,null,"",5.0000000000000004E-6,"pound per hour (lb/hr)",false,null,5.0000000000000001E-9,"pound per million British Thermal Unit (lb/MMBtu)",false,null,""]
["Submittal did not include diluent concentrations for run. Used representative diluent concentrations from Part III submittal to perform QA calculations. QA calculations had excellent agreement with submitted values.","Part II","Yes","A","1_Hg_T3_R1","Nucla",527,"1","Bituminous",1,null,null,"Part II Submittal","Hg","30B",8.0000000000000002E-3,"μg/dscm","No",null,null,2.2046226218487758E-9,"lbs/μg",2.8316846592000001E-2,null,null,null,"cm/cf",6.06,null,null,9.0000000000000002E-6,"lb/hr",null,8.0000000000000005E-9,"lb/MMBtu",null,9780,10640,1800,4.9942368460915685E-13,"no O2 data for run",null,"no CO2 data for run",null,8.0000000000000005E-9,9.3800000000000008,7.5040000000000015E-8,"original database export===>",527,"2009 HG","SP01",13,"Total Mercury (Hgt)","1","2009-06-18T09:05:00","2009-06-18T13:40:00",100,null,11012,6.06,null,null,null,"Method 30B, Method 4",8.0000000000000002E-3,"microgram per dry standard cubic meter (μg/dscm)",false,null,null,"",9.0000000000000002E-6,"pound per hour (lb/hr)",false,null,8.0000000000000005E-9,"pound per million British Thermal Unit (lb/MMBtu)",false,null,""]
["Submittal did not include diluent concentrations for run. Used representative diluent concentrations from Part III submittal to perform QA calculations. QA calculations had excellent agreement with submitted values.","Part II","Yes","A","1_Hg_T3_R2","Nucla",527,"1","Bituminous",1,null,null,"Part II Submittal","Hg","30B",4.0000000000000001E-3,"μg/dscm","No",null,null,2.2046226218487758E-9,"lbs/μg",2.8316846592000001E-2,null,null,null,"cm/cf",6.26,null,null,5.0000000000000004E-6,"lb/hr",null,4.0000000000000002E-9,"lb/MMBtu",null,9780,10640,1800,2.4971184230457843E-13,"no O2 data for run",null,"no CO2 data for run",null,4.0000000000000002E-9,9.3800000000000008,3.7520000000000008E-8,"original database export===>",527,"2009 HG","SP01",13,"Total Mercury (Hgt)","3","2009-06-18T19:00:00","2009-06-18T23:45:00",101,null,11012,6.26,null,null,null,"Method 30B, Method 4",4.0000000000000001E-3,"microgram per dry standard cubic meter (μg/dscm)",false,null,null,"",5.0000000000000004E-6,"pound per hour (lb/hr)",false,null,4.0000000000000002E-9,"pound per million British Thermal Unit (lb/MMBtu)",false,null,""]
["Submittal did not include diluent concentrations for run. Used representative diluent concentrations from Part III submittal to perform QA calculations. QA calculations had excellent agreement with submitted values.","Part II","Yes","A","1_Hg_T3_R3","Nucla",527,"1","Bituminous",1,null,null,"Part II Submittal","Hg","30B",5.0000000000000001E-3,"μg/dscm","No",null,null,2.2046226218487758E-9,"lbs/μg",2.8316846592000001E-2,null,null,null,"cm/cf",5.65,null,null,5.0000000000000004E-6,"lb/hr",null,4.0000000000000002E-9,"lb/MMBtu",null,9780,10640,1800,3.1213980288072308E-13,"no O2 data for run",null,"no CO2 data for run",null,4.0000000000000002E-9,9.3800000000000008,3.7520000000000008E-8,"original database export===>",527,"2009 HG","SP01",13,"Total Mercury (Hgt)","4","2009-06-19T07:40:00","2009-06-19T12:25:00",100,null,11250,5.65,null,null,null,"Method 30B, Method 4",5.0000000000000001E-3,"microgram per dry standard cubic meter (μg/dscm)",false,null,null,"",5.0000000000000004E-6,"pound per hour (lb/hr)",false,null,4.0000000000000002E-9,"pound per million British Thermal Unit (lb/MMBtu)",false,null,""]
["Part III Data","Part III Data","Part III Data","Part III Data","Part III Data","Part III Data","Part III Data","Part III Data","Part III Data","Part III Data","Part III Data","Part III Data","Part III Data","Part III Data","Part III Data","Part III Data","Part III Data","Part III Data","Part III Data","Part III Data","Part III Data","Part III Data","Part III Data","Part III Data","Part III Data","Part III Data","Part III Data","Part III Data","Part III Data","Part III Data","Part III Data","Part III Data","Part III Data","Part III Data","Part III Data","Part III Data","Part III Data","Part III Data","Part III Data","Part III Data","Part III Data","Part III Data","Part III Data","Part III Data","Part III Data","Part III Data","Part III Data","original database export===>","Part III Data","Part III Data","Part III Data","Part III Data","Part III Data","Part III Data","Part III Data","Part III Data","Part III Data","Part III Data","Part III Data","Part III Data","Part III Data","Part III Data","Part III Data","Part III Data","Part III Data","Part III Data","Part III Data","Part III Data","Part III Data","Part III Data","Part III Data","Part III Data","Part III Data","Part III Data","Part III Data","QA Calcs","QA Calcs","QA Calcs","QA Calcs","QA Calcs","Part III Data","QA Calcs","QA Calcs","QA Calcs","QA Calcs","QA Calcs","Part III Data","Part III Data","Part III Data","Part III Data","Part III Data","Part III Data","Part III Data","Part III Data","Part III Data","Part III Data","Part III Data","Part III Data","Part III Data","Part III Data","Part III Data","Part III Data","Part III Data","Part III Data","Part III Data","Part III Data","Part III Data","Part III Data","Part III Data","Part III Data"]
[null,null,null,null,null,null,null,null,null,null,null,null,null,null,null,null,null,null,null,null,null,null,null,null,null,null,null,null,null,null,null,null,null,null,null,null,null,null,null,null,null,{"$f":"((AO18-$AH18)/$AH18)","v":{"$error":"#DIV/0!"}},null,null,null,null,null,"original database export===>","Key","RTI Calculated QA\nlb/MMBtu","Run Grade","Submitted Value","Submitted Value UOM","Use ?","Comment","facility_id","configuration_id","submittal_id","Hg_type","run_number","start_date","end_date","measured_value_Hg","measured_value_Hg0","measured_value_Hg+2","measured_value_HgP","basis","test_method","data_flag","method_comments","emission_rate","steam_output","heat_input","fg_moisture_content","fg_CO2_content","19-6","%Diff\n19-6","Ffactor calculated","19-9","%Diff\n19-9","fg_oxygen_content","19-1","%Diff\n19-1","F factor back calculated","19-5","%Diff\n19-5","fg_flow_rate","fg_temperature","fuel1_input_rate","fuel1_type","fuel1_rate_units","fuel1_method","fuel2_input_rate","fuel2_type","fuel2_rate_units","fuel2_method","fuel3_input_rate","fuel3_type","fuel3_rate_units","fuel3_method","fuel4_input_rate","fuel4_type","fuel4_rate_units","fuel4_method","other_information","exclude_data","Paired Trap RD % (<10%)","Spike Recovery % (bet. 85 and 115%)","QA Comment","Questions for EPA"]
[{"$f":"\"M19-1 QA Calc agrees to within \"& TEXT(VALUE(100%+AP19),\"0.0%\")&\" of submitted value.\"","v":"M19-1 QA Calc agrees to within 96.0% of submitted value."},"ETTS","Yes","A","1_Hg_T1_R1","Nucla",527,null,"Subbituminous",null,null,null,"ETTS","Hg","30B",{"$f":"BK19","v":0.01},"μg/dscm","No",null,null,{"$f":"1/453592370","v":2.2046226218487758E-9},"lbs/μg",2.8316846592000001E-2,null,null,null,"cm/cf",{"$f":"BV19","v":"6.4"},{"$f":"CC19","v":7.3},{"$f":"BW19","v":"12"},null,null,null,{"$f":"BS19","v":9.8099999999999998E-9},"lb/MMBtu",null,{"$f":"VLOOKUP(I19,$A$101:$J$117,3,FALSE)","v":9820},{"$f":"VLOOKUP(I19,$A$100:$K$117,4,FALSE)","v":11295},{"$f":"VLOOKUP(I19,$A$100:$K$117,5,FALSE)","v":1840},{"$f":"P19*U19*W19","v":6.2427960576144616E-13},{"$f":"IF(AC19<>\"\",AN19*AK19*20.9/(20.9-AC19),\"no O2 data for run\")","v":9.4210218917108586E-9},{"$f":"((AO19-$AH19)/$AH19)","v":-3.9651183311839061E-2},{"$f":"IF(AD19<>\"\",AN19*AM19*100/AD19,\"no CO2 data for run\")","v":9.5722872883421749E-9},{"$f":"((AQ19-$AH19)/$AH19)","v":-2.4231672951867983E-2},{"$f":"AH19","v":9.8099999999999998E-9},9.3800000000000008,{"$f":"AS19*AT19","v":9.20178E-8},"original database export===>","1_Hg_T1_R1",9.5637378322486698E-9,"A",9.8099999999999998E-9,"lb/MMBtu","Yes","Can't recalculate their emission factor using concentrations of pollutant and diluents and fuel type provided in spreadsheets. When back calculate the F factor, the F factor values are higher. ",527,"001",1312,"30B","1","2010-05-13T08:22:00","2010-05-13T12:42:00",0.01,"","","","Dry","U.S. EPA Method 30B","ADL","",9.8099999999999998E-9,"","","6.4","12",9.5637378322486698E-9,2.5103177140808366E-2,1887.3792147600002,8.9516586109847551E-9,8.7496573803796607E-2,7.3,9.4126075377959686E-9,4.0508915617128563E-2,10234.592233148325,8.8102006553770258E-9,0.10191634501763243,"","","","subbituminous","","","","","","","","","","","","","","","",false,2.8708444179205737,95.21]
[{"$f":"\"M19-1 QA Calc agrees to within \"& TEXT(VALUE(100%+AP20),\"0.0%\")&\" of submitted value.\"","v":"M19-1 QA Calc agrees to within 97.6% of submitted value."},"ETTS","Yes","A","1_Hg_T1_R2","Nucla",527,null,"Subbituminous",null,null,null,"ETTS","Hg","30B",{"$f":"BK20","v":0.01},"μg/dscm","No",null,null,{"$f":"1/453592370","v":2.2046226218487758E-9},"lbs/μg",2.8316846592000001E-2,null,null,null,"cm/cf",{"$f":"BV20","v":"6.5"},{"$f":"CC20","v":7.3},{"$f":"BW20","v":"12"},null,null,null,{"$f":"BS20","v":9.6500000000000004E-9},"lb/MMBtu",null,{"$f":"VLOOKUP(I20,$A$101:$J$117,3,FALSE)","v":9820},11295,1840,{"$f":"P20*U20*W20","v":6.2427960576144616E-13},{"$f":"IF(AC20<>\"\",AN20*AK20*20.9/(20.9-AC20),\"no O2 data for run\")","v":9.4210218917108586E-9},{"$f":"((AO20-$AH20)/$AH20)","v":-2.3728301377113133E-2},{"$f":"IF(AD20<>\"\",AN20*AM20*100/AD20,\"no CO2 data for run\")","v":9.5722872883421749E-9},{"$f":"((AQ20-$AH20)/$AH20)","v":-8.0531307417435714E-3},{"$f":"AH20","v":9.6500000000000004E-9},9.3800000000000008,9.0517000000000016E-8,"original database export===>","1_Hg_T1_R2",9.5637378322486698E-9,"A",9.6500000000000004E-9,"lb/MMBtu","Yes","Can't recalculate their emission factor using concentrations of pollutant and diluents and fuel type provided in spreadsheets. When back calculate the F factor, the F factor values are higher. ",527,"001",1312,"30B","2","2010-05-13T14:17:00","2010-05-13T19:17:00",0.01,"","","","Dry","U.S. EPA Method 30B","ADL","",9.6500000000000004E-9,"","","6.5","12",9.5637378322486698E-9,8.9390847410705295E-3,1856.5962714000002,8.942094873152507E-9,7.3358044232900863E-2,7.3,9.4126075377959686E-9,2.4600255150676868E-2,10067.667181435407,8.8007880478392305E-9,8.8001238565882892E-2,"","","","subbituminous","","","","","","","","","","","","","","","",false,1.1049926664999996,98.1]
[{"$f":"\"M19-1 QA Calc agrees to within \"& TEXT(VALUE(100%+AP21),\"0.0%\")&\" of submitted value.\"","v":"M19-1 QA Calc agrees to within 96.8% of submitted value."},"ETTS","Yes","A","1_Hg_T1_R3","Nucla",527,null,"Subbituminous",null,null,null,"ETTS","Hg","30B",0.01,"μg/dscm","No",null,null,2.2046226218487758E-9,"lbs/μg",2.8316846592000001E-2,null,null,null,"cm/cf","5.8",7.8,"11.4",null,null,null,1.0099999999999999E-8,"lb/MMBtu",null,{"$f":"VLOOKUP(I21,$A$101:$J$117,3,FALSE)","v":9820},11295,1840,{"$f":"P21*U21*W21","v":6.2427960576144616E-13},9.7806028799440986E-9,-3.1623477233257508E-2,1.0076091882465447E-8,-2.3671403499557122E-3,1.0099999999999999E-8,9.3800000000000008,9.4737999999999998E-8,"original database export===>","1_Hg_T1_R3",1.00670924549986E-8,"A",1.0099999999999999E-8,"lb/MMBtu","Yes","Can't recalculate their emission factor using concentrations of pollutant and diluents and fuel type provided in spreadsheets. When back calculate the F factor, the F factor values are higher. ",527,"001",1312,"30B","3","2010-05-15T06:51:00","2010-05-15T11:31:00",0.01,"","","","Dry","U.S. EPA Method 30B","ADL","",1.0099999999999999E-8,"","","5.8","11.4",1.00670924549986E-8,3.2581727724157773E-3,1846.0146346200002,9.4832010926086805E-9,6.106919875161574E-2,7.8,9.7718673674828374E-9,3.2488379457144757E-2,10149.748893444976,9.205099060168832E-9,8.860405344863044E-2,"","","","subbituminous","","","","","","","","","","","","","","","",false,4.0113988740970319,94.4]
[]
[]
[]
[null,null,null,null,null,null,null,null,null,null,null,null,null,null,null,null,null,null,null,null,null,null,null,null,null,null,null,null,null,null,null,null,null,null,null,null,null,null,null,null,null,null,null,null,null,null,{"$f":"AVERAGE(AU11:AU13)","v":5.6280000000000005E-8}]
[null,null,null,null,null,null,null,null,null,null,null,null,null,null,null,null,null,null,null,null,null,null,null,null,null,null,null,null,null,null,null,null,null,null,null,null,null,null,null,null,null,null,null,null,null,null,{"$f":"AVERAGE(AU14:AU16)","v":5.0026666666666679E-8}]
[null,null,null,null,null,null,null,null,null,null,null,null,null,null,null,null,null,null,null,null,null,null,null,null,null,null,null,null,null,null,null,null,null,null,null,null,null,null,null,null,null,null,null,null,null,null,{"$f":"AVERAGE(AU19:AU21)","v":9.2424266666666684E-8}]
[]
[]
[]
[]
[]
[]
[]
[]
[]
[]
[]
[]
[]
[]
[]
[]
[]
[]
[]
[]
[]
[]
[]
[]
[]
[]
[]
[]
[]
[]
[]
[]
[]
[]
[]
[]
[]
[]
[]
[]
[]
[]
[]
[]
[]
[]
[]
[]
[]
[]
[]
[]
[]
[]
[]
[]
[]
[]
[]
[]
[]
[]
[]
[]
[]
[]
[]
[]
[]
[]
[]
[]
["Conversions"]
[1,null,"ppm SO2=",1.66E-7,"lb/scf",null,null,null,null,null,null,null,{"$f":"D101/A108","v":2.5913206369029035E-9},{"$f":"1/(M101*1000000)","v":385.90361445783134}]
[1,null,"ppm Hg=",{"$f":"D101*A107/A108","v":5.1979300655635339E-7},"lb/scf",null,null,null,null,null,null,null,{"$f":"D102/A107","v":2.5913206369029035E-9}]
[1000,null,"mg=",1,"g"]
[1000000,null,"ug=",1,"g"]
[454,null,"g=",1,"lb"]
[1,null,"m^3=",35.314500000000002,"ft^3"]
[200.59,null,"Hg molecular weight"]
[64.06,null,"SO2 molecular weight"]
[]
["Table 19-2",null,"Fd","Fw","Fc"]
["Fuel Type",null,"dscf/MMBtu","wscf/MMBtu","scf/MMBtu"]
["Coal"]
["Anthracite",null,10100,10540,1970]
["Lignite",null,9860,11950,1910]
["Subbituminous",null,9820,{"$f":"D114-((D114-D116)*(C114-C115)/(C114-C116))","v":11295},1840]
["Bituminous",null,9780,10640,1800]
["Oil",null,9190,10320,1420]
[]
["QA Calcs"]
["RTI",null,null,null,null,null,"As Submitted",null,null,null,null,null,null,null,null,null,null,null,null,null,"RTI-QA",null,null,null,null,null,null,"Using Available Representative Diluent Per Comment",null,null,null,null,null,null,null,null,"RTI-QA",null,null,null,null,null,null,null,"Final for UPL",null,"Final for UPL","original database export===>","No comparison bc no provided CO2 or O2 concentrations"]
["Comments",null,"Use Run in UPL Calc?","Grade","Key",null,"Facility_ID","Boiler_ID","Fuel1 Used","Fuel1 Fraction","Fuel2 Used","Fuel2 Fraction","\"Fuel Used/Fraction\" Data Source","Pollutant","Reference Method","Concentration","Concentration UOM","Non-Detect?","MDL",null,"Mass Conversion Value to lbs","Mass Conversion UOM","Volume Conversion Value to cubic feet","Reserve","Reserve","Reserve","Volume Conversion UOM","Bws (percent)","%O2d","%CO2d","Emission Rate Value","Emission Rate UOM","Emission Rate MDL","Emission Factor Value","Emission Factor UOM","Emission Factor MDL","Fd","Fw","Fc","Calculated conc lb/dscf","19-1\nlb/MMBtu","%diff\n19-1","19-6\nlb/MMBtu","%diff\n19-6","lb/MMBtu Value Used for UPL Calcs","Unit Heat Rate (MMBtu/MWh)","lb/MWh Value Used in UPL Calcs","original database export===>","facility_id","report_id","sampling_port_id","pollutant_id","pollutant_name","run_id","start_datetime","end_datetime","unit_load","fuel_flow_rate","fuel_heating_value","fg_moisture_content","fg_oxygen_content","fg_CO2_content","fg_temperature","test_method","conc","conc_units","conc_ND","conc_MDL","conc2","conc2_units","emission_rate","emission_rate_units","emission_rate_ND","emission_rate_MDL","emission_factor","emission_factor_units","emission_factor_ND","emission_factor_MDL","run_pollutant_comment","Fuel1","Fuel1%Btu","Fuel2","Fuel2%Btu","QA Comment","Questions for EPA"]
["Submittal did not include diluent concentrations for run. Used representative diluent concentrations from Part III submittal to perform QA calculations. QA calculations had excellent agreement with submitted values.",null,"Yes","A","1_Hg_T2_R1",null,527,"1","Bituminous",1,null,null,"Part II Submittal","Hg","30B",7.0000000000000001E-3,"μg/dscm","No",null,null,2.2046226218487758E-9,"lbs/μg",2.8316846592000001E-2,null,null,null,"cm/cf",6.14,7.4,null,6.9999999999999999E-6,"lb/hr",null,6.9999999999999998E-9,"lb/MMBtu",null,9780,10640,1800,4.3699572403301229E-13,6.6165037025033914E-9,null,"no CO2 data for run",null,6.9999999999999998E-9,9.3800000000000008,6.5660000000000007E-8,"original database export===>",527,"2008 Hg","SP01",13,"Total Mercury (Hgt)","1",39798.479166666664,39798.645833333336,101,null,9868,6.14,7.3,null,null,"Method 30B, Method 4",7.0000000000000001E-3,"microgram per dry standard cubic meter (μg/dscm)",false,null,null,"",6.9999999999999999E-6,"pound per hour (lb/hr)",false,null,6.9999999999999998E-9,"pound per million British Thermal Unit (lb/MMBtu)",false,null,""]
["Submittal did not include diluent concentrations for run. Used representative diluent concentrations from Part III submittal to perform QA calculations. QA calculations had excellent agreement with submitted values.",null,"Yes","A","1_Hg_T2_R2",null,527,"1","Bituminous",1,null,null,"Part II Submittal","Hg","30B",6.0000000000000001E-3,"μg/dscm","No",null,null,2.2046226218487758E-9,"lbs/μg",2.8316846592000001E-2,null,null,null,"cm/cf",6.12,7.4,null,6.0000000000000002E-6,"lb/hr",null,6E-9,"lb/MMBtu",null,9780,10640,1800,3.7456776345686769E-13,5.6712888878600494E-9,null,"no CO2 data for run",null,6E-9,9.3800000000000008,5.6280000000000005E-8,"original database export===>",527,"2008 Hg","SP01",13,"Total Mercury (Hgt)","2",39798.670138888891,39798.836805555555,101,null,9868,6.12,7.3,null,null,"Method 30B, Method 4",6.0000000000000001E-3,"microgram per dry standard cubic meter (μg/dscm)",false,null,null,"",6.0000000000000002E-6,"pound per hour (lb/hr)",false,null,6E-9,"pound per million British Thermal Unit (lb/MMBtu)",false,null,""]
["Submittal did not include diluent concentrations for run. Used representative diluent concentrations from Part III submittal to perform QA calculations. QA calculations had excellent agreement with submitted values.",null,"Yes","A","1_Hg_T2_R3",null,527,"1","Bituminous",1,null,null,"Part II Submittal","Hg","30B",5.0000000000000001E-3,"μg/dscm","No",null,null,2.2046226218487758E-9,"lbs/μg",2.8316846592000001E-2,null,null,null,"cm/cf",5.9,7.4,null,5.0000000000000004E-6,"lb/hr",null,5.0000000000000001E-9,"lb/MMBtu",null,9780,10640,1800,3.1213980288072308E-13,4.7260740732167083E-9,null,"no CO2 data for run",null,5.0000000000000001E-9,9.3800000000000008,4.6900000000000003E-8,"original database export===>",527,"2008 Hg","SP01",13,"Total Mercury (Hgt)","4",39799.354166666664,39799.520833333336,101,null,10234,5.9,7.8,null,null,"Method 30B, Method 4",5.0000000000000001E-3,"microgram per dry standard cubic meter (μg/dscm)",false,null,null,"",5.0000000000000004E-6,"pound per hour (lb/hr)",false,null,5.0000000000000001E-9,"pound per million British Thermal Unit (lb/MMBtu)",false,null,""]
["Submittal did not include diluent concentrations for run. Used representative diluent concentrations from Part III submittal to perform QA calculations. QA calculations had excellent agreement with submitted values.",null,"Yes","A","1_Hg_T3_R1",null,527,"1","Bituminous",1,null,null,"Part II Submittal","Hg","30B",8.0000000000000002E-3,"μg/dscm","No",null,null,2.2046226218487758E-9,"lbs/μg",2.8316846592000001E-2,null,null,null,"cm/cf",6.06,7.4,null,9.0000000000000002E-6,"lb/hr",null,8.0000000000000005E-9,"lb/MMBtu",null,9780,10640,1800,4.9942368460915685E-13,7.5617185171467325E-9,null,"no CO2 data for run",null,8.0000000000000005E-9,9.3800000000000008,7.5040000000000015E-8,"original database export===>",527,"2009 HG","SP01",13,"Total Mercury (Hgt)","1",39982.378472222219,39982.569444444445,100,null,11012,6.06,null,null,null,"Method 30B, Method 4",8.0000000000000002E-3,"microgram per dry standard cubic meter (μg/dscm)",false,null,null,"",9.0000000000000002E-6,"pound per hour (lb/hr)",false,null,8.0000000000000005E-9,"pound per million British Thermal Unit (lb/MMBtu)",false,null,""]
["Submittal did not include diluent concentrations for run. Used representative diluent concentrations from Part III submittal to perform QA calculations. QA calculations had excellent agreement with submitted values.",null,"Yes","A","1_Hg_T3_R2",null,527,"1","Bituminous",1,null,null,"Part II Submittal","Hg","30B",4.0000000000000001E-3,"μg/dscm","No",null,null,2.2046226218487758E-9,"lbs/μg",2.8316846592000001E-2,null,null,null,"cm/cf",6.26,7.4,null,5.0000000000000004E-6,"lb/hr",null,4.0000000000000002E-9,"lb/MMBtu",null,9780,10640,1800,2.4971184230457843E-13,3.7808592585733663E-9,null,"no CO2 data for run",null,4.0000000000000002E-9,9.3800000000000008,3.7520000000000008E-8,"original database export===>",527,"2009 HG","SP01",13,"Total Mercury (Hgt)","3",39982.791666666664,39982.989583333336,101,null,11012,6.26,null,null,null,"Method 30B, Method 4",4.0000000000000001E-3,"microgram per dry standard cubic meter (μg/dscm)",false,null,null,"",5.0000000000000004E-6,"pound per hour (lb/hr)",false,null,4.0000000000000002E-9,"pound per million British Thermal Unit (lb/MMBtu)",false,null,""]
["Submittal did not include diluent concentrations for run. Used representative diluent concentrations from Part III submittal to perform QA calculations. QA calculations had excellent agreement with submitted values.",null,"Yes","A","1_Hg_T3_R3",null,527,"1","Bituminous",1,null,null,"Part II Submittal","Hg","30B",5.0000000000000001E-3,"μg/dscm","No",null,null,2.2046226218487758E-9,"lbs/μg",2.8316846592000001E-2,null,null,null,"cm/cf",5.65,7.4,null,5.0000000000000004E-6,"lb/hr",null,4.0000000000000002E-9,"lb/MMBtu",null,9780,10640,1800,3.1213980288072308E-13,4.7260740732167083E-9,null,"no CO2 data for run",null,4.0000000000000002E-9,9.3800000000000008,3.7520000000000008E-8,"original database export===>",527,"2009 HG","SP01",13,"Total Mercury (Hgt)","4",39983.319444444445,39983.517361111109,100,null,11250,5.65,null,null,null,"Method 30B, Method 4",5.0000000000000001E-3,"microgram per dry standard cubic meter (μg/dscm)",false,null,null,"",5.0000000000000004E-6,"pound per hour (lb/hr)",false,null,4.0000000000000002E-9,"pound per million British Thermal Unit (lb/MMBtu)",false,null,""]
[]
[]
[]
[]
[]
[]
[]
[]
[]
[]
[]
[]
[]
[]
[]
[]
[]
[]
[]
[]
[]
[]
[]
[]
[]
[]
[]
[]
[]
[]
[]
[]
[]
[]
[]
[]
[]
[]
[]
[]
[]
[]
[]
[]
[]
[]
[]
[]
[]
[]
[]
[]
[]
[]
[]
[]
[]
[]
[]
[]
[]
[]
[]
[]
[]
[]
[]
[]
[]
[1,2,3,4,5,6,7,8,9,10,11,12,13,14,15,16,17,18,19,20,21,22,23,24,25,26,27,28,29,30,31,32,33,34,35,36,37,38,39,40,41,42,43,44,45,46,47]
[]
[null,"Column Source==>",{"$f":"47-4","v":43},{"$f":"47-4","v":43},43,43,43,43,43,43,43]
[null,"Test Avgs for UPL","R1","R2","R3","R4","R5","R6","R7","R8","R9","R10"]
["Test_IDs","lb/MW","lb/MW","lb/MW","lb/MW","lb/MW","lb/MW","lb/MW","lb/MW","lb/MW","lb/MW",null,"Test_IDs"]
["1_Hg_T3",{"$f":"AVERAGE(C202:E202)","v":5.0026666666666679E-8},{"$f":"IFERROR(VLOOKUP($A202&\"_\"&C$200,$E:AU,C$199,FALSE),\"\")","v":7.5040000000000015E-8},{"$f":"IFERROR(VLOOKUP($A202&\"_\"&D$200,$E:AV,D$199,FALSE),\"\")","v":3.7520000000000008E-8},{"$f":"IFERROR(VLOOKUP($A202&\"_\"&E$200,$E:AW,E$199,FALSE),\"\")","v":3.7520000000000008E-8},{"$f":"IFERROR(VLOOKUP($A202&\"_\"&F$200,$E:AX,F$199,FALSE),\"\")","v":""},{"$f":"IFERROR(VLOOKUP($A202&\"_\"&G$200,$E:AY,G$199,FALSE),\"\")","v":""},{"$f":"IFERROR(VLOOKUP($A202&\"_\"&H$200,$E:AZ,H$199,FALSE),\"\")","v":""},{"$f":"IFERROR(VLOOKUP($A202&\"_\"&I$200,$E:BA,I$199,FALSE),\"\")","v":""},{"$f":"IFERROR(VLOOKUP($A202&\"_\"&J$200,$E:BB,J$199,FALSE),\"\")","v":""},{"$f":"IFERROR(VLOOKUP($A202&\"_\"&K$200,$E:BC,K$199,FALSE),\"\")","v":""},null,"1_Hg_T3"]
["1_Hg_T2",{"$f":"AVERAGE(C203:E203)","v":5.6280000000000005E-8},{"$f":"IFERROR(VLOOKUP($A203&\"_\"&C$200,$E:AU,C$199,FALSE),\"\")","v":6.5660000000000007E-8},{"$f":"IFERROR(VLOOKUP($A203&\"_\"&D$200,$E:AV,D$199,FALSE),\"\")","v":5.6280000000000005E-8},{"$f":"IFERROR(VLOOKUP($A203&\"_\"&E$200,$E:AW,E$199,FALSE),\"\")","v":4.6900000000000003E-8},{"$f":"IFERROR(VLOOKUP($A203&\"_\"&F$200,$E:AX,F$199,FALSE),\"\")","v":""},{"$f":"IFERROR(VLOOKUP($A203&\"_\"&G$200,$E:AY,G$199,FALSE),\"\")","v":""},{"$f":"IFERROR(VLOOKUP($A203&\"_\"&H$200,$E:AZ,H$199,FALSE),\"\")","v":""},{"$f":"IFERROR(VLOOKUP($A203&\"_\"&I$200,$E:BA,I$199,FALSE),\"\")","v":""},{"$f":"IFERROR(VLOOKUP($A203&\"_\"&J$200,$E:BB,J$199,FALSE),\"\")","v":""},{"$f":"IFERROR(VLOOKUP($A203&\"_\"&K$200,$E:BC,K$199,FALSE),\"\")","v":""},null,"1_Hg_T2"]
["1_Hg_T1",{"$f":"AVERAGE(C204:E204)","v":9.2424266666666684E-8},{"$f":"IFERROR(VLOOKUP($A204&\"_\"&C$200,$E:AU,C$199,FALSE),\"\")","v":9.20178E-8},{"$f":"IFERROR(VLOOKUP($A204&\"_\"&D$200,$E:AV,D$199,FALSE),\"\")","v":9.0517000000000016E-8},{"$f":"IFERROR(VLOOKUP($A204&\"_\"&E$200,$E:AW,E$199,FALSE),\"\")","v":9.4737999999999998E-8},{"$f":"IFERROR(VLOOKUP($A204&\"_\"&F$200,$E:AX,F$199,FALSE),\"\")","v":""},{"$f":"IFERROR(VLOOKUP($A204&\"_\"&G$200,$E:AY,G$199,FALSE),\"\")","v":""},{"$f":"IFERROR(VLOOKUP($A204&\"_\"&H$200,$E:AZ,H$199,FALSE),\"\")","v":""},{"$f":"IFERROR(VLOOKUP($A204&\"_\"&I$200,$E:BA,I$199,FALSE),\"\")","v":""},{"$f":"IFERROR(VLOOKUP($A204&\"_\"&J$200,$E:BB,J$199,FALSE),\"\")","v":""},{"$f":"IFERROR(VLOOKUP($A204&\"_\"&K$200,$E:BC,K$199,FALSE),\"\")","v":""},null,"1_Hg_T1"]

{"sheet":"Instructions","index":6,"n_rows":50,"n_cols":1,"rows_kept":50,"cut":false,"hidden":false,"merged":[]}
["Step 1.  Identify size of sample set."]
[]
["Large: When N (total number of sources) ≥ 20.  For a large sample set can assume normal distribution based on the Central Limit Theorem; use the \"UPL Pooled Template\" ."]
[]
["Small: When N (total number of sources) < 20.  For a small sample set the Central Limit Theorem cannot be used to support the normality assumption; move on to Step 2."]
[]
["Step 2.  Identify Normality of sample set."]
[]
["Statistical tests of the kurtosis and skewness are used to evaluate the normality assumption."]
[]
["If you have three or less runs in your entire sample set, skip down to Step 6.  "]
[]
["If you have more than three runs in your entire sample set, start in the \"UPL Pooled Template\"  and test for normality in cells B45:B51.  If the Kurtosis and Skewness tests show that raw data is Normal, you may continue to use the \"UPL Pooled Template\"."]
[]
["If the Kurtosis and Skewness tests show that raw data is Not Normal, move on to Step 3."]
[]
["Step 3.  Transform raw data to lognormal data."]
[]
["In the \"Lognormal Template\", take the LN() of the raw data in cells B55:L89 and test the normality again of the LN-data transformed in cells C45:C51."]
[]
["If Kurtosis and Skewness tests show that the LN-data transformed is Lognormal, continue to use the \"Lognormal Template\"."]
[]
["If Kurtosis and Skewness tests show that the LN-data transformed is Not Lognormal, move on to Step 4."]
[]
["Step 4.  Apply Skewness Adjustment."]
[]
["For data that is Not Normal and Not Lognormal, use the \"Skewness Adjustment Template\".  This is essentially the UPL Pooled Template with a Skewness Adjustment.  Note:  DO NOT not use this template if n<13 (n is number of individual runs).   "]
[]
["For data that is Not Normal and Not Lognormal with n<13, move on to Step 5."]
[]
["Step 5.  "]
[]
["See \"Step 5. Intructions\" tab"]
[]
["Step 6.  "]
[]
["See \"Step 6. Intructions\" tab"]
[]
["Things to keep in mind:"]
["Type of data affects m (number of future runs) that will be used in calculation, for example:"]
["If the average of three test runs is used to determine compliance; m=3 "]
["If 30-day averages are used to determine compliance; m=30 "]
[]
["N = total number of sources"]
["n = number of individual runs"]
["df = degrees of freedom = n - 1"]
["X = mean of data"]
["s2 = pooled vaiance of data"]
["m = number of future runs"]
["tdf = t-statistic:  t-distribution with df degrees of freedom at .99 confidence level "]

{"sheet":"Step 6. Instructions","index":7,"n_rows":23,"n_cols":1,"rows_kept":23,"cut":false,"hidden":false,"merged":[]}
["Step 6. Instructions"]
["For data sets with three or less runs"]
[]
["1)    Go to the \"Template_nonnormal n<3\" worksheet and test the kurtosis and skewness and conclude normality or non-normality.  If results of kurtosis and skewness test in cell D90 say \"normal\", use the standard template \"UPL Pooled Template\".  If results of kurtosis and skewness test in cell D90 say  \"non normal\" continue to use the template “Template_nonnormal n<3”."]
[]
["2)    If non-normal because both skewness or kurtosis fail, or if only kurtosis fail or if only skewness fail, you can use tab “Template_nonnormal n<3”."]
[]
["3)    Copy the kurtosis value (B85) and skewness value (B88) in the \"Template_nonnormal n<3\" tab into cells H14 and H12 in the \"Calculations for Template n<3\" tab."]
[]
["4)    Cell E159 of the \"Template_nonnormal n<3\" tab shows the actual confidence level (1 - 'Calculations for Template'!J139) after accounting for the skewness and kurtosis.  If the confidence level is larger than 99.00% or lower than 99.00% then we need to adjust the t-statistic. In this example, the confidence level was lower than 99.00%."]
[]
["5)    Row 160 uses the IF function in EXCEL to conclude about the need to adjust or not.  If you don’t need to adjust (because the difference between the actual level and 99.00% is not that large) then you can use the t-statistic in cell H147.  If the difference is significant, then you need to adjust the t-statistic.   "]
[]
["6)    The “Calculations for Template n<3” tab has the calculations for the confidence level for the first t-statistic in cell H147 from tab “Template_nonnormal n<3”. Input values for this tab are obtained from the “Template_nonnormal n<3” tab, so you don’t need to worry about it."]
[]
["7)    To adjust the t-statistic, go to the“Recalculate t-stat n<3” tab.  This tab starts with the t-statistic in cell H147 from the “Template_nonnormal n<3” tab.  If the confidence level was larger or lower THAN 99.00% you need to decrease or increase the t-statistic so you get closer to 99.00%.  Cell G3 in the \"Recalculate t-stat n<3\" tab has the value of the increase or decrease, also called \"interval\", the candidate t-values will be calculated as the t-value in cell H147 plus multiples of the interval, for example if the t-value is 2, and the interval is 0.3, then the candidate t-values are: 2.03, 2.06, 2.09, 3.12, etc.  These are calculated automatically for you in row 5 after a value is placed in cell G3. The corresponding p-values and confidence levels are also calculated automatically for you.  Manipulate the value in Cell G3 in the \"Recalculate t-stat n<3\" tab. For example, start with 0.1 and notice what the values in row 9 are.  If they are not 99.00% keep increaseing or decreasing the value in G3 until one of the values in row 9 is 99.00% and you get a \"YES\" value in row 11 in the same column.  You may have to go out to several significant figures."]
["Calculations are in the tabs: Recalculations1 to Recalculations6. You don’t need to worry about them, they are basically duplicates of tab “Calculations_for_Template n<3” and each one use a different value of the candidate t-values in row 5.  "]
[]
["8)    Sometimes the  actual significance level in cell E159 of the “Template_nonnormal n<3” tab is larger than 99%, then you have to use a negative interval (meaning that your value in cell G3, tab “Recalculate t-stat n<3” has to be negative), for example instead of 0.389, it has to be -0.389 or another negative number"]
[]
["9)    Once you get the adjusted t-value from the “Recalculate t-stat n<3” tab, copy the t-value and paste special the value into cell E164 of the “Template_nonnormal n<3” tab."]
[]
["10)  The template will calculate the UPL for you in cell E167."]

{"sheet":"Template_nonnormal n=3","index":8,"n_rows":167,"n_cols":12,"rows_kept":167,"cut":false,"hidden":false,"merged":[[153,0,153,7],[158,1,158,2],[159,1,159,6],[163,1,163,3],[0,1,0,11],[40,0,40,4],[43,0,43,4],[149,0,149,9],[151,0,151,7],[84,4,84,14],[85,4,85,14]]}
[null,"Emissions (lb/MWh)"]
["Runs","527\nNucla\n001"]
[1,5.0036363636363603E-8]
[2,5.62909090909091E-8]
[3,9.244218181818181E-8]
[4]
[5]
[6]
[7]
[8]
[9]
[10]
[11]
[12]
[13]
[14]
[15]
[16]
[17]
[18]
[19]
[20]
[21]
[22]
[23]
[24]
[25]
[26]
[27]
[28]
[29]
[30]
[31]
[32]
[33]
[34]
[35]
[]
["n for each source",{"$f":"COUNT(B3:B37)","v":3},{"$f":"COUNT(C3:C37)","v":0},0,0,0,0,0,0,0,0,0]
["Sample size",{"$f":"SUM(B39:L39)","v":3}]
["If sample size is less than 4 test runs use the kurtosis calculation section below "]
["NOTE: Sample size is the number of test runs used to calculate the average"]
[]
["KURTOSIS CALCULATIONS WHEN TOTAL NUMBER TEST RUNS IS LESS THAN 4"]
["Average",{"$f":"AVERAGE(B3:L37)","v":6.6256484848484844E-8}]
["Standard Deviation",{"$f":"STDEV(B3:L37)","v":2.2892092063687448E-8}]
[1,{"$f":"((B3-$B$45)/($B$46))^4","v":0.25204288733447167}]
[2,{"$f":"((B4-$B$45)/($B$46))^4","v":3.5914319725767252E-2}]
[3,{"$f":"((B5-$B$45)/($B$46))^4","v":1.7120427929397601}]
[4]
[5]
[6]
[7]
[8]
[9]
[10]
[11]
[12]
[13]
[14]
[15]
[16]
[17]
[18]
[19]
[20]
[21]
[22]
[23]
[24]
[25]
[26]
[27]
[28]
[29]
[30]
[31]
[32]
[33]
[34]
[35]
[]
["Testing Normality","Raw Data"]
["Sample Size",{"$f":"COUNT(B3:L37)","v":3}]
["Kurtosis",{"$f":"SUM(B47:L81)/($B$84-1)-3","v":-2.0000000000000004},null,null,"### Make sure that kurtosis and skewness are copied in \"Calculations for Template n<3\", in cells H14 and H12 respectively"]
["SE Kurtosis",{"$f":"SQRT(24/B84)","v":2.8284271247461903},null,null,"### Using approximate kurtosis variance equal to 24/n"]
["Result Kurtosis",{"$f":"IF(ABS(B85/B86)>NORMSINV(1-0.05/2),\"non normal\",\"normal\")","v":"normal"}]
["Skewness",{"$f":"SKEW(B3:L37)","v":1.5877301447567105}]
["SE Skewness",{"$f":"SQRT((6*B84*(B84-1))/((B84-2)*(B84+1)*(B84+3)))","v":1.2247448713915889},null,"RESULT"]
["Result Skewness",{"$f":"IF(ABS(B88/B89)>NORMSINV(1-0.05/2),\"non normal\",\"normal\")","v":"normal"},null,{"$f":"IF(AND(B87=\"normal\", B90=\"normal\"),\"normal\", \"non normal\")","v":"normal"}]
[]
[]
["ni = number test runs =",{"$f":"COUNT(B3:B37)","v":3},{"$f":"COUNT(C3:C37)","v":0},0,0,0,0,0,0,0,0]
[]
["Total Number of sources =",{"$f":"COUNTA(B2:L2)","v":1}]
[]
[]
["n =Total # test runs =",{"$f":"COUNT(B3:L37)","v":3}]
[]
[]
[]
[]
[null,{"$f":"B98-1","v":2}]
[]
[]
[]
[]
["This step is for QC only:"]
[]
["means",{"$f":"AVERAGE(B3:B37)","v":6.6256484848484844E-8},{"$f":"AVERAGE(C3:C37)","v":{"$error":"#DIV/0!"}},{"$f":"AVERAGE(D3:D37)","v":{"$error":"#DIV/0!"}},{"$error":"#DIV/0!"},{"$error":"#DIV/0!"},{"$error":"#DIV/0!"},{"$error":"#DIV/0!"},{"$error":"#DIV/0!"},{"$error":"#DIV/0!"},{"$error":"#DIV/0!"}]
[]
[]
[]
[]
[]
[]
[null,{"$f":"AVERAGE(B3:L37)","v":6.6256484848484844E-8}]
["Mean ="]
[]
[]
[]
["Pooled Variance = ",null,null,{"$f":"VAR(B3:L37)","v":5.2404787905234188E-16}]
[]
[]
[]
[]
[]
["m= number future runs =",1]
[]
[]
["Term1",{"$f":"1/B98+1/B128","v":1.3333333333333333}]
[]
[]
[]
["Term2",{"$f":"D122*B131","v":6.9873050540312244E-16}]
[]
[]
[]
[]
[]
["Squared root Term2",null,{"$f":"SQRT(B135)","v":2.6433511030567288E-8}]
[]
[]
["NOTE: the pvalue for the t-statistic is calculated as: 2*alpha, where 1-alpha is desired confidence, so if 99% confidence is desired then alpha=0.01 and 2*alpha=2*(0.01)"]
[]
[]
["t-statistic","= quantile t-distribution with df degrees of freedom at .99 confidence level =",null,null,null,null,null,{"$f":"TINV(2*0.01,B103)","v":6.9645567342832733}]
[]
[]
["Adjustment for non-normality (skewness and kurtosis) for any sample size in particular for small samples "]
[]
["a) n = number of test-runs =",null,null,null,null,null,null,null,null,{"$f":"B98","v":3}]
[]
["b) Calculate u0",null,null,null,null,null,null,null,null,{"$f":"1/(1+$H$147^2/($J$152-1))","v":3.960000000000001E-2}]
[]
[]
[]
[]
[null,"Current Confidence Level is",null,null,{"$f":"(1-'Calculations for Template n=3'!J139)","v":0.96156350179165317}]
["Conclusion",{"$f":"IF( ABS(('Recalculations1 n=3'!J143) -0.01)<0.0001, \"Confidence Level is 99%\",\"Confidence Level is not 99%, Go to Recalculate t-stat n<3 tab to fix the Confidence Level\")","v":"Confidence Level is not 99%, Go to Recalculate t-stat n<3 tab to fix the Confidence Level"}]
[]
[]
[]
[null,"new t-statistic from tab Recalculate t-statistic",null,null,14.114556733963436]
[]
[]
["Adjusted UPL for skewness and kurtosis for all sample size",null,null,null,{"$f":"B117+C141*E164","v":4.3935377596727511E-7}]

{"sheet":"Recalculate t-stat n=3","index":9,"n_rows":19,"n_cols":12,"rows_kept":19,"cut":false,"hidden":false,"merged":[[12,0,12,13],[14,0,14,13],[16,0,16,8],[18,0,18,8],[0,0,0,4],[2,0,2,4],[4,0,4,4],[6,0,6,4],[8,0,8,4],[10,0,10,4]]}
["1) Start with initial t-statistic from Template",null,null,null,null,null,{"$f":"'Template_nonnormal n=3'!H147","v":6.9645567342832733}]
[]
["2) Determine interval of differences for t-values",null,null,null,null,null,1.43]
[]
["2) Candidate values for t-statistic",null,null,null,null,null,{"$f":"$G$1+1*$G$3","v":8.3945567342832739},{"$f":"$G$1+2*$G$3","v":9.8245567342832736},{"$f":"$G$1+3*$G$3","v":11.254556734283273},{"$f":"$G$1+4*$G$3","v":12.684556734283273},{"$f":"$G$1+5*$G$3","v":14.114556734283273},{"$f":"$G$1+6*$G$3","v":15.544556734283272}]
[]
["3) Corrected p-values",null,null,null,null,null,{"$f":"'Recalculations1 n=3'!J143","v":2.7221714617923803E-2},{"$f":"'Recalculation 2 n=3'!J143","v":2.0219370460541591E-2},{"$f":"'Recalculations3 n=3'!J143","v":1.558089812360601E-2},{"$f":"'Recalculations4 n=3'!J143","v":1.2360162896941522E-2},{"$f":"'Recalculations5 n<3'!J143","v":1.0037272897875317E-2},{"$f":"'Recalculations6 n=3'!J143","v":8.3089960315733888E-3}]
[]
["Acutal significance level with t-value",null,null,null,null,null,{"$f":"1-G7","v":0.97277828538207622},0.97978062953945844,0.98441910187639403,0.98763983710305847,0.98996272710212463,0.99169100396842658]
[]
["4) Is p-value closed enough to 0.01?",null,null,null,null,null,{"$f":"IF(ABS(G7-0.01)<0.0001,\"YES\",\"NO\")","v":"NO"},"NO","NO","NO","YES","NO"]
[]
["4) If you don't get a YES in row 11, play around with the cell G3, the interval for differences until you get one p-value closed to 0.01"]
[]
["5) Once you get a YES, use the t-statistic in the calculations of the UPL."]
[]
["Go back to Template_nonnormal tab and paste the value in row 5 that has a Yes in row 11."]
[]
["Copy the new t-value in cell E164 of Template_nonnormal n<3"]

{"sheet":"Calculations for Template n=3","index":10,"n_rows":139,"n_cols":39,"rows_kept":139,"cut":false,"hidden":false,"merged":[[2,0,2,7],[19,0,19,1],[19,8,19,9],[19,15,19,16],[19,21,19,22],[19,34,19,35],[27,0,27,4],[27,8,27,12],[27,15,27,19],[27,21,27,25],[27,27,27,31],[27,34,27,38],[19,27,19,28]]}
[]
[]
["Calculate the Incomplete Beta Functions needed for adjustment"]
[]
["Incomplete Beta Function approximation"]
[]
[]
[]
["where"]
[]
[]
["Inputs",null,null,null,null,"skewness=",null,{"$f":"'Template_nonnormal n=3'!B88","v":1.5877301447567105}]
[]
["x=u0=",null,{"$f":"'Template_nonnormal n=3'!$J$154","v":3.960000000000001E-2},null,null,"kurtosis=",null,{"$f":"'Template_nonnormal n=3'!B85","v":-2.0000000000000004}]
[]
["n=",null,{"$f":"'Template_nonnormal n=3'!$J$152","v":3}]
[]
["t0=t=",null,{"$f":"'Template_nonnormal n=3'!H147","v":6.9645567342832733}]
[]
["c.1.) Calculate ",null,null,null,null,null,null,null,"d.1.) Calculate ",null,null,null,null,null,null,"e.1.) Calculate ",null,null,null,null,null,"f.1.) Calculate ",null,null,null,null,null,"g.1.) Calculate ",null,null,null,null,null,null,"h.1.) Calculate "]
[]
["a=",{"$f":"($C$16-1)/2","v":1},null,null,null,null,null,null,"a=",{"$f":"($C$16+1)/2","v":2},null,null,null,null,null,"a=",{"$f":"($C$16+3)/2","v":3},null,null,null,null,"a=",{"$f":"($C$16+3)/2","v":3},null,null,null,null,"a=",{"$f":"($C$16-1)/2","v":1},null,null,null,null,null,"a=",{"$f":"($C$16+1)/2","v":2}]
[]
["b=",{"$f":"1/2","v":0.5},null,null,null,null,null,null,"b=",{"$f":"1/2","v":0.5},null,null,null,null,null,"b=",{"$f":"1/2","v":0.5},null,null,null,null,"b=",{"$f":"1/2","v":0.5},null,null,null,null,"b=",1,null,null,null,null,null,"b=",1]
[]
["w=",{"$f":"B24*($C$14/(1-$C$14))","v":2.0616409829237823E-2},null,null,null,null,null,null,"w=",{"$f":"J24*($C$14/(1-$C$14))","v":2.0616409829237823E-2},null,null,null,null,null,"w=",{"$f":"Q24*($C$14/(1-$C$14))","v":2.0616409829237823E-2},null,null,null,null,"w=",{"$f":"W24*($C$14/(1-$C$14))","v":2.0616409829237823E-2},null,null,null,null,"w=",{"$f":"AC24*($C$14/(1-$C$14))","v":4.1232819658475646E-2},null,null,null,null,null,"w=",{"$f":"AJ24*($C$14/(1-$C$14))","v":4.1232819658475646E-2}]
[]
["Calculations",null,null,null,null,null,null,null,"Calculations",null,null,null,null,null,null,"Calculations",null,null,null,null,null,"Calculations",null,null,null,null,null,"Calculations",null,null,null,null,null,null,"Calculations"]
[]
["c.1.1. ",null,{"$f":"GAMMADIST($B$26,$B$22, 1, TRUE)","v":2.0405344610407668E-2},null,null,null,null,null,"d.1.1. ",null,{"$f":"GAMMADIST($J$26,$J$22, 1, TRUE)","v":2.0961972751620494E-4},null,null,null,null,"e.1.1. ",null,{"$f":"GAMMADIST($Q$26,$Q$22, 1, TRUE)","v":1.4380571193452409E-6},null,null,null,"f.1.1. ",null,{"$f":"GAMMADIST($W$26,$W$22, 1, TRUE)","v":1.4380571193452409E-6},null,null,null,"g.1.1. ",null,{"$f":"GAMMADIST($AC$26,$AC$22, 1, TRUE)","v":4.0394311125780055E-2},null,null,null,null,"h.1.1. ",null,{"$f":"GAMMADIST($AJ$26,$AJ$22, 1, TRUE)","v":8.2706281831975055E-4}]
[]
["c.1.2. ",null,{"$f":"EXP(GAMMALN($B$22))","v":0.99999999995828404},null,null,null,null,null,"d.1.2. ",null,{"$f":"EXP(GAMMALN($J$22))","v":0.99999999991423216},null,null,null,null,"e.1.2. ",null,{"$f":"EXP(GAMMALN($Q$22))","v":1.9999999997597622},null,null,null,"f.1.2. ",null,{"$f":"EXP(GAMMALN($W$22))","v":1.9999999997597622},null,null,null,"g.1.2. ",null,{"$f":"EXP(GAMMALN($AC$22))","v":0.99999999995828404},null,null,null,null,"h.1.2. ",null,{"$f":"EXP(GAMMALN($AJ$22))","v":0.99999999991423216}]
[]
["c.1.3",null,{"$f":"EXP(-$B$26)*$B$26^$B$22/$C$32","v":2.0195724882900702E-2},null,null,null,null,null,"d.1.3",null,{"$f":"EXP(-$J$26)*$J$26^$J$22/$K$32","v":4.1636334100275847E-4},null,null,null,null,"e.1.3",null,{"$f":"EXP(-$Q$26)*$Q$26^$Q$22/$R$32","v":4.291958638139219E-6},null,null,null,"f.1.3",null,{"$f":"EXP(-$W$26)*$W$26^$W$22/$X$32","v":4.291958638139219E-6},null,null,null,"g.1.3",null,{"$f":"EXP(-$AC$26)*$AC$26^$AC$22/$AD$32","v":3.9567248314046406E-2},null,null,null,null,"h.1.3",null,{"$f":"EXP(-$AJ$26)*$AJ$26^$AJ$22/$AK$32","v":1.6314692141870693E-3}]
[]
[]
["c.1.4.",null,{"$f":"($B$22-1-$B$26)/(2*$B$24)","v":-2.0616409829237823E-2},null,null,null,null,null,"d.1.4.",null,{"$f":"($J$22-1-$J$26)/(2*$J$24)","v":0.97938359017076215},null,null,null,null,"e.1.4.",null,{"$f":"($Q$22-1-$Q$26)/(2*$Q$24)","v":1.9793835901707622},null,null,null,"f.1.4.",null,{"$f":"($W$22-1-$W$26)/(2*$W$24)","v":1.9793835901707622},null,null,null,"g.1.4.",null,{"$f":"($AC$22-1-$AC$26)/(2*$AC$24)","v":-2.0616409829237823E-2},null,null,null,null,"h.1.4.",null,{"$f":"($AJ$22-1-$AJ$26)/(2*$AJ$24)","v":0.47938359017076215}]
[]
["c.1.5.",null,null,null,{"$f":"($B$22^3/2-5*$B$22^2/3+3*$B$22/2-(1/3))","v":-5.5511151231257827E-17},null,null,null,"d.1.5.",null,null,null,{"$f":"($J$22^3/2-5*$J$22^2/3+3*$J$22/2-(1/3))","v":-2.7755575615628914E-16},null,null,"e.1.5.",null,null,null,{"$f":"($Q$22^3/2-5*$Q$22^2/3+3*$Q$22/2-(1/3))","v":2.6666666666666665},null,"f.1.5.",null,null,null,{"$f":"($W$22^3/2-5*$W$22^2/3+3*$W$22/2-(1/3))","v":2.6666666666666665},null,"g.1.5.",null,null,null,{"$f":"($AC$22^3/2-5*$AC$22^2/3+3*$AC$22/2-(1/3))","v":-5.5511151231257827E-17},null,null,"h.1.5.",null,null,null,{"$f":"($AJ$22^3/2-5*$AJ$22^2/3+3*$AJ$22/2-(1/3))","v":-2.7755575615628914E-16}]
[]
[]
[]
["c.1.6",null,null,null,{"$f":"B26*(3*$B$22^2/2-11*$B$22/6+(1/3))","v":1.1444406438764111E-18},null,null,null,"d.1.6",null,null,null,{"$f":"$J$26*(3*$J$22^2/2-11*$J$22/6+(1/3))","v":5.4977092877967537E-2},null,null,"e.1.6",null,null,null,{"$f":"$Q$26*(3*$Q$22^2/2-11*$Q$22/6+(1/3))","v":0.17180341524364853},null,"f.1.6",null,null,null,{"$f":"$W$26*(3*$W$22^2/2-11*$W$22/6+(1/3))","v":0.17180341524364853},null,"g.1.6",null,null,null,{"$f":"$AC$26*(3*$AC$22^2/2-11*$AC$22/6+(1/3))","v":2.2888812877528223E-18},null,null,"h.1.6",null,null,null,{"$f":"$AJ$26*(3*$AJ$22^2/2-11*$AJ$22/6+(1/3))","v":0.10995418575593507}]
[]
[]
["c.1.7",null,null,null,{"$f":"B26^2*(3*$B$22/2-(1/6))","v":5.6671513899612513E-4},null,null,null,"d.1.7",null,null,null,{"$f":"J26^2*(3*$J$22/2-(1/6))","v":1.204269670366766E-3},null,null,"e.1.7",null,null,null,{"$f":"Q26^2*(3*$Q$22/2-(1/6))","v":1.8418242017374069E-3},null,"f.1.7",null,null,null,{"$f":"W26^2*(3*$W$22/2-(1/6))","v":1.8418242017374069E-3},null,"g.1.7",null,null,null,{"$f":"AC26^2*(3*$AC$22/2-(1/6))","v":2.2668605559845005E-3},null,null,"h.1.7",null,null,null,{"$f":"AJ26^2*(3*$AJ$22/2-(1/6))","v":4.817078681467064E-3}]
[]
[]
[]
["Result1:",null,null,null,{"$f":"C30/C32+C34*(C37+(1/(2*$B$24)^2)*(E39-E43+E46-B26^3/2))","v":2.000033800853037E-2},null,null,null,"Result2:",null,null,null,{"$f":"K30/K32+K34*(K37+(1/(2*$J$24)^2)*(M39-M43+M46-J26^3/2))","v":5.950082946966389E-4},null,null,"Result3:",null,null,null,{"$f":"R30/R32+R34*(R37+(1/(2*$Q$24)^2)*(T39-T43+T46-Q26^3/2))","v":1.9930197169373338E-5},null,"Result4:",null,null,null,{"$f":"X30/X32+X34*(X37+(1/(2*$W$24)^2)*(Z39-Z43+Z46-W26^3/2))","v":1.9930197169373338E-5},null,"Result5:",null,null,null,{"$f":"AD30/AD32+AD34*(AD37+(1/(2*$AC$24)^2)*(AF39-AF43+AF46-AC26^3/2))","v":3.9600653162172116E-2},null,null,"Result6:",null,null,null,{"$f":"AK30/AK32+AK34*(AK37+(1/(2*$AC$24)^2)*(AM39-AM43+AM46-AJ26^3/2))","v":1.5662661030616818E-3}]
[]
[]
["1- Calculate",null,null,null,null,{"$f":"(1/2)*$E$50","v":1.0000169004265185E-2}]
[]
[]
[]
["2- Calculate"]
[]
[]
[]
[]
[]
["2.1. Calculate",null,null,{"$f":"1/(6*SQRT(2*$C$16*PI()))","v":3.8388238830148393E-2}]
[]
[]
[]
["2.2. Calculate",null,null,{"$f":"1+(2*C16-1)*C18/(C16-1)","v":18.411391835708184}]
[]
[]
[]
["2.3. Calculate",null,null,null,{"$f":"(1+C18^2/(C16-1))^((C16+1)/2)","v":637.69003162942522}]
[]
[]
[]
["Result:",null,null,null,{"$f":"D63*D67/E71","v":1.1083455470969866E-3}]
[]
[]
[]
["3-Calculate"]
[]
[]
[]
[]
["3.1. Calculate",null,null,null,{"$f":"(C16-1)/(3*SQRT(2*C16*PI()))","v":0.15355295532059357}]
[]
[]
[]
["3.2. Calculate",null,null,null,{"$f":"(2*$C$16-1)/(6*SQRT(2*$C$16*PI()))","v":0.19194119415074196}]
[]
[]
[]
["Result",null,null,null,{"$f":"E88*AF50-E84*AM50","v":7.3604918681530809E-3}]
[]
[]
["4-Calculate"]
[]
[]
["4.1. Calculate",null,null,null,null,{"$f":"((C16-1)/24)*E50","v":1.6666948340441975E-3}]
[]
[]
[]
[]
["4.2. Calculate",null,null,null,null,null,{"$f":"((C16-1)*(C16+2)/(12*C16))*M50","v":1.6528008186017748E-4}]
[]
[]
[]
["4.3. Calculate",null,null,null,null,null,{"$f":"((C16+4)*(C16-1)/(24*C16))*T50","v":3.8753161162670377E-6}]
[]
[]
[]
["Result:",null,null,null,null,null,{"$f":"F98-G103+G107","v":1.5052900683002869E-3}]
[]
[]
["5- Calculate"]
[]
[]
[]
[]
[null,null,null,null,null,null,{"$f":"((C16-1)*(2*C16+5)/72)*E50","v":6.111214391495391E-3}]
["5.1. Calculate"]
[]
[]
[null,null,null,null,null,null,{"$f":"((C16-1)*(2*C16^2+5*C16+8)/(24*C16))*M50","v":6.7764833562672757E-4}]
["5.2. Calculate"]
[]
[]
[]
["5.3. Calculate",null,null,null,null,null,{"$f":"((C16-1)*(2*C16^2+5*C16+12)/(24*C16))*T50","v":2.4912746461716672E-5}]
[]
[]
[]
["5.4. Calculate",null,null,null,null,null,null,{"$f":"((C16-1)*(2*C16^2+5*C16+12)/(72*C16))*Z50","v":8.3042488205722247E-6}]
[]
[]
[]
[]
["Result",null,{"$f":"G119-G123+G128-H132","v":5.4501745535098078E-3}]
[]
["Corrected probability is::",null,null,null,null,null,null,null,null,{"$f":"F53+H12*E92-H14*G111+(H12^2)*C137","v":3.8436498208346867E-2}]

{"sheet":"Recalculations1 n=3","index":11,"n_rows":143,"n_cols":39,"rows_kept":143,"cut":false,"hidden":false,"merged":[[1,0,1,5],[6,0,6,7],[23,0,23,1],[23,8,23,9],[23,15,23,16],[23,27,23,28],[23,34,23,35],[31,0,31,4],[31,8,31,12],[31,15,31,19],[31,21,31,25],[31,27,31,31],[31,34,31,38],[23,21,23,22]]}
[]
["Calculate u0. Sustitute each candidate t-value in u0 equation",null,null,null,null,null,null,null,"t-statistic=",{"$f":"'Recalculate t-stat n=3'!G5","v":8.3945567342832739},null,"u0=",{"$f":"1/(1+$J$2^2/(C20-1))","v":2.7598166318262233E-2}]
[]
[]
[]
[]
["Calculate the Incomplete Beta Functions needed for adjustment"]
[]
["Incomplete Beta Function approximation"]
[]
[]
[]
["where"]
[]
[]
["Inputs",null,null,null,null,"skewness=",null,{"$f":"'Template_nonnormal n=3'!B88","v":1.5877301447567105}]
[]
["x=u0=",null,{"$f":"M2","v":2.7598166318262233E-2},null,null,"kurtosis=",null,{"$f":"'Template_nonnormal n=3'!B85","v":-2.0000000000000004}]
[]
["n=",null,{"$f":"'Template_nonnormal n=3'!$J$152","v":3}]
[]
["t0=t=",null,{"$f":"'Template_nonnormal n=3'!H147","v":6.9645567342832733}]
[]
["c.1.) Calculate ",null,null,null,null,null,null,null,"d.1.) Calculate ",null,null,null,null,null,null,"e.1.) Calculate ",null,null,null,null,null,"f.1.) Calculate ",null,null,null,null,null,"g.1.) Calculate ",null,null,null,null,null,null,"h.1.) Calculate "]
[]
["a=",{"$f":"($C$20-1)/2","v":1},null,null,null,null,null,null,"a=",{"$f":"($C$20+1)/2","v":2},null,null,null,null,null,"a=",{"$f":"($C$20+3)/2","v":3},null,null,null,null,"a=",{"$f":"($C$20+3)/2","v":3},null,null,null,null,"a=",{"$f":"($C$20-1)/2","v":1},null,null,null,null,null,"a=",{"$f":"($C$20+1)/2","v":2}]
[]
["b=",{"$f":"1/2","v":0.5},null,null,null,null,null,null,"b=",{"$f":"1/2","v":0.5},null,null,null,null,null,"b=",{"$f":"1/2","v":0.5},null,null,null,null,"b=",{"$f":"1/2","v":0.5},null,null,null,null,"b=",1,null,null,null,null,null,"b=",1]
[]
["w=",{"$f":"B28*($C$18/(1-$C$18))","v":1.4190721038528489E-2},null,null,null,null,null,null,"w=",{"$f":"J28*($C$18/(1-$C$18))","v":1.4190721038528489E-2},null,null,null,null,null,"w=",{"$f":"Q28*($C$18/(1-$C$18))","v":1.4190721038528489E-2},null,null,null,null,"w=",{"$f":"W28*($C$18/(1-$C$18))","v":1.4190721038528489E-2},null,null,null,null,"w=",{"$f":"AC28*($C$18/(1-$C$18))","v":2.8381442077056979E-2},null,null,null,null,null,"w=",{"$f":"AJ28*($C$18/(1-$C$18))","v":2.8381442077056979E-2}]
[]
["Calculations",null,null,null,null,null,null,null,"Calculations",null,null,null,null,null,null,"Calculations",null,null,null,null,null,"Calculations",null,null,null,null,null,"Calculations",null,null,null,null,null,null,"Calculations"]
[]
["c.1.1. ",null,{"$f":"GAMMADIST($B$30,$B$26, 1, TRUE)","v":1.4090507347449264E-2},null,null,null,null,null,"d.1.1. ",null,{"$f":"GAMMADIST($J$30,$J$26, 1, TRUE)","v":9.9740772187435403E-5},null,null,null,null,"e.1.1. ",null,{"$f":"GAMMADIST($Q$30,$Q$26, 1, TRUE)","v":4.7123936832809346E-7},null,null,null,"f.1.1. ",null,{"$f":"GAMMADIST($W$30,$W$26, 1, TRUE)","v":4.7123936832809346E-7},null,null,null,"g.1.1. ",null,{"$f":"GAMMADIST($AC$30,$AC$26, 1, TRUE)","v":2.7982472306234692E-2},null,null,null,null,"h.1.1. ",null,{"$f":"GAMMADIST($AJ$30,$AJ$26, 1, TRUE)","v":3.9521314566911208E-4}]
[]
["c.1.2. ",null,{"$f":"EXP(GAMMALN($B$26))","v":0.99999999995828404},null,null,null,null,null,"d.1.2. ",null,{"$f":"EXP(GAMMALN($J$26))","v":0.99999999991423216},null,null,null,null,"e.1.2. ",null,{"$f":"EXP(GAMMALN($Q$26))","v":1.9999999997597622},null,null,null,"f.1.2. ",null,{"$f":"EXP(GAMMALN($W$26))","v":1.9999999997597622},null,null,null,"g.1.2. ",null,{"$f":"EXP(GAMMALN($AC$26))","v":0.99999999995828404},null,null,null,null,"h.1.2. ",null,{"$f":"EXP(GAMMALN($AJ$26))","v":0.99999999991423216}]
[]
["c.1.3",null,{"$f":"EXP(-$B$30)*$B$30^$B$26/$C$36","v":1.3990766579994228E-2},null,null,null,null,null,"d.1.3",null,{"$f":"EXP(-$J$30)*$J$30^$J$26/$K$36","v":1.9853906566061138E-4},null,null,null,null,"e.1.3",null,{"$f":"EXP(-$Q$30)*$Q$30^$Q$26/$R$36","v":1.4087062480683041E-6},null,null,null,"f.1.3",null,{"$f":"EXP(-$W$30)*$W$30^$W$26/$X$36","v":1.4087062480683041E-6},null,null,null,"g.1.3",null,{"$f":"EXP(-$AC$30)*$AC$30^$AC$26/$AD$36","v":2.7587259161288579E-2},null,null,null,null,"h.1.3",null,{"$f":"EXP(-$AJ$30)*$AJ$30^$AJ$26/$AK$36","v":7.8296619798536233E-4}]
[]
[]
["c.1.4.",null,{"$f":"($B$26-1-$B$30)/(2*$B$28)","v":-1.4190721038528489E-2},null,null,null,null,null,"d.1.4.",null,{"$f":"($J$26-1-$J$30)/(2*$J$28)","v":0.98580927896147152},null,null,null,null,"e.1.4.",null,{"$f":"($Q$26-1-$Q$30)/(2*$Q$28)","v":1.9858092789614714},null,null,null,"f.1.4.",null,{"$f":"($W$26-1-$W$30)/(2*$W$28)","v":1.9858092789614714},null,null,null,"g.1.4.",null,{"$f":"($AC$26-1-$AC$30)/(2*$AC$28)","v":-1.4190721038528489E-2},null,null,null,null,"h.1.4.",null,{"$f":"($AJ$26-1-$AJ$30)/(2*$AJ$28)","v":0.48580927896147152}]
[]
["c.1.5.",null,null,null,{"$f":"($B$26^3/2-5*$B$26^2/3+3*$B$26/2-(1/3))","v":-5.5511151231257827E-17},null,null,null,"d.1.5.",null,null,null,{"$f":"($J$26^3/2-5*$J$26^2/3+3*$J$26/2-(1/3))","v":-2.7755575615628914E-16},null,null,"e.1.5.",null,null,null,{"$f":"($Q$26^3/2-5*$Q$26^2/3+3*$Q$26/2-(1/3))","v":2.6666666666666665},null,"f.1.5.",null,null,null,{"$f":"($W$26^3/2-5*$W$26^2/3+3*$W$26/2-(1/3))","v":2.6666666666666665},null,"g.1.5.",null,null,null,{"$f":"($AC$26^3/2-5*$AC$26^2/3+3*$AC$26/2-(1/3))","v":-5.5511151231257827E-17},null,null,"h.1.5.",null,null,null,{"$f":"($AJ$26^3/2-5*$AJ$26^2/3+3*$AJ$26/2-(1/3))","v":-2.7755575615628914E-16}]
[]
[]
[]
["c.1.6",null,null,null,{"$f":"$B$30*(3*$B$26^2/2-11*$B$26/6+(1/3))","v":7.877432616503471E-19},null,null,null,"d.1.6",null,null,null,{"$f":"$J$30*(3*$J$26^2/2-11*$J$26/6+(1/3))","v":3.7841922769409307E-2},null,null,"e.1.6",null,null,null,{"$f":"$Q$30*(3*$Q$26^2/2-11*$Q$26/6+(1/3))","v":0.11825600865440408},null,"f.1.6",null,null,null,{"$f":"$W$30*(3*$W$26^2/2-11*$W$26/6+(1/3))","v":0.11825600865440408},null,"g.1.6",null,null,null,{"$f":"$AC$30*(3*$AC$26^2/2-11*$AC$26/6+(1/3))","v":1.5754865233006942E-18},null,null,"h.1.6",null,null,null,{"$f":"$AJ$30*(3*$AJ$26^2/2-11*$AJ$26/6+(1/3))","v":7.5683845538818614E-2}]
[]
[]
["c.1.7",null,null,null,{"$f":"B30^2*(3*$B$26/2-(1/6))","v":2.6850208479111342E-4},null,null,null,"d.1.7",null,null,null,{"$f":"$J$30^2*(3*$J$26/2-(1/6))","v":5.7056693018111605E-4},null,null,"e.1.7",null,null,null,{"$f":"Q30^2*(3*$Q$26/2-(1/6))","v":8.7263177557111863E-4},null,"f.1.7",null,null,null,{"$f":"W30^2*(3*$W$26/2-(1/6))","v":8.7263177557111863E-4},null,"g.1.7",null,null,null,{"$f":"AC30^2*(3*$AC$26/2-(1/6))","v":1.0740083391644537E-3},null,null,"h.1.7",null,null,null,{"$f":"AJ30^2*(3*$AJ$26/2-(1/6))","v":2.2822677207244642E-3}]
[]
[]
[]
["Result1:",null,null,null,{"$f":"C34/C36+C38*(C41+(1/(2*$B$28)^2)*(E43-E47+E50-B30^3/2))","v":1.3895704841822362E-2},null,null,null,"Result2:",null,null,null,{"$f":"K34/K36+K38*(K41+(1/(2*$J$28)^2)*(M43-M47+M50-J30^3/2))","v":2.8806232151591356E-4},null,null,"Result3:",null,null,null,{"$f":"R34/R36+R38*(R41+(1/(2*$Q$28)^2)*(T43-T47+T50-Q30^3/2))","v":6.6242309085427541E-6},null,"Result4:",null,null,null,{"$f":"X34/X36+X38*(X41+(1/(2*$W$28)^2)*(Z43-Z47+Z50-W30^3/2))","v":6.6242309085427541E-6},null,"Result5:",null,null,null,{"$f":"AD34/AD36+AD38*(AD41+(1/(2*$AC$28)^2)*(AF43-AF47+AF50-AC30^3/2))","v":2.7598317609503875E-2},null,null,"Result6:",null,null,null,{"$f":"AK34/AK36+AK38*(AK41+(1/(2*$AC$28)^2)*(AM43-AM47+AM50-AJ30^3/2))","v":7.6121541375411429E-4}]
[]
[]
["1- Calculate",null,null,null,null,{"$f":"(1/2)*$E$54","v":6.9478524209111809E-3}]
[]
[]
[]
["2- Calculate"]
[]
[]
[]
[]
[]
["2.1. Calculate",null,null,{"$f":"1/(6*SQRT(2*$C$20*PI()))","v":3.8388238830148393E-2}]
[]
[]
[]
["2.2. Calculate",null,null,{"$f":"1+(2*C20-1)*C22/(C20-1)","v":18.411391835708184}]
[]
[]
[]
["2.3. Calculate",null,null,null,{"$f":"(1+C22^2/(C20-1))^((C20+1)/2)","v":637.69003162942522}]
[]
[]
[]
["Result:",null,null,null,{"$f":"D67*D71/E75","v":1.1083455470969866E-3}]
[]
[]
[]
["3-Calculate"]
[]
[]
[]
[]
["3.1. Calculate",null,null,null,{"$f":"(C20-1)/(3*SQRT(2*C20*PI()))","v":0.15355295532059357}]
[]
[]
[]
["3.2. Calculate",null,null,null,{"$f":"(2*$C$20-1)/(6*SQRT(2*$C$20*PI()))","v":0.19194119415074196}]
[]
[]
[]
["Result",null,null,null,{"$f":"E92*AF54-E88*AM54","v":5.1803671621020913E-3}]
[]
[]
["4-Calculate"]
[]
[]
["4.1. Calculate",null,null,null,null,{"$f":"((C20-1)/24)*E54","v":1.1579754034851967E-3}]
[]
[]
[]
[]
["4.2. Calculate",null,null,null,null,null,{"$f":"((C20-1)*(C20+2)/(12*C20))*M54","v":8.0017311532198221E-5}]
[]
[]
[]
["4.3. Calculate",null,null,null,null,null,{"$f":"((C20+4)*(C20-1)/(24*C20))*T54","v":1.2880448988833133E-6}]
[]
[]
[]
["Result:",null,null,null,null,null,{"$f":"F102-G107+G111","v":1.0792461368518819E-3}]
[]
[]
["5- Calculate"]
[]
[]
[]
[]
[null,null,null,null,null,null,{"$f":"((C20-1)*(2*C20+5)/72)*E54","v":4.245909812779055E-3}]
["5.1. Calculate"]
[]
[]
[null,null,null,null,null,null,{"$f":"((C20-1)*(2*C20^2+5*C20+8)/(24*C20))*M54","v":3.2807097728201266E-4}]
["5.2. Calculate"]
[]
[]
[]
["5.3. Calculate",null,null,null,null,null,{"$f":"((C20-1)*(2*C20^2+5*C20+12)/(24*C20))*T54","v":8.2802886356784434E-6}]
[]
[]
[]
["5.4. Calculate",null,null,null,null,null,null,{"$f":"((C20-1)*(2*C20^2+5*C20+12)/(72*C20))*Z54","v":2.7600962118928142E-6}]
[]
[]
[]
[]
["Result",null,{"$f":"G123-G127+G132-H136","v":3.9233590279208275E-3}]
[]
["Corrected probability is::",null,null,null,null,null,null,null,null,{"$f":"F57+H16*E96-H18*G115+(H16^2)*C141","v":2.7221714617923803E-2}]

{"sheet":"Recalculation 2 n=3","index":12,"n_rows":143,"n_cols":39,"rows_kept":143,"cut":false,"hidden":false,"merged":[[1,0,1,5],[6,0,6,7],[23,0,23,1],[23,8,23,9],[23,15,23,16],[23,27,23,28],[23,34,23,35],[31,0,31,4],[31,8,31,12],[31,15,31,19],[31,21,31,25],[31,27,31,31],[31,34,31,38],[23,21,23,22]]}
[]
["Calculate u0. Sustitute each candidate t-value in u0 equation",null,null,null,null,null,null,null,"t-statistic=",{"$f":"'Recalculate t-stat n=3'!H5","v":9.8245567342832736},null,"u0=",{"$f":"1/(1+$J$2^2/(C20-1))","v":2.0300052018776098E-2}]
[]
[]
[]
[]
["Calculate the Incomplete Beta Functions needed for adjustment"]
[]
["Incomplete Beta Function approximation"]
[]
[]
[]
["where"]
[]
[]
["Inputs",null,null,null,null,"skewness=",null,{"$f":"'Template_nonnormal n=3'!B88","v":1.5877301447567105}]
[]
["x=u0=",null,{"$f":"M2","v":2.0300052018776098E-2},null,null,"kurtosis=",null,{"$f":"'Template_nonnormal n=3'!B85","v":-2.0000000000000004}]
[]
["n=",null,{"$f":"'Template_nonnormal n=3'!$J$152","v":3}]
[]
["t0=t=",null,{"$f":"'Template_nonnormal n=3'!H147","v":6.9645567342832733}]
[]
["c.1.) Calculate ",null,null,null,null,null,null,null,"d.1.) Calculate ",null,null,null,null,null,null,"e.1.) Calculate ",null,null,null,null,null,"f.1.) Calculate ",null,null,null,null,null,"g.1.) Calculate ",null,null,null,null,null,null,"h.1.) Calculate "]
[]
["a=",{"$f":"($C$20-1)/2","v":1},null,null,null,null,null,null,"a=",{"$f":"($C$20+1)/2","v":2},null,null,null,null,null,"a=",{"$f":"($C$20+3)/2","v":3},null,null,null,null,"a=",{"$f":"($C$20+3)/2","v":3},null,null,null,null,"a=",{"$f":"($C$20-1)/2","v":1},null,null,null,null,null,"a=",{"$f":"($C$20+1)/2","v":2}]
[]
["b=",{"$f":"1/2","v":0.5},null,null,null,null,null,null,"b=",{"$f":"1/2","v":0.5},null,null,null,null,null,"b=",{"$f":"1/2","v":0.5},null,null,null,null,"b=",{"$f":"1/2","v":0.5},null,null,null,null,"b=",1,null,null,null,null,null,"b=",1]
[]
["w=",{"$f":"B28*($C$18/(1-$C$18))","v":1.0360341480371882E-2},null,null,null,null,null,null,"w=",{"$f":"J28*($C$18/(1-$C$18))","v":1.0360341480371882E-2},null,null,null,null,null,"w=",{"$f":"Q28*($C$18/(1-$C$18))","v":1.0360341480371882E-2},null,null,null,null,"w=",{"$f":"W28*($C$18/(1-$C$18))","v":1.0360341480371882E-2},null,null,null,null,"w=",{"$f":"AC28*($C$18/(1-$C$18))","v":2.0720682960743763E-2},null,null,null,null,null,"w=",{"$f":"AJ28*($C$18/(1-$C$18))","v":2.0720682960743763E-2}]
[]
["Calculations",null,null,null,null,null,null,null,"Calculations",null,null,null,null,null,null,"Calculations",null,null,null,null,null,"Calculations",null,null,null,null,null,"Calculations",null,null,null,null,null,null,"Calculations"]
[]
["c.1.1. ",null,{"$f":"GAMMADIST($B$30,$B$26, 1, TRUE)","v":1.0306858003734059E-2},null,null,null,null,null,"d.1.1. ",null,{"$f":"GAMMADIST($J$30,$J$26, 1, TRUE)","v":5.3299092435374004E-5},null,null,null,null,"e.1.1. ",null,{"$f":"GAMMADIST($Q$30,$Q$26, 1, TRUE)","v":1.8390657454635525E-7},null,null,null,"f.1.1. ",null,{"$f":"GAMMADIST($W$30,$W$26, 1, TRUE)","v":1.8390657454635525E-7},null,null,null,"g.1.1. ",null,{"$f":"GAMMADIST($AC$30,$AC$26, 1, TRUE)","v":2.0507484687407377E-2},null,null,null,null,"h.1.1. ",null,{"$f":"GAMMADIST($AJ$30,$AJ$26, 1, TRUE)","v":2.1173081434086358E-4}]
[]
["c.1.2. ",null,{"$f":"EXP(GAMMALN($B$26))","v":0.99999999995828404},null,null,null,null,null,"d.1.2. ",null,{"$f":"EXP(GAMMALN($J$26))","v":0.99999999991423216},null,null,null,null,"e.1.2. ",null,{"$f":"EXP(GAMMALN($Q$26))","v":1.9999999997597622},null,null,null,"f.1.2. ",null,{"$f":"EXP(GAMMALN($W$26))","v":1.9999999997597622},null,null,null,"g.1.2. ",null,{"$f":"EXP(GAMMALN($AC$26))","v":0.99999999995828404},null,null,null,null,"h.1.2. ",null,{"$f":"EXP(GAMMALN($AJ$26))","v":0.99999999991423216}]
[]
["c.1.3",null,{"$f":"EXP(-$B$30)*$B$30^$B$26/$C$36","v":1.0253558912285469E-2},null,null,null,null,null,"d.1.3",null,{"$f":"EXP(-$J$30)*$J$30^$J$26/$K$36","v":1.0623037172506756E-4},null,null,null,null,"e.1.3",null,{"$f":"EXP(-$Q$30)*$Q$30^$Q$26/$R$36","v":5.5029146334817395E-7},null,null,null,"f.1.3",null,{"$f":"EXP(-$W$30)*$W$30^$W$26/$X$36","v":5.5029146334817395E-7},null,null,null,"g.1.3",null,{"$f":"EXP(-$AC$30)*$AC$30^$AC$26/$AD$36","v":2.0295753873075834E-2},null,null,null,null,"h.1.3",null,{"$f":"EXP(-$AJ$30)*$AJ$30^$AJ$26/$AK$36","v":4.2054188147181733E-4}]
[]
[]
["c.1.4.",null,{"$f":"($B$26-1-$B$30)/(2*$B$28)","v":-1.0360341480371882E-2},null,null,null,null,null,"d.1.4.",null,{"$f":"($J$26-1-$J$30)/(2*$J$28)","v":0.9896396585196281},null,null,null,null,"e.1.4.",null,{"$f":"($Q$26-1-$Q$30)/(2*$Q$28)","v":1.9896396585196281},null,null,null,"f.1.4.",null,{"$f":"($W$26-1-$W$30)/(2*$W$28)","v":1.9896396585196281},null,null,null,"g.1.4.",null,{"$f":"($AC$26-1-$AC$30)/(2*$AC$28)","v":-1.0360341480371882E-2},null,null,null,null,"h.1.4.",null,{"$f":"($AJ$26-1-$AJ$30)/(2*$AJ$28)","v":0.4896396585196281}]
[]
["c.1.5.",null,null,null,{"$f":"($B$26^3/2-5*$B$26^2/3+3*$B$26/2-(1/3))","v":-5.5511151231257827E-17},null,null,null,"d.1.5.",null,null,null,{"$f":"($J$26^3/2-5*$J$26^2/3+3*$J$26/2-(1/3))","v":-2.7755575615628914E-16},null,null,"e.1.5.",null,null,null,{"$f":"($Q$26^3/2-5*$Q$26^2/3+3*$Q$26/2-(1/3))","v":2.6666666666666665},null,"f.1.5.",null,null,null,{"$f":"($W$26^3/2-5*$W$26^2/3+3*$W$26/2-(1/3))","v":2.6666666666666665},null,"g.1.5.",null,null,null,{"$f":"($AC$26^3/2-5*$AC$26^2/3+3*$AC$26/2-(1/3))","v":-5.5511151231257827E-17},null,null,"h.1.5.",null,null,null,{"$f":"($AJ$26^3/2-5*$AJ$26^2/3+3*$AJ$26/2-(1/3))","v":-2.7755575615628914E-16}]
[]
[]
[]
["c.1.6",null,null,null,{"$f":"B30*(3*$B$26^2/2-11*$B$26/6+(1/3))","v":5.7511448272439711E-19},null,null,null,"d.1.6",null,null,null,{"$f":"$J$30*(3*$J$26^2/2-11*$J$26/6+(1/3))","v":2.7627577280991689E-2},null,null,"e.1.6",null,null,null,{"$f":"$Q$30*(3*$Q$26^2/2-11*$Q$26/6+(1/3))","v":8.633617900309902E-2},null,"f.1.6",null,null,null,{"$f":"$W$30*(3*$W$26^2/2-11*$W$26/6+(1/3))","v":8.633617900309902E-2},null,"g.1.6",null,null,null,{"$f":"$AC$30*(3*$AC$26^2/2-11*$AC$26/6+(1/3))","v":1.1502289654487942E-18},null,null,"h.1.6",null,null,null,{"$f":"$AJ$30*(3*$AJ$26^2/2-11*$AJ$26/6+(1/3))","v":5.5255154561983377E-2}]
[]
[]
["c.1.7",null,null,null,{"$f":"B30^2*(3*$B$26/2-(1/6))","v":1.4311556745321896E-4},null,null,null,"d.1.7",null,null,null,{"$f":"J30^2*(3*$J$26/2-(1/6))","v":3.0412058083809031E-4},null,null,"e.1.7",null,null,null,{"$f":"Q30^2*(3*$Q$26/2-(1/6))","v":4.6512559422296162E-4},null,"f.1.7",null,null,null,{"$f":"W30^2*(3*$W$26/2-(1/6))","v":4.6512559422296162E-4},null,"g.1.7",null,null,null,{"$f":"AC30^2*(3*$AC$26/2-(1/6))","v":5.7246226981287585E-4},null,null,"h.1.7",null,null,null,{"$f":"AJ30^2*(3*$AJ$26/2-(1/6))","v":1.2164823233523612E-3}]
[]
[]
[]
["Result1:",null,null,null,{"$f":"C34/C36+C38*(C41+(1/(2*$B$28)^2)*(E43-E47+E50-B30^3/2))","v":1.0202089375138303E-2},null,null,null,"Result2:",null,null,null,{"$f":"K34/K36+K38*(K41+(1/(2*$J$28)^2)*(M43-M47+M50-J30^3/2))","v":1.5552624120982698E-4},null,null,"Result3:",null,null,null,{"$f":"R34/R36+R38*(R41+(1/(2*$Q$28)^2)*(T43-T47+T50-Q30^3/2))","v":2.6070244951543995E-6},null,"Result4:",null,null,null,{"$f":"X34/X36+X38*(X41+(1/(2*$W$28)^2)*(Z43-Z47+Z50-W30^3/2))","v":2.6070244951543995E-6},null,"Result5:",null,null,null,{"$f":"AD34/AD36+AD38*(AD41+(1/(2*$AC$28)^2)*(AF43-AF47+AF50-AC30^3/2))","v":2.0300095816084905E-2},null,null,"Result6:",null,null,null,{"$f":"AK34/AK36+AK38*(AK41+(1/(2*$AC$28)^2)*(AM43-AM47+AM50-AJ30^3/2))","v":4.1196294871088398E-4}]
[]
[]
["1- Calculate",null,null,null,null,{"$f":"(1/2)*$E$54","v":5.1010446875691517E-3}]
[]
[]
[]
["2- Calculate"]
[]
[]
[]
[]
[]
["2.1. Calculate",null,null,{"$f":"1/(6*SQRT(2*$C$20*PI()))","v":3.8388238830148393E-2}]
[]
[]
[]
["2.2. Calculate",null,null,{"$f":"1+(2*C20-1)*C22/(C20-1)","v":18.411391835708184}]
[]
[]
[]
["2.3. Calculate",null,null,null,{"$f":"(1+C22^2/(C20-1))^((C20+1)/2)","v":637.69003162942522}]
[]
[]
[]
["Result:",null,null,null,{"$f":"D67*D71/E75","v":1.1083455470969866E-3}]
[]
[]
[]
["3-Calculate"]
[]
[]
[]
[]
["3.1. Calculate",null,null,null,{"$f":"(C20-1)/(3*SQRT(2*C20*PI()))","v":0.15355295532059357}]
[]
[]
[]
["3.2. Calculate",null,null,null,{"$f":"(2*$C$20-1)/(6*SQRT(2*$C$20*PI()))","v":0.19194119415074196}]
[]
[]
[]
["Result",null,null,null,{"$f":"E92*AF54-E88*AM54","v":3.8331665040566747E-3}]
[]
[]
["4-Calculate"]
[]
[]
["4.1. Calculate",null,null,null,null,{"$f":"((C20-1)/24)*E54","v":8.5017411459485854E-4}]
[]
[]
[]
[]
["4.2. Calculate",null,null,null,null,null,{"$f":"((C20-1)*(C20+2)/(12*C20))*M54","v":4.3201733669396383E-5}]
[]
[]
[]
["4.3. Calculate",null,null,null,null,null,{"$f":"((C20+4)*(C20-1)/(24*C20))*T54","v":5.0692142961335549E-7}]
[]
[]
[]
["Result:",null,null,null,null,null,{"$f":"F102-G107+G111","v":8.0747930235507549E-4}]
[]
[]
["5- Calculate"]
[]
[]
[]
[]
[null,null,null,null,null,null,{"$f":"((C20-1)*(2*C20+5)/72)*E54","v":3.1173050868478153E-3}]
["5.1. Calculate"]
[]
[]
[null,null,null,null,null,null,{"$f":"((C20-1)*(2*C20^2+5*C20+8)/(24*C20))*M54","v":1.7712710804452516E-4}]
["5.2. Calculate"]
[]
[]
[]
["5.3. Calculate",null,null,null,null,null,{"$f":"((C20-1)*(2*C20^2+5*C20+12)/(24*C20))*T54","v":3.2587806189429995E-6}]
[]
[]
[]
["5.4. Calculate",null,null,null,null,null,null,{"$f":"((C20-1)*(2*C20^2+5*C20+12)/(72*C20))*Z54","v":1.0862602063143332E-6}]
[]
[]
[]
[]
["Result",null,{"$f":"G123-G127+G132-H136","v":2.9423504992159189E-3}]
[]
["Corrected probability is::",null,null,null,null,null,null,null,null,{"$f":"F57+H16*E96-H18*G115+(H16^2)*C141","v":2.0219370460541591E-2}]

{"sheet":"Recalculations3 n=3","index":13,"n_rows":143,"n_cols":39,"rows_kept":143,"cut":false,"hidden":false,"merged":[[1,0,1,5],[6,0,6,7],[23,0,23,1],[23,8,23,9],[23,15,23,16],[23,27,23,28],[23,34,23,35],[31,0,31,4],[31,8,31,12],[31,15,31,19],[31,21,31,25],[31,27,31,31],[31,34,31,38],[23,21,23,22]]}
[]
["Calculate u0. Sustitute each candidate t-value in u0 equation",null,null,null,null,null,null,null,"t-statistic=",{"$f":"'Recalculate t-stat n=3'!I5","v":11.254556734283273},null,"u0=",{"$f":"1/(1+$J$2^2/(C20-1))","v":1.5544237088467144E-2}]
[]
[]
[]
[]
["Calculate the Incomplete Beta Functions needed for adjustment"]
[]
["Incomplete Beta Function approximation"]
[]
[]
[]
["where"]
[]
[]
["Inputs",null,null,null,null,"skewness=",null,{"$f":"'Template_nonnormal n=3'!B88","v":1.5877301447567105}]
[]
["x=u0=",null,{"$f":"M2","v":1.5544237088467144E-2},null,null,"kurtosis=",null,{"$f":"'Template_nonnormal n=3'!B85","v":-2.0000000000000004}]
[]
["n=",null,{"$f":"'Template_nonnormal n=3'!$J$152","v":3}]
[]
["t0=t=",null,{"$f":"'Template_nonnormal n=3'!H147","v":6.9645567342832733}]
[]
["c.1.) Calculate ",null,null,null,null,null,null,null,"d.1.) Calculate ",null,null,null,null,null,null,"e.1.) Calculate ",null,null,null,null,null,"f.1.) Calculate ",null,null,null,null,null,"g.1.) Calculate ",null,null,null,null,null,null,"h.1.) Calculate "]
[]
["a=",{"$f":"($C$20-1)/2","v":1},null,null,null,null,null,null,"a=",{"$f":"($C$20+1)/2","v":2},null,null,null,null,null,"a=",{"$f":"($C$20+3)/2","v":3},null,null,null,null,"a=",{"$f":"($C$20+3)/2","v":3},null,null,null,null,"a=",{"$f":"($C$20-1)/2","v":1},null,null,null,null,null,"a=",{"$f":"($C$20+1)/2","v":2}]
[]
["b=",{"$f":"1/2","v":0.5},null,null,null,null,null,null,"b=",{"$f":"1/2","v":0.5},null,null,null,null,null,"b=",{"$f":"1/2","v":0.5},null,null,null,null,"b=",{"$f":"1/2","v":0.5},null,null,null,null,"b=",1,null,null,null,null,null,"b=",1]
[]
["w=",{"$f":"B28*($C$18/(1-$C$18))","v":7.8948377743734196E-3},null,null,null,null,null,null,"w=",{"$f":"J28*($C$18/(1-$C$18))","v":7.8948377743734196E-3},null,null,null,null,null,"w=",{"$f":"Q28*($C$18/(1-$C$18))","v":7.8948377743734196E-3},null,null,null,null,"w=",{"$f":"W28*($C$18/(1-$C$18))","v":7.8948377743734196E-3},null,null,null,null,"w=",{"$f":"AC28*($C$18/(1-$C$18))","v":1.5789675548746839E-2},null,null,null,null,null,"w=",{"$f":"AJ28*($C$18/(1-$C$18))","v":1.5789675548746839E-2}]
[]
["Calculations",null,null,null,null,null,null,null,"Calculations",null,null,null,null,null,null,"Calculations",null,null,null,null,null,"Calculations",null,null,null,null,null,"Calculations",null,null,null,null,null,null,"Calculations"]
[]
["c.1.1. ",null,{"$f":"GAMMADIST($B$30,$B$26, 1, TRUE)","v":7.8637553932773933E-3},null,null,null,null,null,"d.1.1. ",null,{"$f":"GAMMADIST($J$30,$J$26, 1, TRUE)","v":3.1000691958862267E-5},null,null,null,null,"e.1.1. ",null,{"$f":"GAMMADIST($Q$30,$Q$26, 1, TRUE)","v":8.1528110145032729E-8},null,null,null,"f.1.1. ",null,{"$f":"GAMMADIST($W$30,$W$26, 1, TRUE)","v":8.1528110145032729E-8},null,null,null,"g.1.1. ",null,{"$f":"GAMMADIST($AC$30,$AC$26, 1, TRUE)","v":1.5665672130104089E-2},null,null,null,null,"h.1.1. ",null,{"$f":"GAMMADIST($AJ$30,$AJ$26, 1, TRUE)","v":1.2335246906942143E-4}]
[]
["c.1.2. ",null,{"$f":"EXP(GAMMALN($B$26))","v":0.99999999995828404},null,null,null,null,null,"d.1.2. ",null,{"$f":"EXP(GAMMALN($J$26))","v":0.99999999991423216},null,null,null,null,"e.1.2. ",null,{"$f":"EXP(GAMMALN($Q$26))","v":1.9999999997597622},null,null,null,"f.1.2. ",null,{"$f":"EXP(GAMMALN($W$26))","v":1.9999999997597622},null,null,null,"g.1.2. ",null,{"$f":"EXP(GAMMALN($AC$26))","v":0.99999999995828404},null,null,null,null,"h.1.2. ",null,{"$f":"EXP(GAMMALN($AJ$26))","v":0.99999999991423216}]
[]
["c.1.3",null,{"$f":"EXP(-$B$30)*$B$30^$B$26/$C$36","v":7.8327547015734772E-3},null,null,null,null,null,"d.1.3",null,{"$f":"EXP(-$J$30)*$J$30^$J$26/$K$36","v":6.1838327698107392E-5},null,null,null,null,"e.1.3",null,{"$f":"EXP(-$Q$30)*$Q$30^$Q$26/$R$36","v":2.441017827159353E-7},null,null,null,"f.1.3",null,{"$f":"EXP(-$W$30)*$W$30^$W$26/$X$36","v":2.441017827159353E-7},null,null,null,"g.1.3",null,{"$f":"EXP(-$AC$30)*$AC$30^$AC$26/$AD$36","v":1.5542319669090681E-2},null,null,null,null,"h.1.3",null,{"$f":"EXP(-$AJ$30)*$AJ$30^$AJ$26/$AK$36","v":2.4540818486065886E-4}]
[]
[]
["c.1.4.",null,{"$f":"($B$26-1-$B$30)/(2*$B$28)","v":-7.8948377743734196E-3},null,null,null,null,null,"d.1.4.",null,{"$f":"($J$26-1-$J$30)/(2*$J$28)","v":0.99210516222562661},null,null,null,null,"e.1.4.",null,{"$f":"($Q$26-1-$Q$30)/(2*$Q$28)","v":1.9921051622256265},null,null,null,"f.1.4.",null,{"$f":"($W$26-1-$W$30)/(2*$W$28)","v":1.9921051622256265},null,null,null,"g.1.4.",null,{"$f":"($AC$26-1-$AC$30)/(2*$AC$28)","v":-7.8948377743734196E-3},null,null,null,null,"h.1.4.",null,{"$f":"($AJ$26-1-$AJ$30)/(2*$AJ$28)","v":0.49210516222562656}]
[]
["c.1.5.",null,null,null,{"$f":"($B$26^3/2-5*$B$26^2/3+3*$B$26/2-(1/3))","v":-5.5511151231257827E-17},null,null,null,"d.1.5.",null,null,null,{"$f":"($J$26^3/2-5*$J$26^2/3+3*$J$26/2-(1/3))","v":-2.7755575615628914E-16},null,null,"e.1.5.",null,null,null,{"$f":"($Q$26^3/2-5*$Q$26^2/3+3*$Q$26/2-(1/3))","v":2.6666666666666665},null,"f.1.5.",null,null,null,{"$f":"($W$26^3/2-5*$W$26^2/3+3*$W$26/2-(1/3))","v":2.6666666666666665},null,"g.1.5.",null,null,null,{"$f":"($AC$26^3/2-5*$AC$26^2/3+3*$AC$26/2-(1/3))","v":-5.5511151231257827E-17},null,null,"h.1.5.",null,null,null,{"$f":"($AJ$26^3/2-5*$AJ$26^2/3+3*$AJ$26/2-(1/3))","v":-2.7755575615628914E-16}]
[]
[]
[]
["c.1.6",null,null,null,{"$f":"B30*(3*$B$26^2/2-11*$B$26/6+(1/3))","v":4.3825153363948985E-19},null,null,null,"d.1.6",null,null,null,{"$f":"$J$30*(3*$J$26^2/2-11*$J$26/6+(1/3))","v":2.1052900731662456E-2},null,null,"e.1.6",null,null,null,{"$f":"$Q$30*(3*$Q$26^2/2-11*$Q$26/6+(1/3))","v":6.5790314786445162E-2},null,"f.1.6",null,null,null,{"$f":"$W$30*(3*$W$26^2/2-11*$W$26/6+(1/3))","v":6.5790314786445162E-2},null,"g.1.6",null,null,null,{"$f":"$AC$30*(3*$AC$26^2/2-11*$AC$26/6+(1/3))","v":8.7650306727897971E-19},null,null,"h.1.6",null,null,null,{"$f":"$AJ$30*(3*$AJ$26^2/2-11*$AJ$26/6+(1/3))","v":4.2105801463324911E-2}]
[]
[]
["c.1.7",null,null,null,{"$f":"B30^2*(3*$B$26/2-(1/6))","v":8.3104617978231273E-5},null,null,null,"d.1.7",null,null,null,{"$f":"J30^2*(3*$J$26/2-(1/6))","v":1.7659731320374147E-4},null,null,"e.1.7",null,null,null,{"$f":"Q30^2*(3*$Q$26/2-(1/6))","v":2.7009000842925161E-4},null,"f.1.7",null,null,null,{"$f":"W30^2*(3*$W$26/2-(1/6))","v":2.7009000842925161E-4},null,"g.1.7",null,null,null,{"$f":"AC30^2*(3*$AC$26/2-(1/6))","v":3.3241847191292509E-4},null,null,"h.1.7",null,null,null,{"$f":"AJ30^2*(3*$AJ$26/2-(1/6))","v":7.0638925281496588E-4}]
[]
[]
[]
["Result1:",null,null,null,{"$f":"C34/C36+C38*(C41+(1/(2*$B$28)^2)*(E43-E47+E50-B30^3/2))","v":7.8025660768532715E-3},null,null,null,"Result2:",null,null,null,{"$f":"K34/K36+K38*(K41+(1/(2*$J$28)^2)*(M43-M47+M50-J30^3/2))","v":9.1059845187808599E-5},null,null,"Result3:",null,null,null,{"$f":"R34/R36+R38*(R41+(1/(2*$Q$28)^2)*(T43-T47+T50-Q30^3/2))","v":1.1619849000465761E-6},null,"Result4:",null,null,null,{"$f":"X34/X36+X38*(X41+(1/(2*$W$28)^2)*(Z43-Z47+Z50-W30^3/2))","v":1.1619849000465761E-6},null,"Result5:",null,null,null,{"$f":"AD34/AD36+AD38*(AD41+(1/(2*$AC$28)^2)*(AF43-AF47+AF50-AC30^3/2))","v":1.5544252028913725E-2},null,null,"Result6:",null,null,null,{"$f":"AK34/AK36+AK38*(AK41+(1/(2*$AC$28)^2)*(AM43-AM47+AM50-AJ30^3/2))","v":2.4157904429236406E-4}]
[]
[]
["1- Calculate",null,null,null,null,{"$f":"(1/2)*$E$54","v":3.9012830384266358E-3}]
[]
[]
[]
["2- Calculate"]
[]
[]
[]
[]
[]
["2.1. Calculate",null,null,{"$f":"1/(6*SQRT(2*$C$20*PI()))","v":3.8388238830148393E-2}]
[]
[]
[]
["2.2. Calculate",null,null,{"$f":"1+(2*C20-1)*C22/(C20-1)","v":18.411391835708184}]
[]
[]
[]
["2.3. Calculate",null,null,null,{"$f":"(1+C22^2/(C20-1))^((C20+1)/2)","v":637.69003162942522}]
[]
[]
[]
["Result:",null,null,null,{"$f":"D67*D71/E75","v":1.1083455470969866E-3}]
[]
[]
[]
["3-Calculate"]
[]
[]
[]
[]
["3.1. Calculate",null,null,null,{"$f":"(C20-1)/(3*SQRT(2*C20*PI()))","v":0.15355295532059357}]
[]
[]
[]
["3.2. Calculate",null,null,null,{"$f":"(2*$C$20-1)/(6*SQRT(2*$C$20*PI()))","v":0.19194119415074196}]
[]
[]
[]
["Result",null,null,null,{"$f":"E92*AF54-E88*AM54","v":2.9464871204151768E-3}]
[]
[]
["4-Calculate"]
[]
[]
["4.1. Calculate",null,null,null,null,{"$f":"((C20-1)/24)*E54","v":6.5021383973777255E-4}]
[]
[]
[]
[]
["4.2. Calculate",null,null,null,null,null,{"$f":"((C20-1)*(C20+2)/(12*C20))*M54","v":2.5294401441057946E-5}]
[]
[]
[]
["4.3. Calculate",null,null,null,null,null,{"$f":"((C20+4)*(C20-1)/(24*C20))*T54","v":2.2594150834238982E-7}]
[]
[]
[]
["Result:",null,null,null,null,null,{"$f":"F102-G107+G111","v":6.25145379805057E-4}]
[]
[]
["5- Calculate"]
[]
[]
[]
[]
[null,null,null,null,null,null,{"$f":"((C20-1)*(2*C20+5)/72)*E54","v":2.3841174123718331E-3}]
["5.1. Calculate"]
[]
[]
[null,null,null,null,null,null,{"$f":"((C20-1)*(2*C20^2+5*C20+8)/(24*C20))*M54","v":1.0370704590833757E-4}]
["5.2. Calculate"]
[]
[]
[]
["5.3. Calculate",null,null,null,null,null,{"$f":"((C20-1)*(2*C20^2+5*C20+12)/(24*C20))*T54","v":1.4524811250582201E-6}]
[]
[]
[]
["5.4. Calculate",null,null,null,null,null,null,{"$f":"((C20-1)*(2*C20^2+5*C20+12)/(72*C20))*Z54","v":4.8416037501940679E-7}]
[]
[]
[]
[]
["Result",null,{"$f":"G123-G127+G132-H136","v":2.281378687213534E-3}]
[]
["Corrected probability is::",null,null,null,null,null,null,null,null,{"$f":"F57+H16*E96-H18*G115+(H16^2)*C141","v":1.558089812360601E-2}]

{"sheet":"Recalculations4 n=3","index":14,"n_rows":143,"n_cols":39,"rows_kept":143,"cut":false,"hidden":false,"merged":[[1,0,1,5],[6,0,6,7],[23,0,23,1],[23,8,23,9],[23,15,23,16],[23,27,23,28],[23,34,23,35],[31,0,31,4],[31,8,31,12],[31,15,31,19],[31,21,31,25],[31,27,31,31],[31,34,31,38],[23,21,23,22]]}
[]
["Calculate u0. Sustitute each candidate t-value in u0 equation",null,null,null,null,null,null,null,"t-statistic=",{"$f":"'Recalculate t-stat n=3'!J5","v":12.684556734283273},null,"u0=",{"$f":"1/(1+$J$2^2/(C20-1))","v":1.2277623120822218E-2}]
[]
[]
[]
[]
["Calculate the Incomplete Beta Functions needed for adjustment"]
[]
["Incomplete Beta Function approximation"]
[]
[]
[]
["where"]
[]
[]
["Inputs",null,null,null,null,"skewness=",null,{"$f":"'Template_nonnormal n=3'!B88","v":1.5877301447567105}]
[]
["x=u0=",null,{"$f":"M2","v":1.2277623120822218E-2},null,null,"kurtosis=",null,{"$f":"'Template_nonnormal n=3'!B85","v":-2.0000000000000004}]
[]
["n=",null,{"$f":"'Template_nonnormal n=3'!$J$152","v":3}]
[]
["t0=t=",null,{"$f":"'Template_nonnormal n=3'!H147","v":6.9645567342832733}]
[]
["c.1.) Calculate ",null,null,null,null,null,null,null,"d.1.) Calculate ",null,null,null,null,null,null,"e.1.) Calculate ",null,null,null,null,null,"f.1.) Calculate ",null,null,null,null,null,"g.1.) Calculate ",null,null,null,null,null,null,"h.1.) Calculate "]
[]
["a=",{"$f":"($C$20-1)/2","v":1},null,null,null,null,null,null,"a=",{"$f":"($C$20+1)/2","v":2},null,null,null,null,null,"a=",{"$f":"($C$20+3)/2","v":3},null,null,null,null,"a=",{"$f":"($C$20+3)/2","v":3},null,null,null,null,"a=",{"$f":"($C$20-1)/2","v":1},null,null,null,null,null,"a=",{"$f":"($C$20+1)/2","v":2}]
[]
["b=",{"$f":"1/2","v":0.5},null,null,null,null,null,null,"b=",{"$f":"1/2","v":0.5},null,null,null,null,null,"b=",{"$f":"1/2","v":0.5},null,null,null,null,"b=",{"$f":"1/2","v":0.5},null,null,null,null,"b=",1,null,null,null,null,null,"b=",1]
[]
["w=",{"$f":"B28*($C$18/(1-$C$18))","v":6.2151184422969026E-3},null,null,null,null,null,null,"w=",{"$f":"J28*($C$18/(1-$C$18))","v":6.2151184422969026E-3},null,null,null,null,null,"w=",{"$f":"Q28*($C$18/(1-$C$18))","v":6.2151184422969026E-3},null,null,null,null,"w=",{"$f":"W28*($C$18/(1-$C$18))","v":6.2151184422969026E-3},null,null,null,null,"w=",{"$f":"AC28*($C$18/(1-$C$18))","v":1.2430236884593805E-2},null,null,null,null,null,"w=",{"$f":"AJ28*($C$18/(1-$C$18))","v":1.2430236884593805E-2}]
[]
["Calculations",null,null,null,null,null,null,null,"Calculations",null,null,null,null,null,null,"Calculations",null,null,null,null,null,"Calculations",null,null,null,null,null,"Calculations",null,null,null,null,null,null,"Calculations"]
[]
["c.1.1. ",null,{"$f":"GAMMADIST($B$30,$B$26, 1, TRUE)","v":6.1958445443779349E-3},null,null,null,null,null,"d.1.1. ",null,{"$f":"GAMMADIST($J$30,$J$26, 1, TRUE)","v":1.9234009593257038E-5},null,null,null,null,"e.1.1. ",null,{"$f":"GAMMADIST($Q$30,$Q$26, 1, TRUE)","v":3.9826569438332756E-8},null,null,null,"f.1.1. ",null,{"$f":"GAMMADIST($W$30,$W$26, 1, TRUE)","v":3.9826569438332756E-8},null,null,null,"g.1.1. ",null,{"$f":"GAMMADIST($AC$30,$AC$26, 1, TRUE)","v":1.235330059684471E-2},null,null,null,null,"h.1.1. ",null,{"$f":"GAMMADIST($AJ$30,$AJ$26, 1, TRUE)","v":7.6618166933940796E-5}]
[]
["c.1.2. ",null,{"$f":"EXP(GAMMALN($B$26))","v":0.99999999995828404},null,null,null,null,null,"d.1.2. ",null,{"$f":"EXP(GAMMALN($J$26))","v":0.99999999991423216},null,null,null,null,"e.1.2. ",null,{"$f":"EXP(GAMMALN($Q$26))","v":1.9999999997597622},null,null,null,"f.1.2. ",null,{"$f":"EXP(GAMMALN($W$26))","v":1.9999999997597622},null,null,null,"g.1.2. ",null,{"$f":"EXP(GAMMALN($AC$26))","v":0.99999999995828404},null,null,null,null,"h.1.2. ",null,{"$f":"EXP(GAMMALN($AJ$26))","v":0.99999999991423216}]
[]
["c.1.3",null,{"$f":"EXP(-$B$30)*$B$30^$B$26/$C$36","v":6.1766105348623271E-3},null,null,null,null,null,"d.1.3",null,{"$f":"EXP(-$J$30)*$J$30^$J$26/$K$36","v":3.8388366047799255E-5},null,null,null,null,"e.1.3",null,{"$f":"EXP(-$Q$30)*$Q$30^$Q$26/$R$36","v":1.192941209007586E-7},null,null,null,"f.1.3",null,{"$f":"EXP(-$W$30)*$W$30^$W$26/$X$36","v":1.192941209007586E-7},null,null,null,"g.1.3",null,{"$f":"EXP(-$AC$30)*$AC$30^$AC$26/$AD$36","v":1.2276682432356549E-2},null,null,null,null,"h.1.3",null,{"$f":"EXP(-$AJ$30)*$AJ$30^$AJ$26/$AK$36","v":1.5260207079784556E-4}]
[]
[]
["c.1.4.",null,{"$f":"($B$26-1-$B$30)/(2*$B$28)","v":-6.2151184422969026E-3},null,null,null,null,null,"d.1.4.",null,{"$f":"($J$26-1-$J$30)/(2*$J$28)","v":0.99378488155770306},null,null,null,null,"e.1.4.",null,{"$f":"($Q$26-1-$Q$30)/(2*$Q$28)","v":1.9937848815577031},null,null,null,"f.1.4.",null,{"$f":"($W$26-1-$W$30)/(2*$W$28)","v":1.9937848815577031},null,null,null,"g.1.4.",null,{"$f":"($AC$26-1-$AC$30)/(2*$AC$28)","v":-6.2151184422969026E-3},null,null,null,null,"h.1.4.",null,{"$f":"($AJ$26-1-$AJ$30)/(2*$AJ$28)","v":0.49378488155770311}]
[]
["c.1.5.",null,null,null,{"$f":"($B$26^3/2-5*$B$26^2/3+3*$B$26/2-(1/3))","v":-5.5511151231257827E-17},null,null,null,"d.1.5.",null,null,null,{"$f":"($J$26^3/2-5*$J$26^2/3+3*$J$26/2-(1/3))","v":-2.7755575615628914E-16},null,null,"e.1.5.",null,null,null,{"$f":"($Q$26^3/2-5*$Q$26^2/3+3*$Q$26/2-(1/3))","v":2.6666666666666665},null,"f.1.5.",null,null,null,{"$f":"($W$26^3/2-5*$W$26^2/3+3*$W$26/2-(1/3))","v":2.6666666666666665},null,"g.1.5.",null,null,null,{"$f":"($AC$26^3/2-5*$AC$26^2/3+3*$AC$26/2-(1/3))","v":-5.5511151231257827E-17},null,null,"h.1.5.",null,null,null,{"$f":"($AJ$26^3/2-5*$AJ$26^2/3+3*$AJ$26/2-(1/3))","v":-2.7755575615628914E-16}]
[]
[]
[]
["c.1.6",null,null,null,{"$f":"B30*(3*$B$26^2/2-11*$B$26/6+(1/3))","v":3.4500837977052293E-19},null,null,null,"d.1.6",null,null,null,{"$f":"$J$30*(3*$J$26^2/2-11*$J$26/6+(1/3))","v":1.6573649179458409E-2},null,null,"e.1.6",null,null,null,{"$f":"$Q$30*(3*$Q$26^2/2-11*$Q$26/6+(1/3))","v":5.1792653685807523E-2},null,"f.1.6",null,null,null,{"$f":"$W$30*(3*$W$26^2/2-11*$W$26/6+(1/3))","v":5.1792653685807523E-2},null,"g.1.6",null,null,null,{"$f":"$AC$30*(3*$AC$26^2/2-11*$AC$26/6+(1/3))","v":6.9001675954104587E-19},null,null,"h.1.6",null,null,null,{"$f":"$AJ$30*(3*$AJ$26^2/2-11*$AJ$26/6+(1/3))","v":3.3147298358916819E-2}]
[]
[]
["c.1.7",null,null,null,{"$f":"B30^2*(3*$B$26/2-(1/6))","v":5.150359633570543E-5},null,null,null,"d.1.7",null,null,null,{"$f":"J30^2*(3*$J$26/2-(1/6))","v":1.0944514221337405E-4},null,null,"e.1.7",null,null,null,{"$f":"Q30^2*(3*$Q$26/2-(1/6))","v":1.6738668809104264E-4},null,"f.1.7",null,null,null,{"$f":"W30^2*(3*$W$26/2-(1/6))","v":1.6738668809104264E-4},null,"g.1.7",null,null,null,{"$f":"AC30^2*(3*$AC$26/2-(1/6))","v":2.0601438534282172E-4},null,null,"h.1.7",null,null,null,{"$f":"AJ30^2*(3*$AJ$26/2-(1/6))","v":4.3778056885349618E-4}]
[]
[]
[]
["Result1:",null,null,null,{"$f":"C34/C36+C38*(C41+(1/(2*$B$28)^2)*(E43-E47+E50-B30^3/2))","v":6.1577735548189122E-3},null,null,null,"Result2:",null,null,null,{"$f":"K34/K36+K38*(K41+(1/(2*$J$28)^2)*(M43-M47+M50-J30^3/2))","v":5.6751748901588014E-5},null,null,"Result3:",null,null,null,{"$f":"R34/R36+R38*(R41+(1/(2*$Q$28)^2)*(T43-T47+T50-Q30^3/2))","v":5.6971915000499382E-7},null,"Result4:",null,null,null,{"$f":"X34/X36+X38*(X41+(1/(2*$W$28)^2)*(Z43-Z47+Z50-W30^3/2))","v":5.6971915000499382E-7},null,"Result5:",null,null,null,{"$f":"AD34/AD36+AD38*(AD41+(1/(2*$AC$28)^2)*(AF43-AF47+AF50-AC30^3/2))","v":1.227762890792752E-2},null,null,"Result6:",null,null,null,{"$f":"AK34/AK36+AK38*(AK41+(1/(2*$AC$28)^2)*(AM43-AM47+AM50-AJ30^3/2))","v":1.5072284072144485E-4}]
[]
[]
["1- Calculate",null,null,null,null,{"$f":"(1/2)*$E$54","v":3.0788867774094561E-3}]
[]
[]
[]
["2- Calculate"]
[]
[]
[]
[]
[]
["2.1. Calculate",null,null,{"$f":"1/(6*SQRT(2*$C$20*PI()))","v":3.8388238830148393E-2}]
[]
[]
[]
["2.2. Calculate",null,null,{"$f":"1+(2*C20-1)*C22/(C20-1)","v":18.411391835708184}]
[]
[]
[]
["2.3. Calculate",null,null,null,{"$f":"(1+C22^2/(C20-1))^((C20+1)/2)","v":637.69003162942522}]
[]
[]
[]
["Result:",null,null,null,{"$f":"D67*D71/E75","v":1.1083455470969866E-3}]
[]
[]
[]
["3-Calculate"]
[]
[]
[]
[]
["3.1. Calculate",null,null,null,{"$f":"(C20-1)/(3*SQRT(2*C20*PI()))","v":0.15355295532059357}]
[]
[]
[]
["3.2. Calculate",null,null,null,{"$f":"(2*$C$20-1)/(6*SQRT(2*$C$20*PI()))","v":0.19194119415074196}]
[]
[]
[]
["Result",null,null,null,{"$f":"E92*AF54-E88*AM54","v":2.3334388163001852E-3}]
[]
[]
["4-Calculate"]
[]
[]
["4.1. Calculate",null,null,null,null,{"$f":"((C20-1)/24)*E54","v":5.1314779623490932E-4}]
[]
[]
[]
[]
["4.2. Calculate",null,null,null,null,null,{"$f":"((C20-1)*(C20+2)/(12*C20))*M54","v":1.5764374694885559E-5}]
[]
[]
[]
["4.3. Calculate",null,null,null,null,null,{"$f":"((C20+4)*(C20-1)/(24*C20))*T54","v":1.1077872361208213E-7}]
[]
[]
[]
["Result:",null,null,null,null,null,{"$f":"F102-G107+G111","v":4.9749420026363577E-4}]
[]
[]
["5- Calculate"]
[]
[]
[]
[]
[null,null,null,null,null,null,{"$f":"((C20-1)*(2*C20+5)/72)*E54","v":1.8815419195280011E-3}]
["5.1. Calculate"]
[]
[]
[null,null,null,null,null,null,{"$f":"((C20-1)*(2*C20^2+5*C20+8)/(24*C20))*M54","v":6.4633936249030793E-5}]
["5.2. Calculate"]
[]
[]
[]
["5.3. Calculate",null,null,null,null,null,{"$f":"((C20-1)*(2*C20^2+5*C20+12)/(24*C20))*T54","v":7.1214893750624225E-7}]
[]
[]
[]
["5.4. Calculate",null,null,null,null,null,null,{"$f":"((C20-1)*(2*C20^2+5*C20+12)/(72*C20))*Z54","v":2.3738297916874744E-7}]
[]
[]
[]
[]
["Result",null,{"$f":"G123-G127+G132-H136","v":1.8173827492373078E-3}]
[]
["Corrected probability is::",null,null,null,null,null,null,null,null,{"$f":"F57+H16*E96-H18*G115+(H16^2)*C141","v":1.2360162896941522E-2}]

{"sheet":"Recalculations5 n<3","index":15,"n_rows":143,"n_cols":39,"rows_kept":143,"cut":false,"hidden":false,"merged":[[1,0,1,5],[6,0,6,7],[23,0,23,1],[23,8,23,9],[23,15,23,16],[23,27,23,28],[23,34,23,35],[31,0,31,4],[31,8,31,12],[31,15,31,19],[31,21,31,25],[31,27,31,31],[31,34,31,38],[23,21,23,22]]}
[]
["Calculate u0. Sustitute each candidate t-value in u0 equation",null,null,null,null,null,null,null,"t-statistic=",{"$f":"'Recalculate t-stat n=3'!K5","v":14.114556734283273},null,"u0=",{"$f":"1/(1+$J$2^2/(C20-1))","v":9.9393346840715678E-3}]
[]
[]
[]
[]
["Calculate the Incomplete Beta Functions needed for adjustment"]
[]
["Incomplete Beta Function approximation"]
[]
[]
[]
["where"]
[]
[]
["Inputs",null,null,null,null,"skewness=",null,{"$f":"'Template_nonnormal n=3'!B88","v":1.5877301447567105}]
[]
["x=u0=",null,{"$f":"M2","v":9.9393346840715678E-3},null,null,"kurtosis=",null,{"$f":"'Template_nonnormal n=3'!B85","v":-2.0000000000000004}]
[]
["n=",null,{"$f":"'Template_nonnormal n=3'!$J$152","v":3}]
[]
["t0=t=",null,{"$f":"'Template_nonnormal n=3'!H147","v":6.9645567342832733}]
[]
["c.1.) Calculate ",null,null,null,null,null,null,null,"d.1.) Calculate ",null,null,null,null,null,null,"e.1.) Calculate ",null,null,null,null,null,"f.1.) Calculate ",null,null,null,null,null,"g.1.) Calculate ",null,null,null,null,null,null,"h.1.) Calculate "]
[]
["a=",{"$f":"($C$20-1)/2","v":1},null,null,null,null,null,null,"a=",{"$f":"($C$20+1)/2","v":2},null,null,null,null,null,"a=",{"$f":"($C$20+3)/2","v":3},null,null,null,null,"a=",{"$f":"($C$20+3)/2","v":3},null,null,null,null,"a=",{"$f":"($C$20-1)/2","v":1},null,null,null,null,null,"a=",{"$f":"($C$20+1)/2","v":2}]
[]
["b=",{"$f":"1/2","v":0.5},null,null,null,null,null,null,"b=",{"$f":"1/2","v":0.5},null,null,null,null,null,"b=",{"$f":"1/2","v":0.5},null,null,null,null,"b=",{"$f":"1/2","v":0.5},null,null,null,null,"b=",1,null,null,null,null,null,"b=",1]
[]
["w=",{"$f":"B28*($C$18/(1-$C$18))","v":5.0195584130695295E-3},null,null,null,null,null,null,"w=",{"$f":"J28*($C$18/(1-$C$18))","v":5.0195584130695295E-3},null,null,null,null,null,"w=",{"$f":"Q28*($C$18/(1-$C$18))","v":5.0195584130695295E-3},null,null,null,null,"w=",{"$f":"W28*($C$18/(1-$C$18))","v":5.0195584130695295E-3},null,null,null,null,"w=",{"$f":"AC28*($C$18/(1-$C$18))","v":1.0039116826139059E-2},null,null,null,null,null,"w=",{"$f":"AJ28*($C$18/(1-$C$18))","v":1.0039116826139059E-2}]
[]
["Calculations",null,null,null,null,null,null,null,"Calculations",null,null,null,null,null,null,"Calculations",null,null,null,null,null,"Calculations",null,null,null,null,null,"Calculations",null,null,null,null,null,null,"Calculations"]
[]
["c.1.1. ",null,{"$f":"GAMMADIST($B$30,$B$26, 1, TRUE)","v":5.0069814822669223E-3},null,null,null,null,null,"d.1.1. ",null,{"$f":"GAMMADIST($J$30,$J$26, 1, TRUE)","v":1.2555905038501389E-5},null,null,null,null,"e.1.1. ",null,{"$f":"GAMMADIST($Q$30,$Q$26, 1, TRUE)","v":2.0999575591045038E-8},null,null,null,"f.1.1. ",null,{"$f":"GAMMADIST($W$30,$W$26, 1, TRUE)","v":2.0999575591045038E-8},null,null,null,"g.1.1. ",null,{"$f":"GAMMADIST($AC$30,$AC$26, 1, TRUE)","v":9.9888931001810687E-3},null,null,null,null,"h.1.1. ",null,{"$f":"GAMMADIST($AJ$30,$AJ$26, 1, TRUE)","v":5.0055939271687244E-5}]
[]
["c.1.2. ",null,{"$f":"EXP(GAMMALN($B$26))","v":0.99999999995828404},null,null,null,null,null,"d.1.2. ",null,{"$f":"EXP(GAMMALN($J$26))","v":0.99999999991423216},null,null,null,null,"e.1.2. ",null,{"$f":"EXP(GAMMALN($Q$26))","v":1.9999999997597622},null,null,null,"f.1.2. ",null,{"$f":"EXP(GAMMALN($W$26))","v":1.9999999997597622},null,null,null,"g.1.2. ",null,{"$f":"EXP(GAMMALN($AC$26))","v":0.99999999995828404},null,null,null,null,"h.1.2. ",null,{"$f":"EXP(GAMMALN($AJ$26))","v":0.99999999991423216}]
[]
["c.1.3",null,{"$f":"EXP(-$B$30)*$B$30^$B$26/$C$36","v":4.9944255772553965E-3},null,null,null,null,null,"d.1.3",null,{"$f":"EXP(-$J$30)*$J$30^$J$26/$K$36","v":2.5069810925866337E-5},null,null,null,null,"e.1.3",null,{"$f":"EXP(-$Q$30)*$Q$30^$Q$26/$R$36","v":6.2919690175658749E-8},null,null,null,"f.1.3",null,{"$f":"EXP(-$W$30)*$W$30^$W$26/$X$36","v":6.2919690175658749E-8},null,null,null,"g.1.3",null,{"$f":"EXP(-$AC$30)*$AC$30^$AC$26/$AD$36","v":9.9388371617528583E-3},null,null,null,null,"h.1.3",null,{"$f":"EXP(-$AJ$30)*$AJ$30^$AJ$26/$AK$36","v":9.9777147387204658E-5}]
[]
[]
["c.1.4.",null,{"$f":"($B$26-1-$B$30)/(2*$B$28)","v":-5.0195584130695295E-3},null,null,null,null,null,"d.1.4.",null,{"$f":"($J$26-1-$J$30)/(2*$J$28)","v":0.99498044158693044},null,null,null,null,"e.1.4.",null,{"$f":"($Q$26-1-$Q$30)/(2*$Q$28)","v":1.9949804415869306},null,null,null,"f.1.4.",null,{"$f":"($W$26-1-$W$30)/(2*$W$28)","v":1.9949804415869306},null,null,null,"g.1.4.",null,{"$f":"($AC$26-1-$AC$30)/(2*$AC$28)","v":-5.0195584130695295E-3},null,null,null,null,"h.1.4.",null,{"$f":"($AJ$26-1-$AJ$30)/(2*$AJ$28)","v":0.4949804415869305}]
[]
["c.1.5.",null,null,null,{"$f":"($B$26^3/2-5*$B$26^2/3+3*$B$26/2-(1/3))","v":-5.5511151231257827E-17},null,null,null,"d.1.5.",null,null,null,{"$f":"($J$26^3/2-5*$J$26^2/3+3*$J$26/2-(1/3))","v":-2.7755575615628914E-16},null,null,"e.1.5.",null,null,null,{"$f":"($Q$26^3/2-5*$Q$26^2/3+3*$Q$26/2-(1/3))","v":2.6666666666666665},null,"f.1.5.",null,null,null,{"$f":"($W$26^3/2-5*$W$26^2/3+3*$W$26/2-(1/3))","v":2.6666666666666665},null,"g.1.5.",null,null,null,{"$f":"($AC$26^3/2-5*$AC$26^2/3+3*$AC$26/2-(1/3))","v":-5.5511151231257827E-17},null,null,"h.1.5.",null,null,null,{"$f":"($AJ$26^3/2-5*$AJ$26^2/3+3*$AJ$26/2-(1/3))","v":-2.7755575615628914E-16}]
[]
[]
[]
["c.1.6",null,null,null,{"$f":"B30*(3*$B$26^2/2-11*$B$26/6+(1/3))","v":2.7864146618203519E-19},null,null,null,"d.1.6",null,null,null,{"$f":"$J$30*(3*$J$26^2/2-11*$J$26/6+(1/3))","v":1.3385489101518747E-2},null,null,"e.1.6",null,null,null,{"$f":"$Q$30*(3*$Q$26^2/2-11*$Q$26/6+(1/3))","v":4.1829653442246081E-2},null,"f.1.6",null,null,null,{"$f":"$W$30*(3*$W$26^2/2-11*$W$26/6+(1/3))","v":4.1829653442246081E-2},null,"g.1.6",null,null,null,{"$f":"$AC$30*(3*$AC$26^2/2-11*$AC$26/6+(1/3))","v":5.5728293236407039E-19},null,null,"h.1.6",null,null,null,{"$f":"$AJ$30*(3*$AJ$26^2/2-11*$AJ$26/6+(1/3))","v":2.6770978203037494E-2}]
[]
[]
["c.1.7",null,null,null,{"$f":"B30^2*(3*$B$26/2-(1/6))","v":3.3594622216289455E-5},null,null,null,"d.1.7",null,null,null,{"$f":"J30^2*(3*$J$26/2-(1/6))","v":7.1388572209615101E-5},null,null,"e.1.7",null,null,null,{"$f":"Q30^2*(3*$Q$26/2-(1/6))","v":1.0918252220294072E-4},null,"f.1.7",null,null,null,{"$f":"W30^2*(3*$W$26/2-(1/6))","v":1.0918252220294072E-4},null,"g.1.7",null,null,null,{"$f":"AC30^2*(3*$AC$26/2-(1/6))","v":1.3437848886515782E-4},null,null,"h.1.7",null,null,null,{"$f":"AJ30^2*(3*$AJ$26/2-(1/6))","v":2.855542888384604E-4}]
[]
[]
[]
["Result1:",null,null,null,{"$f":"C34/C36+C38*(C41+(1/(2*$B$28)^2)*(E43-E47+E50-B30^3/2))","v":4.9820791415624262E-3},null,null,null,"Result2:",null,null,null,{"$f":"K34/K36+K38*(K41+(1/(2*$J$28)^2)*(M43-M47+M50-J30^3/2))","v":3.7166093016857444E-5},null,null,"Result3:",null,null,null,{"$f":"R34/R36+R38*(R41+(1/(2*$Q$28)^2)*(T43-T47+T50-Q30^3/2))","v":3.0118413647327465E-7},null,"Result4:",null,null,null,{"$f":"X34/X36+X38*(X41+(1/(2*$W$28)^2)*(Z43-Z47+Z50-W30^3/2))","v":3.0118413647327465E-7},null,"Result5:",null,null,null,{"$f":"AD34/AD36+AD38*(AD41+(1/(2*$AC$28)^2)*(AF43-AF47+AF50-AC30^3/2))","v":9.9393371613952387E-3},null,null,"Result6:",null,null,null,{"$f":"AK34/AK36+AK38*(AK41+(1/(2*$AC$28)^2)*(AM43-AM47+AM50-AJ30^3/2))","v":9.8783003119530438E-5}]
[]
[]
["1- Calculate",null,null,null,null,{"$f":"(1/2)*$E$54","v":2.4910395707812131E-3}]
[]
[]
[]
["2- Calculate"]
[]
[]
[]
[]
[]
["2.1. Calculate",null,null,{"$f":"1/(6*SQRT(2*$C$20*PI()))","v":3.8388238830148393E-2}]
[]
[]
[]
["2.2. Calculate",null,null,{"$f":"1+(2*C20-1)*C22/(C20-1)","v":18.411391835708184}]
[]
[]
[]
["2.3. Calculate",null,null,null,{"$f":"(1+C22^2/(C20-1))^((C20+1)/2)","v":637.69003162942522}]
[]
[]
[]
["Result:",null,null,null,{"$f":"D67*D71/E75","v":1.1083455470969866E-3}]
[]
[]
[]
["3-Calculate"]
[]
[]
[]
[]
["3.1. Calculate",null,null,null,{"$f":"(C20-1)/(3*SQRT(2*C20*PI()))","v":0.15355295532059357}]
[]
[]
[]
["3.2. Calculate",null,null,null,{"$f":"(2*$C$20-1)/(6*SQRT(2*$C$20*PI()))","v":0.19194119415074196}]
[]
[]
[]
["Result",null,null,null,{"$f":"E92*AF54-E88*AM54","v":1.8925998217606008E-3}]
[]
[]
["4-Calculate"]
[]
[]
["4.1. Calculate",null,null,null,null,{"$f":"((C20-1)/24)*E54","v":4.1517326179686881E-4}]
[]
[]
[]
[]
["4.2. Calculate",null,null,null,null,null,{"$f":"((C20-1)*(C20+2)/(12*C20))*M54","v":1.0323914726904845E-5}]
[]
[]
[]
["4.3. Calculate",null,null,null,null,null,{"$f":"((C20+4)*(C20-1)/(24*C20))*T54","v":5.856358209202563E-8}]
[]
[]
[]
["Result:",null,null,null,null,null,{"$f":"F102-G107+G111","v":4.0490791065205597E-4}]
[]
[]
["5- Calculate"]
[]
[]
[]
[]
[null,null,null,null,null,null,{"$f":"((C20-1)*(2*C20+5)/72)*E54","v":1.5223019599218525E-3}]
["5.1. Calculate"]
[]
[]
[null,null,null,null,null,null,{"$f":"((C20-1)*(2*C20^2+5*C20+8)/(24*C20))*M54","v":4.2328050380309867E-5}]
["5.2. Calculate"]
[]
[]
[]
["5.3. Calculate",null,null,null,null,null,{"$f":"((C20-1)*(2*C20^2+5*C20+12)/(24*C20))*T54","v":3.764801705915933E-7}]
[]
[]
[]
["5.4. Calculate",null,null,null,null,null,null,{"$f":"((C20-1)*(2*C20^2+5*C20+12)/(72*C20))*Z54","v":1.2549339019719778E-7}]
[]
[]
[]
[]
["Result",null,{"$f":"G123-G127+G132-H136","v":1.4802248963219371E-3}]
[]
["Corrected probability is::",null,null,null,null,null,null,null,null,{"$f":"F57+H16*E96-H18*G115+(H16^2)*C141","v":1.0037272897875317E-2}]

{"sheet":"Recalculations6 n=3","index":16,"n_rows":143,"n_cols":39,"rows_kept":143,"cut":false,"hidden":false,"merged":[[1,0,1,5],[6,0,6,7],[23,0,23,1],[23,8,23,9],[23,15,23,16],[23,27,23,28],[23,34,23,35],[31,0,31,4],[31,8,31,12],[31,15,31,19],[31,21,31,25],[31,27,31,31],[31,34,31,38],[23,21,23,22]]}
[]
["Calculate u0. Sustitute each candidate t-value in u0 equation",null,null,null,null,null,null,null,"t-statistic=",{"$f":"'Recalculate t-stat n=3'!L5","v":15.544556734283272},null,"u0=",{"$f":"1/(1+$J$2^2/(C20-1))","v":8.2090603344079187E-3}]
[]
[]
[]
[]
["Calculate the Incomplete Beta Functions needed for adjustment"]
[]
["Incomplete Beta Function approximation"]
[]
[]
[]
["where"]
[]
[]
["Inputs",null,null,null,null,"skewness=",null,{"$f":"'Template_nonnormal n=3'!B88","v":1.5877301447567105}]
[]
["x=u0=",null,{"$f":"M2","v":8.2090603344079187E-3},null,null,"kurtosis=",null,{"$f":"'Template_nonnormal n=3'!B85","v":-2.0000000000000004}]
[]
["n=",null,{"$f":"'Template_nonnormal n=3'!$J$152","v":3}]
[]
["t0=t=",null,{"$f":"'Template_nonnormal n=3'!H147","v":6.9645567342832733}]
[]
["c.1.) Calculate ",null,null,null,null,null,null,null,"d.1.) Calculate ",null,null,null,null,null,null,"e.1.) Calculate ",null,null,null,null,null,"f.1.) Calculate ",null,null,null,null,null,"g.1.) Calculate ",null,null,null,null,null,null,"h.1.) Calculate "]
[]
["a=",{"$f":"($C$20-1)/2","v":1},null,null,null,null,null,null,"a=",{"$f":"($C$20+1)/2","v":2},null,null,null,null,null,"a=",{"$f":"($C$20+3)/2","v":3},null,null,null,null,"a=",{"$f":"($C$20+3)/2","v":3},null,null,null,null,"a=",{"$f":"($C$20-1)/2","v":1},null,null,null,null,null,"a=",{"$f":"($C$20+1)/2","v":2}]
[]
["b=",{"$f":"1/2","v":0.5},null,null,null,null,null,null,"b=",{"$f":"1/2","v":0.5},null,null,null,null,null,"b=",{"$f":"1/2","v":0.5},null,null,null,null,"b=",{"$f":"1/2","v":0.5},null,null,null,null,"b=",1,null,null,null,null,null,"b=",1]
[]
["w=",{"$f":"B28*($C$18/(1-$C$18))","v":4.1385033912367739E-3},null,null,null,null,null,null,"w=",{"$f":"J28*($C$18/(1-$C$18))","v":4.1385033912367739E-3},null,null,null,null,null,"w=",{"$f":"Q28*($C$18/(1-$C$18))","v":4.1385033912367739E-3},null,null,null,null,"w=",{"$f":"W28*($C$18/(1-$C$18))","v":4.1385033912367739E-3},null,null,null,null,"w=",{"$f":"AC28*($C$18/(1-$C$18))","v":8.2770067824735477E-3},null,null,null,null,null,"w=",{"$f":"AJ28*($C$18/(1-$C$18))","v":8.2770067824735477E-3}]
[]
["Calculations",null,null,null,null,null,null,null,"Calculations",null,null,null,null,null,null,"Calculations",null,null,null,null,null,"Calculations",null,null,null,null,null,"Calculations",null,null,null,null,null,null,"Calculations"]
[]
["c.1.1. ",null,{"$f":"GAMMADIST($B$30,$B$26, 1, TRUE)","v":4.1299515875298917E-3},null,null,null,null,null,"d.1.1. ",null,{"$f":"GAMMADIST($J$30,$J$26, 1, TRUE)","v":8.540014781603448E-6},null,null,null,null,"e.1.1. ",null,{"$f":"GAMMADIST($Q$30,$Q$26, 1, TRUE)","v":1.1776895962859407E-8},null,null,null,"f.1.1. ",null,{"$f":"GAMMADIST($W$30,$W$26, 1, TRUE)","v":1.1776895962859407E-8},null,null,null,"g.1.1. ",null,{"$f":"GAMMADIST($AC$30,$AC$26, 1, TRUE)","v":8.2428466746437227E-3},null,null,null,null,"h.1.1. ",null,{"$f":"GAMMADIST($AJ$30,$AJ$26, 1, TRUE)","v":3.406598998303427E-5}]
[]
["c.1.2. ",null,{"$f":"EXP(GAMMALN($B$26))","v":0.99999999995828404},null,null,null,null,null,"d.1.2. ",null,{"$f":"EXP(GAMMALN($J$26))","v":0.99999999991423216},null,null,null,null,"e.1.2. ",null,{"$f":"EXP(GAMMALN($Q$26))","v":1.9999999997597622},null,null,null,"f.1.2. ",null,{"$f":"EXP(GAMMALN($W$26))","v":1.9999999997597622},null,null,null,"g.1.2. ",null,{"$f":"EXP(GAMMALN($AC$26))","v":0.99999999995828404},null,null,null,null,"h.1.2. ",null,{"$f":"EXP(GAMMALN($AJ$26))","v":0.99999999991423216}]
[]
["c.1.3",null,{"$f":"EXP(-$B$30)*$B$30^$B$26/$C$36","v":4.1214115727587373E-3},null,null,null,null,null,"d.1.3",null,{"$f":"EXP(-$J$30)*$J$30^$J$26/$K$36","v":1.7056475771295889E-5},null,null,null,null,"e.1.3",null,{"$f":"EXP(-$Q$30)*$Q$30^$Q$26/$R$36","v":3.5294141412240341E-8},null,null,null,"f.1.3",null,{"$f":"EXP(-$W$30)*$W$30^$W$26/$X$36","v":3.5294141412240341E-8},null,null,null,"g.1.3",null,{"$f":"EXP(-$AC$30)*$AC$30^$AC$26/$AD$36","v":8.2087806849832547E-3},null,null,null,null,"h.1.3",null,{"$f":"EXP(-$AJ$30)*$AJ$30^$AJ$26/$AK$36","v":6.7944133408437318E-5}]
[]
[]
["c.1.4.",null,{"$f":"($B$26-1-$B$30)/(2*$B$28)","v":-4.1385033912367739E-3},null,null,null,null,null,"d.1.4.",null,{"$f":"($J$26-1-$J$30)/(2*$J$28)","v":0.99586149660876322},null,null,null,null,"e.1.4.",null,{"$f":"($Q$26-1-$Q$30)/(2*$Q$28)","v":1.9958614966087633},null,null,null,"f.1.4.",null,{"$f":"($W$26-1-$W$30)/(2*$W$28)","v":1.9958614966087633},null,null,null,"g.1.4.",null,{"$f":"($AC$26-1-$AC$30)/(2*$AC$28)","v":-4.1385033912367739E-3},null,null,null,null,"h.1.4.",null,{"$f":"($AJ$26-1-$AJ$30)/(2*$AJ$28)","v":0.49586149660876322}]
[]
["c.1.5.",null,null,null,{"$f":"($B$26^3/2-5*$B$26^2/3+3*$B$26/2-(1/3))","v":-5.5511151231257827E-17},null,null,null,"d.1.5.",null,null,null,{"$f":"($J$26^3/2-5*$J$26^2/3+3*$J$26/2-(1/3))","v":-2.7755575615628914E-16},null,null,"e.1.5.",null,null,null,{"$f":"($Q$26^3/2-5*$Q$26^2/3+3*$Q$26/2-(1/3))","v":2.6666666666666665},null,"f.1.5.",null,null,null,{"$f":"($W$26^3/2-5*$W$26^2/3+3*$W$26/2-(1/3))","v":2.6666666666666665},null,"g.1.5.",null,null,null,{"$f":"($AC$26^3/2-5*$AC$26^2/3+3*$AC$26/2-(1/3))","v":-5.5511151231257827E-17},null,null,"h.1.5.",null,null,null,{"$f":"($AJ$26^3/2-5*$AJ$26^2/3+3*$AJ$26/2-(1/3))","v":-2.7755575615628914E-16}]
[]
[]
[]
["c.1.6",null,null,null,{"$f":"B30*(3*$B$26^2/2-11*$B$26/6+(1/3))","v":2.2973308762201793E-19},null,null,null,"d.1.6",null,null,null,{"$f":"$J$30*(3*$J$26^2/2-11*$J$26/6+(1/3))","v":1.1036009043298064E-2},null,null,"e.1.6",null,null,null,{"$f":"$Q$30*(3*$Q$26^2/2-11*$Q$26/6+(1/3))","v":3.4487528260306453E-2},null,"f.1.6",null,null,null,{"$f":"$W$30*(3*$W$26^2/2-11*$W$26/6+(1/3))","v":3.4487528260306453E-2},null,"g.1.6",null,null,null,{"$f":"$AC$30*(3*$AC$26^2/2-11*$AC$26/6+(1/3))","v":4.5946617524403586E-19},null,null,"h.1.6",null,null,null,{"$f":"$AJ$30*(3*$AJ$26^2/2-11*$AJ$26/6+(1/3))","v":2.2072018086596128E-2}]
[]
[]
["c.1.7",null,null,null,{"$f":"B30^2*(3*$B$26/2-(1/6))","v":2.2836280425704369E-5},null,null,null,"d.1.7",null,null,null,{"$f":"J30^2*(3*$J$26/2-(1/6))","v":4.8527095904621787E-5},null,null,"e.1.7",null,null,null,{"$f":"Q30^2*(3*$Q$26/2-(1/6))","v":7.4217911383539192E-5},null,"f.1.7",null,null,null,{"$f":"W30^2*(3*$W$26/2-(1/6))","v":7.4217911383539192E-5},null,"g.1.7",null,null,null,{"$f":"AC30^2*(3*$AC$26/2-(1/6))","v":9.1345121702817475E-5},null,null,"h.1.7",null,null,null,{"$f":"AJ30^2*(3*$AJ$26/2-(1/6))","v":1.9410838361848715E-4}]
[]
[]
[]
["Result1:",null,null,null,{"$f":"C34/C36+C38*(C41+(1/(2*$B$28)^2)*(E43-E47+E50-B30^3/2))","v":4.1129890835771331E-3},null,null,null,"Result2:",null,null,null,{"$f":"K34/K36+K38*(K41+(1/(2*$J$28)^2)*(M43-M47+M50-J30^3/2))","v":2.5338493946696283E-5},null,null,"Result3:",null,null,null,{"$f":"R34/R36+R38*(R41+(1/(2*$Q$28)^2)*(T43-T47+T50-Q30^3/2))","v":1.6923378682257274E-7},null,"Result4:",null,null,null,{"$f":"X34/X36+X38*(X41+(1/(2*$W$28)^2)*(Z43-Z47+Z50-W30^3/2))","v":1.6923378682257274E-7},null,"Result5:",null,null,null,{"$f":"AD34/AD36+AD38*(AD41+(1/(2*$AC$28)^2)*(AF43-AF47+AF50-AC30^3/2))","v":8.2090614844558037E-3},null,null,"Result6:",null,null,null,{"$f":"AK34/AK36+AK38*(AK41+(1/(2*$AC$28)^2)*(AM43-AM47+AM50-AJ30^3/2))","v":6.7385245943810666E-5}]
[]
[]
["1- Calculate",null,null,null,null,{"$f":"(1/2)*$E$54","v":2.0564945417885666E-3}]
[]
[]
[]
["2- Calculate"]
[]
[]
[]
[]
[]
["2.1. Calculate",null,null,{"$f":"1/(6*SQRT(2*$C$20*PI()))","v":3.8388238830148393E-2}]
[]
[]
[]
["2.2. Calculate",null,null,{"$f":"1+(2*C20-1)*C22/(C20-1)","v":18.411391835708184}]
[]
[]
[]
["2.3. Calculate",null,null,null,{"$f":"(1+C22^2/(C20-1))^((C20+1)/2)","v":637.69003162942522}]
[]
[]
[]
["Result:",null,null,null,{"$f":"D67*D71/E75","v":1.1083455470969866E-3}]
[]
[]
[]
["3-Calculate"]
[]
[]
[]
[]
["3.1. Calculate",null,null,null,{"$f":"(C20-1)/(3*SQRT(2*C20*PI()))","v":0.15355295532059357}]
[]
[]
[]
["3.2. Calculate",null,null,null,{"$f":"(2*$C$20-1)/(6*SQRT(2*$C$20*PI()))","v":0.19194119415074196}]
[]
[]
[]
["Result",null,null,null,{"$f":"E92*AF54-E88*AM54","v":1.5653098605236321E-3}]
[]
[]
["4-Calculate"]
[]
[]
["4.1. Calculate",null,null,null,null,{"$f":"((C20-1)/24)*E54","v":3.4274909029809441E-4}]
[]
[]
[]
[]
["4.2. Calculate",null,null,null,null,null,{"$f":"((C20-1)*(C20+2)/(12*C20))*M54","v":7.0384705407489676E-6}]
[]
[]
[]
["4.3. Calculate",null,null,null,null,null,{"$f":"((C20+4)*(C20-1)/(24*C20))*T54","v":3.29065696599447E-8}]
[]
[]
[]
["Result:",null,null,null,null,null,{"$f":"F102-G107+G111","v":3.3574352632700542E-4}]
[]
[]
["5- Calculate"]
[]
[]
[]
[]
[null,null,null,null,null,null,{"$f":"((C20-1)*(2*C20+5)/72)*E54","v":1.2567466644263464E-3}]
["5.1. Calculate"]
[]
[]
[null,null,null,null,null,null,{"$f":"((C20-1)*(2*C20^2+5*C20+8)/(24*C20))*M54","v":2.8857729217070766E-5}]
["5.2. Calculate"]
[]
[]
[]
["5.3. Calculate",null,null,null,null,null,{"$f":"((C20-1)*(2*C20^2+5*C20+12)/(24*C20))*T54","v":2.1154223352821591E-7}]
[]
[]
[]
["5.4. Calculate",null,null,null,null,null,null,{"$f":"((C20-1)*(2*C20^2+5*C20+12)/(72*C20))*Z54","v":7.0514077842738642E-8}]
[]
[]
[]
[]
["Result",null,{"$f":"G123-G127+G132-H136","v":1.228029963364961E-3}]
[]
["Corrected probability is::",null,null,null,null,null,null,null,null,{"$f":"F57+H16*E96-H18*G115+(H16^2)*C141","v":8.3089960315733888E-3}]