{"text_format":"1","workbook":"xlsx","n_sheets":17,"sheets":["Hg_Min_Tests","Hg_Variability_Tests","SourceAchievingNewSourceLimit","UPL Pooled Template ","UPL_Calc_n=3_Results","Hg_QA_Calcs","Instructions","Step 6. Instructions","Template_nonnormal n=3","Recalculate t-stat n=3","Calculations for Template n=3","Recalculations1 n=3","Recalculation 2 n=3","Recalculations3 n=3","Recalculations4 n=3","Recalculations5 n<3","Recalculations6 n=3"],"not_rendered":{"charts":0,"images":45,"macros":0,"external_links":0,"defined_names":14,"comments":3,"pivot_tables":0},"unopened":[],"bounds":{"document_bytes":16777216,"sheet_cells":100000,"rows_first":2000,"rows_last":500,"rows_between":2000,"halvings":0,"cell_chars":16384,"cell_head_chars":4096},"cells_cut":0,"cells_raw":0,"read":"whole","date_system":"1900"}

{"sheet":"Hg_Min_Tests","index":0,"n_rows":385,"n_cols":62,"rows_kept":385,"cut":false,"hidden":false,"merged":[]}
["Key","primary_fuel","Hg_Min_lb_per_MWh_Rank","Reason_for_Removal","ORIS code","Plant Name","physical_state","Unit Number","boiler_id","Unit Type","boiler_type","MWe_capacity","max_heat_input","Unit_heat_rate","Fuel_types","fuel","Fuel_Conc_lb/MMBtu","Mercury - ERT","Mercury MW - ERT","Mercury - ETTS","Mercury MW - ETTS","Mercury - CEMS","Mercury - Part II","Mercury MW - Part II","Mercury - min","Mercury MW - min","control_group_1","control_type_1","install_date_1","control_group_2","control_type_2","install_date_2","control_group_3","control_type_3","install_date_3","control_group_4","control_type_4","install_date_4","control_group_5","control_type_5","install_date_5","control_group_6","control_type_6","install_date_6","control_group_7","control_type_7","install_date_7","control_group_8","control_type_8","install_date_8","control_group_9","control_type_9","install_date_9","control_group_10","control_type_10","install_date_10","control_group_11","control_type_11","install_date_11","control_group_12","control_type_12","install_date_12"]
[{"$f":"E2&\"_\"&I2","v":"54081_2A"},"coal",1,"Control technology and unit size are not representative of 2012 RACT/BACT/LAER technologies or sizes of utility units likely to be constructed in future.",54081,"Spruance Genco, LLC","VA","GEN2","2A","Conventional Boiler","Stoker - underfeed",28.7,375,13.066202090592334,"bituminous","bituminous",3.2818472738122867E-6,null,null,2.6333333333333338E-9,3.4407665505226488E-8,null,null,null,2.6333333333333338E-9,3.4407665505226488E-8,"SO2 control","Dry FGD - Spray Dryer","1992-05-01","SO2 control","Dry FGD - Spray Dryer","1992-05-01","PM control","Fabric Filter, pulse","1992-05-01","PM control","Fabric Filter, pulse","1992-05-01","","",null,"","",null,"","",null,"","",null,"","",null,"","",null,"","",null,"",""]
["54081_2B","coal",2,"Control technology and unit size are not representative of 2012 RACT/BACT/LAER technologies or sizes of utility units likely to be constructed in future.",54081,"Spruance Genco, LLC","VA","GEN2","2B","Conventional Boiler","Stoker - underfeed",28.7,375,13.066202090592334,"bituminous","bituminous",3.2818472738122867E-6,null,null,2.6333333333333338E-9,3.4407665505226488E-8,null,null,null,2.6333333333333338E-9,3.4407665505226488E-8,"SO2 control","Dry FGD - Spray Dryer","1992-05-01","SO2 control","Dry FGD - Spray Dryer","1992-05-01","PM control","Fabric Filter, pulse","1992-05-01","PM control","Fabric Filter, pulse","1992-05-01","","",null,"","",null,"","",null,"","",null,"","",null,"","",null,"","",null,"",""]
["10043_B01","coal",3,"Minimum test average reported was result from stack test that did not meet Method 30B QA criteria. Test was invalid.",10043,"Logan Generating Plant","NJ","Unit1","B01","Conventional Boiler","Wall firing - opposed firing",241.7,2116,8.7546545304095993,"bituminous","bituminous",7.3285134054669697E-6,null,null,5.3333333333333339E-9,4.6691490828851201E-8,null,null,null,5.3333333333333339E-9,4.6691490828851201E-8,"NOx control","Selective Catalytic Reduction","1994-09-01","SO2 control","Dry FGD - Spray Dryer","1994-09-01","PM control","Fabric Filter, reverse air","1994-09-01","","",null,"","",null,"","",null,"","",null,"","",null,"","",null,"","",null,"","",null,"",""]
["527_1","coal",4,null,527,"Nucla","CO","001","1","Fluidized bed firing","Fluidized bed firing",110,1032,9.3818181818181809,"bituminous","bituminous",3.9065283637693357E-6,null,null,9.8533333333333332E-9,9.244218181818181E-8,null,5.3333333333333339E-9,5.0036363636363636E-8,5.3333333333333339E-9,5.0036363636363636E-8,"NOx control","Selective Noncatalytic Reduction","2006-07-01","PM control","Fabric Filter, shake and deflate","1987-06-01","","",null,"","",null,"","",null,"","",null,"","",null,"","",null,"","",null,"","",null,"","",null,"",""]
["54081_3A","coal",5,null,54081,"Spruance Genco, LLC","VA","GEN3","3A","Conventional Boiler","Stoker - underfeed",28.7,375,13.066202090592334,"bituminous","bituminous",1.6995757764745597E-6,null,null,4.6900000000000001E-9,6.1280487804878046E-8,null,null,null,4.6900000000000001E-9,6.1280487804878046E-8,"SO2 control","Dry FGD - Spray Dryer","1992-05-01","SO2 control","Dry FGD - Spray Dryer","1992-05-01","PM control","Fabric Filter, pulse","1992-05-01","PM control","Fabric Filter, pulse","1992-05-01","","",null,"","",null,"","",null,"","",null,"","",null,"","",null,"","",null,"",""]
["54081_3B","coal",6,null,54081,"Spruance Genco, LLC","VA","GEN3","3B","Conventional Boiler","Stoker - underfeed",28.7,375,13.066202090592334,"bituminous","bituminous",1.6995757764745597E-6,null,null,4.6900000000000001E-9,6.1280487804878046E-8,null,null,null,4.6900000000000001E-9,6.1280487804878046E-8,"SO2 control","Dry FGD - Spray Dryer","1992-05-01","SO2 control","Dry FGD - Spray Dryer","1992-05-01","PM control","Fabric Filter, pulse","1992-05-01","PM control","Fabric Filter, pulse","1992-05-01","","",null,"","",null,"","",null,"","",null,"","",null,"","",null,"","",null,"",""]
["2527_6","coal",7,null,2527,"AES Greenidge","NY","Unit 4","6","Conventional Boiler","Tangential firing",112,1117,9.9732142857142865,"coal - bituminous, petroleum coke","bituminous",null,null,null,null,null,null,6.4601660216679329E-9,6.4428620055384651E-8,6.4601660216679329E-9,6.4428620055384651E-8,"NOx control","Selective Catalytic Reduction","2007-05-01","NOx control","Selective Noncatalytic Reduction","2007-05-01","Other control","Activated carbon injection","2007-05-01","SO2 control","Dry FGD - Circulating Dry Scrubber","2007-05-01","PM control","Fabric Filter, pulse","2006-11-01","","",null,"","",null,"","",null,"","",null,"","",null,"","",null,"",""]
{"$rows_left_out":378}
{"sheet":"Hg_Variability_Tests","index":1,"n_rows":676,"n_cols":23,"rows_kept":676,"cut":false,"hidden":false,"merged":[]}
["facility_name","facility_id","boiler_id","configuration_id","HAP","Final_EF","Final_EF_Units","Final_Output_EF","Final_Output_EF_Units","From","Report_id","Hg_Min_lb_per_MWh_Rank","New Souce MACT Floor Test_ID","New Source MACT Floor QA Calc","New Source Floor Agreement of QA Calc","lb/GWh",11,28,{"$f":"R1+3","v":31},{"$f":"S1+3","v":34},{"$f":"T1+3","v":37},{"$f":"U1+3","v":40},{"$f":"V1+3","v":43}]
[{"$f":"VLOOKUP(B2&\"_\"&C2,Hg_Min_Tests!$A:$AZ,6,FALSE)","v":"Spruance Genco, LLC"},54081,"2A","GEN2","Mercury",2.6333333333333338E-9,"lb/MMBtu",3.4407665505226488E-8,"lb/MW","ETTS","",1,null,null,null,{"$f":"H2*1000","v":3.4407665505226486E-5},{"$f":"VLOOKUP(B2&\"_\"&C2,Hg_Min_Tests!$A$1:AA$1000,11,FALSE)","v":"Stoker - underfeed"}]
[{"$f":"VLOOKUP(B3&\"_\"&C3,Hg_Min_Tests!$A:$AZ,6,FALSE)","v":"Spruance Genco, LLC"},54081,"2B","GEN2","Mercury",2.6333333333333338E-9,"lb/MMBtu",3.4407665505226488E-8,"lb/MW","ETTS","",2,null,null,null,3.4407665505226486E-5,{"$f":"VLOOKUP(B3&\"_\"&C3,Hg_Min_Tests!$A$1:AA$1000,11,FALSE)","v":"Stoker - underfeed"}]
[{"$f":"VLOOKUP(B4&\"_\"&C4,Hg_Min_Tests!$A:$AZ,6,FALSE)","v":"Logan Generating Plant"},10043,"B01","Unit1","Mercury",5.3333333333333339E-9,"lb/MMBtu",4.6691490828851201E-8,"lb/MW","ETTS","",3,null,null,null,4.66914908288512E-5,{"$f":"VLOOKUP($B4&\"_\"&$C4,Hg_Min_Tests!$A$1:AAA$1000,Q$1,FALSE)","v":"Wall firing - opposed firing"},{"$f":"VLOOKUP($B4&\"_\"&$C4,Hg_Min_Tests!$A$1:AAB$1000,R$1,FALSE)","v":"Selective Catalytic Reduction"},{"$f":"VLOOKUP($B4&\"_\"&$C4,Hg_Min_Tests!$A$1:AAC$1000,S$1,FALSE)","v":"Dry FGD - Spray Dryer"},{"$f":"VLOOKUP($B4&\"_\"&$C4,Hg_Min_Tests!$A$1:AAD$1000,T$1,FALSE)","v":"Fabric Filter, reverse air"},{"$f":"VLOOKUP($B4&\"_\"&$C4,Hg_Min_Tests!$A$1:AAE$1000,U$1,FALSE)","v":""},{"$f":"VLOOKUP($B4&\"_\"&$C4,Hg_Min_Tests!$A$1:AAF$1000,V$1,FALSE)","v":""},{"$f":"VLOOKUP($B4&\"_\"&$C4,Hg_Min_Tests!$A$1:AAG$1000,W$1,FALSE)","v":""}]
[{"$f":"VLOOKUP(B5&\"_\"&C5,Hg_Min_Tests!$A:$AZ,6,FALSE)","v":"Nucla"},527,"1","001","Mercury",5.3333333333333339E-9,"lb/MMBtu",5.0036363636363636E-8,"lb/MW","Part II","2009 HG",4,{"$f":"VLOOKUP(H5,Hg_QA_Calcs!B$202:M$230,12,TRUE)","v":"1_Hg_T3"},{"$f":"VLOOKUP(M5,Hg_QA_Calcs!$A$202:$B$204,2,FALSE)","v":5.0026666666666679E-8},{"$f":"N5/H5","v":0.9998062015503878},5.0036363636363635E-5,{"$f":"VLOOKUP(B5&\"_\"&C5,Hg_Min_Tests!$A$1:AA$1000,11,FALSE)","v":"Fluidized bed firing"},{"$f":"VLOOKUP($B5&\"_\"&$C5,Hg_Min_Tests!$A$1:AAB$1000,R$1,FALSE)","v":"Selective Noncatalytic Reduction"},{"$f":"VLOOKUP($B5&\"_\"&$C5,Hg_Min_Tests!$A$1:AAC$1000,S$1,FALSE)","v":"Fabric Filter, shake and deflate"},{"$f":"VLOOKUP($B5&\"_\"&$C5,Hg_Min_Tests!$A$1:AAD$1000,T$1,FALSE)","v":""},{"$f":"VLOOKUP($B5&\"_\"&$C5,Hg_Min_Tests!$A$1:AAE$1000,U$1,FALSE)","v":""},{"$f":"VLOOKUP($B5&\"_\"&$C5,Hg_Min_Tests!$A$1:AAF$1000,V$1,FALSE)","v":""},{"$f":"VLOOKUP($B5&\"_\"&$C5,Hg_Min_Tests!$A$1:AAG$1000,W$1,FALSE)","v":""}]
[{"$f":"VLOOKUP(B6&\"_\"&C6,Hg_Min_Tests!$A:$AZ,6,FALSE)","v":"Nucla"},527,"1","001","Mercury",6.0000000000000008E-9,"lb/MMBtu",5.6290909090909093E-8,"lb/MW","Part II","2008 Hg",4,{"$f":"VLOOKUP(H6,Hg_QA_Calcs!B$202:M$230,12,TRUE)","v":"1_Hg_T2"},{"$f":"VLOOKUP(M6,Hg_QA_Calcs!$A$202:$B$204,2,FALSE)","v":5.6280000000000005E-8},{"$f":"N6/H6","v":0.99980620155038769},5.6290909090909097E-5,{"$f":"VLOOKUP(B6&\"_\"&C6,Hg_Min_Tests!$A$1:AA$1000,11,FALSE)","v":"Fluidized bed firing"},{"$f":"VLOOKUP($B6&\"_\"&$C6,Hg_Min_Tests!$A$1:AAB$1000,R$1,FALSE)","v":"Selective Noncatalytic Reduction"},{"$f":"VLOOKUP($B6&\"_\"&$C6,Hg_Min_Tests!$A$1:AAC$1000,S$1,FALSE)","v":"Fabric Filter, shake and deflate"},{"$f":"VLOOKUP($B6&\"_\"&$C6,Hg_Min_Tests!$A$1:AAD$1000,T$1,FALSE)","v":""},{"$f":"VLOOKUP($B6&\"_\"&$C6,Hg_Min_Tests!$A$1:AAE$1000,U$1,FALSE)","v":""},{"$f":"VLOOKUP($B6&\"_\"&$C6,Hg_Min_Tests!$A$1:AAF$1000,V$1,FALSE)","v":""},{"$f":"VLOOKUP($B6&\"_\"&$C6,Hg_Min_Tests!$A$1:AAG$1000,W$1,FALSE)","v":""}]
[{"$f":"VLOOKUP(B7&\"_\"&C7,Hg_Min_Tests!$A:$AZ,6,FALSE)","v":"Nucla"},527,"1","001","Mercury",9.8533333333333332E-9,"lb/MMBtu",9.244218181818181E-8,"lb/MW","ETTS","",4,{"$f":"VLOOKUP(H7,Hg_QA_Calcs!B$202:M$230,12,TRUE)","v":"1_Hg_T1"},{"$f":"VLOOKUP(M7,Hg_QA_Calcs!$A$202:$B$204,2,FALSE)","v":9.2424266666666684E-8},{"$f":"N7/H7","v":0.99980620155038791},9.2442181818181815E-5,{"$f":"VLOOKUP(B7&\"_\"&C7,Hg_Min_Tests!$A$1:AA$1000,11,FALSE)","v":"Fluidized bed firing"},{"$f":"VLOOKUP($B7&\"_\"&$C7,Hg_Min_Tests!$A$1:AAB$1000,R$1,FALSE)","v":"Selective Noncatalytic Reduction"},{"$f":"VLOOKUP($B7&\"_\"&$C7,Hg_Min_Tests!$A$1:AAC$1000,S$1,FALSE)","v":"Fabric Filter, shake and deflate"},{"$f":"VLOOKUP($B7&\"_\"&$C7,Hg_Min_Tests!$A$1:AAD$1000,T$1,FALSE)","v":""},{"$f":"VLOOKUP($B7&\"_\"&$C7,Hg_Min_Tests!$A$1:AAE$1000,U$1,FALSE)","v":""},{"$f":"VLOOKUP($B7&\"_\"&$C7,Hg_Min_Tests!$A$1:AAF$1000,V$1,FALSE)","v":""},{"$f":"VLOOKUP($B7&\"_\"&$C7,Hg_Min_Tests!$A$1:AAG$1000,W$1,FALSE)","v":""}]
[{"$f":"VLOOKUP(B8&\"_\"&C8,Hg_Min_Tests!$A:$AZ,6,FALSE)","v":"Spruance Genco, LLC"},54081,"3A","GEN3","Mercury",4.6900000000000001E-9,"lb/MMBtu",6.1280487804878046E-8,"lb/MW","ETTS","",5,null,null,null,6.1280487804878044E-5,{"$f":"VLOOKUP(B8&\"_\"&C8,Hg_Min_Tests!$A$1:AA$1000,11,FALSE)","v":"Stoker - underfeed"}]
{"$rows_left_out":669}
{"sheet":"SourceAchievingNewSourceLimit","index":2,"n_rows":107,"n_cols":16,"rows_kept":107,"cut":false,"hidden":false,"merged":[]}
[]
[]
[]
[]
[]
[]
[]
[]
{"$rows_left_out":100}
{"sheet":"UPL Pooled Template ","index":3,"n_rows":113,"n_cols":12,"rows_kept":113,"cut":false,"hidden":false,"merged":[[0,1,0,11],[37,0,37,3]]}
[null,"Emissions "]
["Runs","527\nNucla\n001"]
[1,5.0036363636363603E-8]
[2,5.62909090909091E-8]
[3,9.244218181818181E-8]
[4]
[5]
[6]
{"$rows_left_out":106}
{"sheet":"UPL_Calc_n=3_Results","index":4,"n_rows":173,"n_cols":12,"rows_kept":173,"cut":false,"hidden":false,"merged":[[149,0,149,9],[0,1,0,11],[40,0,40,4],[43,0,43,4],[84,4,84,14],[85,4,85,14],[151,0,151,7],[153,0,153,7],[158,1,158,2],[159,1,159,6],[163,1,163,3]]}
[null,"Emissions (lb/MWh)"]
["tests","527\nNucla\n001"]
[1,5.0036363636363603E-8]
[2,5.62909090909091E-8]
[3,9.244218181818181E-8]
[4]
[5]
[6]
{"$rows_left_out":166}
{"sheet":"Hg_QA_Calcs","index":5,"n_rows":204,"n_cols":110,"rows_kept":204,"cut":false,"hidden":false,"merged":[[8,0,8,4],[8,20,8,26],[8,27,8,35],[8,36,8,43]]}
[null,null,null,null,null,null,null,null,"Anthracite",null,"Anthracite",null,null,"fPM","30B",null,"μg/dscm","No",null,null,{"$f":"1/453592370","v":2.2046226218487758E-9},"lbs/μg",2.8316846592000001E-2,null,null,null,"cm/cf",null,null,null,null,"lb/hr",null,null,"lb/MMBtu",null,null,null,null,null,null,"Round to",null,null,null,"From ",null,"original database export===>"]
[null,null,null,null,null,null,null,null,"Bituminous",null,"Bituminous",null,null,"Se","M5",null,null,"Yes",null,null,{"$f":"U1/1000","v":2.2046226218487757E-12},"lb/mg",null,null,null,null,null,null,null,null,null,null,null,null,null,null,null,null,null,null,null,"Same ",null,null,null,"Min ",null,"original database export===>"]
[null,null,null,null,null,null,null,null,"Lignite",null,"Lignite",null,null,"Pb","M5B",null,null,null,null,null,null,null,null,null,null,null,null,null,null,null,null,null,null,null,null,null,null,null,null,null,null,"Sig Figs ",null,null,null,"Test",null,"original database export===>"]
[null,null,null,null,null,null,null,null,"Oil",null,"Oil",null,null,"Hg","M29",null,null,null,null,null,null,null,null,null,null,null,null,null,null,null,null,null,null,null,null,null,null,null,null,null,null,"as Submitted",null,null,null,"Sheet",null,"original database export===>"]
[null,null,null,null,null,null,null,null,"Pet Coke",null,"Pet Coke",null,null,"HCl","OTM27",null,null,null,null,null,null,null,null,null,null,null,null,null,null,null,null,null,null,null,null,null,null,null,null,null,null,"prior to ",null,null,null,null,null,"original database export===>"]
[null,null,null,null,null,null,null,null,"Subbituminous",null,"Sub Bituminous",null,null,"SO2",null,null,null,null,null,null,null,null,null,null,null,null,null,null,null,null,null,null,null,null,null,null,null,null,null,null,null,"Calc % Diff.",null,null,null,null,null,"original database export===>"]
[null,null,null,null,null,null,null,null,null,null,null,null,null,null,null,null,null,null,null,null,null,null,null,null,null,null,null,null,null,null,null,null,null,null,null,null,null,null,null,null,null,null,null,null,null,null,null,"original database export===>"]
["Part II Data","Part II Data","Part II Data","Part II Data","Part II Data","Part II Data","Part II Data","Part II Data","Part II Data","Part II Data","Part II Data","Part II Data","Part II Data","Part II Data","Part II Data","Part II Data","Part II Data","Part II Data","Part II Data","Part II Data","Part II Data","Part II Data","Part II Data","Part II Data","Part II Data","Part II Data","Part II Data","Part II Data","Part II Data","Part II Data","Part II Data","Part II Data","Part II Data","Part II Data","Part II Data","Part II Data","Part II Data","Part II Data","Part II Data","Part II Data","Part II Data","Part II Data","Part II Data","Part II Data","Part II Data","Part II Data","Part II Data","original database export===>","Part II Data","Part II Data","Part II Data","Part II Data","Part II Data","Part II Data","Part II Data","Part II Data","Part II Data","Part II Data","Part II Data","Part II Data","Part II Data","Part II Data","Part II Data","Part II Data","Part II Data","Part II Data","Part II Data","Part II Data","Part II Data","Part II Data","Part II Data","Part II Data","Part II Data","Part II Data","Part II Data","Part II Data","Part II Data","Part II Data","Part II Data","Part II Data","Part II Data","Part II Data","Part II Data","Part II Data","Part II Data"]
{"$rows_left_out":197}
{"sheet":"Instructions","index":6,"n_rows":50,"n_cols":1,"rows_kept":50,"cut":false,"hidden":false,"merged":[]}
["Step 1.  Identify size of sample set."]
[]
["Large: When N (total number of sources) ≥ 20.  For a large sample set can assume normal distribution based on the Central Limit Theorem; use the \"UPL Pooled Template\" ."]
[]
["Small: When N (total number of sources) < 20.  For a small sample set the Central Limit Theorem cannot be used to support the normality assumption; move on to Step 2."]
[]
["Step 2.  Identify Normality of sample set."]
[]
{"$rows_left_out":43}
{"sheet":"Step 6. Instructions","index":7,"n_rows":23,"n_cols":1,"rows_kept":23,"cut":false,"hidden":false,"merged":[]}
["Step 6. Instructions"]
["For data sets with three or less runs"]
[]
["1)    Go to the \"Template_nonnormal n<3\" worksheet and test the kurtosis and skewness and conclude normality or non-normality.  If results of kurtosis and skewness test in cell D90 say \"normal\", use the standard template \"UPL Pooled Template\".  If results of kurtosis and skewness test in cell D90 say  \"non normal\" continue to use the template “Template_nonnormal n<3”."]
[]
["2)    If non-normal because both skewness or kurtosis fail, or if only kurtosis fail or if only skewness fail, you can use tab “Template_nonnormal n<3”."]
[]
["3)    Copy the kurtosis value (B85) and skewness value (B88) in the \"Template_nonnormal n<3\" tab into cells H14 and H12 in the \"Calculations for Template n<3\" tab."]
{"$rows_left_out":16}
{"sheet":"Template_nonnormal n=3","index":8,"n_rows":167,"n_cols":12,"rows_kept":167,"cut":false,"hidden":false,"merged":[[153,0,153,7],[158,1,158,2],[159,1,159,6],[163,1,163,3],[0,1,0,11],[40,0,40,4],[43,0,43,4],[149,0,149,9],[151,0,151,7],[84,4,84,14],[85,4,85,14]]}
[null,"Emissions (lb/MWh)"]
["Runs","527\nNucla\n001"]
[1,5.0036363636363603E-8]
[2,5.62909090909091E-8]
[3,9.244218181818181E-8]
[4]
[5]
[6]
{"$rows_left_out":160}
{"sheet":"Recalculate t-stat n=3","index":9,"n_rows":19,"n_cols":12,"rows_kept":19,"cut":false,"hidden":false,"merged":[[12,0,12,13],[14,0,14,13],[16,0,16,8],[18,0,18,8],[0,0,0,4],[2,0,2,4],[4,0,4,4],[6,0,6,4],[8,0,8,4],[10,0,10,4]]}
["1) Start with initial t-statistic from Template",null,null,null,null,null,{"$f":"'Template_nonnormal n=3'!H147","v":6.9645567342832733}]
[]
["2) Determine interval of differences for t-values",null,null,null,null,null,1.43]
[]
["2) Candidate values for t-statistic",null,null,null,null,null,{"$f":"$G$1+1*$G$3","v":8.3945567342832739},{"$f":"$G$1+2*$G$3","v":9.8245567342832736},{"$f":"$G$1+3*$G$3","v":11.254556734283273},{"$f":"$G$1+4*$G$3","v":12.684556734283273},{"$f":"$G$1+5*$G$3","v":14.114556734283273},{"$f":"$G$1+6*$G$3","v":15.544556734283272}]
[]
["3) Corrected p-values",null,null,null,null,null,{"$f":"'Recalculations1 n=3'!J143","v":2.7221714617923803E-2},{"$f":"'Recalculation 2 n=3'!J143","v":2.0219370460541591E-2},{"$f":"'Recalculations3 n=3'!J143","v":1.558089812360601E-2},{"$f":"'Recalculations4 n=3'!J143","v":1.2360162896941522E-2},{"$f":"'Recalculations5 n<3'!J143","v":1.0037272897875317E-2},{"$f":"'Recalculations6 n=3'!J143","v":8.3089960315733888E-3}]
[]
{"$rows_left_out":12}
{"sheet":"Calculations for Template n=3","index":10,"n_rows":139,"n_cols":39,"rows_kept":139,"cut":false,"hidden":false,"merged":[[2,0,2,7],[19,0,19,1],[19,8,19,9],[19,15,19,16],[19,21,19,22],[19,34,19,35],[27,0,27,4],[27,8,27,12],[27,15,27,19],[27,21,27,25],[27,27,27,31],[27,34,27,38],[19,27,19,28]]}
[]
[]
["Calculate the Incomplete Beta Functions needed for adjustment"]
[]
["Incomplete Beta Function approximation"]
[]
[]
[]
{"$rows_left_out":132}
{"sheet":"Recalculations1 n=3","index":11,"n_rows":143,"n_cols":39,"rows_kept":143,"cut":false,"hidden":false,"merged":[[1,0,1,5],[6,0,6,7],[23,0,23,1],[23,8,23,9],[23,15,23,16],[23,27,23,28],[23,34,23,35],[31,0,31,4],[31,8,31,12],[31,15,31,19],[31,21,31,25],[31,27,31,31],[31,34,31,38],[23,21,23,22]]}
[]
["Calculate u0. Sustitute each candidate t-value in u0 equation",null,null,null,null,null,null,null,"t-statistic=",{"$f":"'Recalculate t-stat n=3'!G5","v":8.3945567342832739},null,"u0=",{"$f":"1/(1+$J$2^2/(C20-1))","v":2.7598166318262233E-2}]
[]
[]
[]
[]
["Calculate the Incomplete Beta Functions needed for adjustment"]
[]
{"$rows_left_out":136}
{"sheet":"Recalculation 2 n=3","index":12,"n_rows":143,"n_cols":39,"rows_kept":143,"cut":false,"hidden":false,"merged":[[1,0,1,5],[6,0,6,7],[23,0,23,1],[23,8,23,9],[23,15,23,16],[23,27,23,28],[23,34,23,35],[31,0,31,4],[31,8,31,12],[31,15,31,19],[31,21,31,25],[31,27,31,31],[31,34,31,38],[23,21,23,22]]}
[]
["Calculate u0. Sustitute each candidate t-value in u0 equation",null,null,null,null,null,null,null,"t-statistic=",{"$f":"'Recalculate t-stat n=3'!H5","v":9.8245567342832736},null,"u0=",{"$f":"1/(1+$J$2^2/(C20-1))","v":2.0300052018776098E-2}]
[]
[]
[]
[]
["Calculate the Incomplete Beta Functions needed for adjustment"]
[]
{"$rows_left_out":136}
{"sheet":"Recalculations3 n=3","index":13,"n_rows":143,"n_cols":39,"rows_kept":143,"cut":false,"hidden":false,"merged":[[1,0,1,5],[6,0,6,7],[23,0,23,1],[23,8,23,9],[23,15,23,16],[23,27,23,28],[23,34,23,35],[31,0,31,4],[31,8,31,12],[31,15,31,19],[31,21,31,25],[31,27,31,31],[31,34,31,38],[23,21,23,22]]}
[]
["Calculate u0. Sustitute each candidate t-value in u0 equation",null,null,null,null,null,null,null,"t-statistic=",{"$f":"'Recalculate t-stat n=3'!I5","v":11.254556734283273},null,"u0=",{"$f":"1/(1+$J$2^2/(C20-1))","v":1.5544237088467144E-2}]
[]
[]
[]
[]
["Calculate the Incomplete Beta Functions needed for adjustment"]
[]
{"$rows_left_out":136}
{"sheet":"Recalculations4 n=3","index":14,"n_rows":143,"n_cols":39,"rows_kept":143,"cut":false,"hidden":false,"merged":[[1,0,1,5],[6,0,6,7],[23,0,23,1],[23,8,23,9],[23,15,23,16],[23,27,23,28],[23,34,23,35],[31,0,31,4],[31,8,31,12],[31,15,31,19],[31,21,31,25],[31,27,31,31],[31,34,31,38],[23,21,23,22]]}
[]
["Calculate u0. Sustitute each candidate t-value in u0 equation",null,null,null,null,null,null,null,"t-statistic=",{"$f":"'Recalculate t-stat n=3'!J5","v":12.684556734283273},null,"u0=",{"$f":"1/(1+$J$2^2/(C20-1))","v":1.2277623120822218E-2}]
[]
[]
[]
[]
["Calculate the Incomplete Beta Functions needed for adjustment"]
[]
{"$rows_left_out":136}
{"sheet":"Recalculations5 n<3","index":15,"n_rows":143,"n_cols":39,"rows_kept":143,"cut":false,"hidden":false,"merged":[[1,0,1,5],[6,0,6,7],[23,0,23,1],[23,8,23,9],[23,15,23,16],[23,27,23,28],[23,34,23,35],[31,0,31,4],[31,8,31,12],[31,15,31,19],[31,21,31,25],[31,27,31,31],[31,34,31,38],[23,21,23,22]]}
[]
["Calculate u0. Sustitute each candidate t-value in u0 equation",null,null,null,null,null,null,null,"t-statistic=",{"$f":"'Recalculate t-stat n=3'!K5","v":14.114556734283273},null,"u0=",{"$f":"1/(1+$J$2^2/(C20-1))","v":9.9393346840715678E-3}]
[]
[]
[]
[]
["Calculate the Incomplete Beta Functions needed for adjustment"]
[]
{"$rows_left_out":136}
{"sheet":"Recalculations6 n=3","index":16,"n_rows":143,"n_cols":39,"rows_kept":143,"cut":false,"hidden":false,"merged":[[1,0,1,5],[6,0,6,7],[23,0,23,1],[23,8,23,9],[23,15,23,16],[23,27,23,28],[23,34,23,35],[31,0,31,4],[31,8,31,12],[31,15,31,19],[31,21,31,25],[31,27,31,31],[31,34,31,38],[23,21,23,22]]}
[]
["Calculate u0. Sustitute each candidate t-value in u0 equation",null,null,null,null,null,null,null,"t-statistic=",{"$f":"'Recalculate t-stat n=3'!L5","v":15.544556734283272},null,"u0=",{"$f":"1/(1+$J$2^2/(C20-1))","v":8.2090603344079187E-3}]
[]
[]
[]
[]
["Calculate the Incomplete Beta Functions needed for adjustment"]
[]
{"$rows_left_out":135}