{"text_format":"1","workbook":"xlsx","n_sheets":7,"sheets":["HCl_Min_Tests","HCl_Variability","Lognormal Template","lognormal distribution 99 %","HCl_QA_Calcs","UPL Normal","UPL Pooled Template "],"not_rendered":{"charts":1,"images":31,"macros":0,"external_links":0,"defined_names":20,"comments":4,"pivot_tables":0},"unopened":[],"bounds":{"document_bytes":16777216,"sheet_cells":100000,"rows_first":2000,"rows_last":500,"rows_between":2000,"halvings":0,"cell_chars":16384,"cell_head_chars":4096},"cells_cut":0,"cells_raw":0,"read":"whole","date_system":"1900"}

{"sheet":"HCl_Min_Tests","index":0,"n_rows":342,"n_cols":96,"rows_kept":342,"cut":false,"hidden":false,"merged":[]}
[{"$f":"E1&\"_\"&I1","v":"ORIS code_boiler_id"},"primary_fuel","HCl_Min_lb_per_MWh_Rank","Reason_for_Removal","ORIS code","Plant Name","State","Unit Number","boiler_id","Unit Type","boiler_type","MWe_capacity","max_heat_input","Unit_heat_rate","Fuel types","fuel","Fuel_Cl_lb/MMBtu","Fuel_F_lb/MMBtu","Chlorine - ERT","Chlorine MW - ERT","Chlorine - ETTS","Chlorine MW - ETTS","Chlorine - Part II","Chlorine MW - Part II","Chlorine - min","Chlorine MW - min","HCN - ERT","HCN MW - ERT","HCN - ETTS","HCN MW - ETTS","HCN - Part II","HCN MW - Part II","HCN - min","HCN MW - min","Hydrogen Chloride - ERT (lb/MMBtu)","Hydrogen Chloride MW - ERT (lb/MWh)","Hydrogen Chloride - ETTS (lb/MMBtu)","Hydrogen Chloride (lb/MWh) ETTS","Hydrogen Chloride - Part II (lb/MMBtu)","Hydrogen Chloride MW - Part II (lb/MWh)","Hydrogen Chloride - min (lb/MMBtu)","Hydrogen Chloride MW - min (lb/MWh)","Hydrogen Fluoride - ERT","Hydrogen Fluoride MW - ERT","Hydrogen Fluoride - ETTS","Hydrogen Fluoride MW - ETTS","Hydrogen Fluoride - Part II","Hydrogen Fluoride MW - Part II","Hydrogen Fluoride - min","Hydrogen Fluoride MW - min","Sulfur Dioxide - CEMS","Sulfur Dioxide MW - CEMS","Sulfur Dioxide - ERT","Sulfur Dioxide MW - ERT","Sulfur Dioxide - ETTS","Sulfur Dioxide MW - ETTS","Sulfur Dioxide - Part II","Sulfur Dioxide MW - Part II","Sulfur Dioxide - min","Sulfur Dioxide MW - min","control_group_1","control_type_1","install_date_1","control_group_2","control_type_2","install_date_2","control_group_3","control_type_3","install_date_3","control_group_4","control_type_4","install_date_4","control_group_5","control_type_5","install_date_5","control_group_6","control_type_6","install_date_6","control_group_7","control_type_7","install_date_7","control_group_8","control_type_8","install_date_8","control_group_9","control_type_9","install_date_9","control_group_10","control_type_10","install_date_10","control_group_11","control_type_11","install_date_11","control_group_12","control_type_12","install_date_12"]
["10043_B01","coal",1,null,10043,"Logan Generating Plant","NJ","Unit1","B01","Conventional Boiler","Wall firing - opposed firing",241.7,2116,8.7546545304095993,"bituminous","bituminous",8.3600141955312082E-2,4.0859762134706802E-3,null,null,null,null,null,null,null,null,null,null,2.4666666666666666E-6,2.1594814508343679E-5,null,null,2.4666666666666666E-6,2.1594814508343679E-5,1.2872827435455452E-5,1.1269715702699106E-4,null,null,7.8076156813452146E-5,6.8352977996385912E-4,{"$f":"AVERAGE(HCl_QA_Calcs!AT28:AT30)","v":1.3635479081195558E-5},{"$f":"AVERAGE(HCl_QA_Calcs!AV28:AV30)","v":1.19373908712494E-4},8.3606002829973271E-6,7.3194167144486326E-5,null,null,6.7369783626588435E-6,5.8979918143922692E-5,6.7369783626588435E-6,5.8979918143922692E-5,null,null,9.0995908666725925E-2,0.79663774405789023,null,null,0.10625,0.93018204385601988,9.0995908666725925E-2,0.79663774405789023,"NOx control","Selective Catalytic Reduction","1994-09-01","SO2 control","Dry FGD - Spray Dryer","1994-09-01","PM control","Fabric Filter, reverse air","1994-09-01","","",null,"","",null,"","",null,"","",null,"","",null,"","",null,"","",null,"","",null,"",""]
["3130_1","coal",2,null,3130,"Seward","PA","SEW-1","1","Fluidized bed firing","Fluidized bed firing",292.5,3100,10.598290598290598,"coal refuse (culm or gob)","coal refuse (culm or gob)",3.3530032143849454E-2,2.7762918225458077E-2,null,null,null,null,null,null,null,null,null,null,1.2193333333333333E-4,1.2922849002849003E-3,null,null,1.2193333333333333E-4,1.2922849002849003E-3,1.4741923934699305E-4,1.5623919383783878E-3,null,null,1.9266666666666666E-5,2.0419373219373219E-4,1.9266666666666666E-5,2.0419373219373219E-4,1.0263154519556084E-4,1.0877189405341491E-3,null,null,5.6866666666666667E-6,6.0268945868945871E-5,5.6866666666666667E-6,6.0268945868945871E-5,null,null,0.33537253472545636,3.5543755817056915,null,null,null,null,0.33537253472545636,3.5543755817056915,"NOx control","Selective Noncatalytic Reduction","2004-03-01","PM control","Fabric Filter, pulse","2004-03-01","","",null,"","",null,"","",null,"","",null,"","",null,"","",null,"","",null,"","",null,"","",null,"",""]
["3130_2","coal",3,null,3130,"Seward","PA","SEW-1","2","Fluidized bed firing","Fluidized bed firing",292.5,3100,10.598290598290598,"coal refuse (culm or gob)","coal refuse (culm or gob)",3.3530032143849454E-2,2.7762918225458077E-2,null,null,null,null,null,null,null,null,null,null,1.2193333333333333E-4,1.2922849002849003E-3,null,null,1.2193333333333333E-4,1.2922849002849003E-3,1.4741923934699305E-4,1.5623919383783878E-3,null,null,1.9266666666666666E-5,2.0419373219373219E-4,1.9266666666666666E-5,2.0419373219373219E-4,1.0263154519556084E-4,1.0877189405341491E-3,null,null,5.6866666666666667E-6,6.0268945868945871E-5,5.6866666666666667E-6,6.0268945868945871E-5,null,null,0.33537253472545636,3.5543755817056915,null,null,null,null,0.33537253472545636,3.5543755817056915,"NOx control","Selective Noncatalytic Reduction","2004-03-01","PM control","Fabric Filter, pulse","2004-03-01","","",null,"","",null,"","",null,"","",null,"","",null,"","",null,"","",null,"","",null,"","",null,"",""]
["54081_3A","coal",4,null,54081,"Spruance Genco, LLC","VA","GEN3","3A","Conventional Boiler","Stoker - underfeed",28.7,375,13.066202090592334,"bituminous","bituminous",9.1094017434645069E-2,4.0189496915779988E-3,null,null,null,null,null,null,null,null,null,null,1.6190731328433334E-5,2.1155136753179442E-4,null,null,1.6190731328433334E-5,2.1155136753179442E-4,1.61175568615607E-5,2.1059525515976525E-4,null,null,null,null,1.61175568615607E-5,2.1059525515976525E-4,1.7660200256702297E-5,2.3075174551440283E-4,null,null,null,null,1.7660200256702297E-5,2.3075174551440283E-4,2.2700000000000008E-2,0.29660278745644608,6.5271065175803791E-2,0.85284492825527602,null,null,2.5246942176443497E-2,0.32988164864690978,2.2700000000000008E-2,0.29660278745644608,"SO2 control","Dry FGD - Spray Dryer","1992-05-01","SO2 control","Dry FGD - Spray Dryer","1992-05-01","PM control","Fabric Filter, pulse","1992-05-01","PM control","Fabric Filter, pulse","1992-05-01","","",null,"","",null,"","",null,"","",null,"","",null,"","",null,"","",null,"",""]
["54081_3B","coal",5,null,54081,"Spruance Genco, LLC","VA","GEN3","3B","Conventional Boiler","Stoker - underfeed",28.7,375,13.066202090592334,"bituminous","bituminous",9.1094017434645069E-2,4.0189496915779988E-3,null,null,null,null,null,null,null,null,null,null,1.6190731328433334E-5,2.1155136753179442E-4,null,null,1.6190731328433334E-5,2.1155136753179442E-4,1.61175568615607E-5,2.1059525515976525E-4,null,null,null,null,1.61175568615607E-5,2.1059525515976525E-4,1.7660200256702297E-5,2.3075174551440283E-4,null,null,null,null,1.7660200256702297E-5,2.3075174551440283E-4,2.2700000000000008E-2,0.29660278745644608,6.5271065175803791E-2,0.85284492825527602,null,null,2.5246942176443497E-2,0.32988164864690978,2.2700000000000008E-2,0.29660278745644608,"SO2 control","Dry FGD - Spray Dryer","1992-05-01","SO2 control","Dry FGD - Spray Dryer","1992-05-01","PM control","Fabric Filter, pulse","1992-05-01","PM control","Fabric Filter, pulse","1992-05-01","","",null,"","",null,"","",null,"","",null,"","",null,"","",null,"","",null,"",""]
["54081_2A","coal",6,null,54081,"Spruance Genco, LLC","VA","GEN2","2A","Conventional Boiler","Stoker - underfeed",28.7,375,13.066202090592334,"bituminous","bituminous",8.5779456368863707E-2,5.9170479426858642E-3,null,null,null,null,null,null,null,null,null,null,2.8317405026333334E-6,3.7000093675522646E-5,null,null,2.8317405026333334E-6,3.7000093675522646E-5,1.6932996545912427E-5,2.2124995486819373E-4,null,null,null,null,1.6932996545912427E-5,2.2124995486819373E-4,1.5312389030036015E-4,2.000747695562197E-3,null,null,null,null,1.5312389030036015E-4,2.000747695562197E-3,2.410000000000001E-2,0.31489547038327537,6.5675669546852847E-2,0.85813157073413993,null,null,null,null,2.410000000000001E-2,0.31489547038327537,"SO2 control","Dry FGD - Spray Dryer","1992-05-01","SO2 control","Dry FGD - Spray Dryer","1992-05-01","PM control","Fabric Filter, pulse","1992-05-01","PM control","Fabric Filter, pulse","1992-05-01","","",null,"","",null,"","",null,"","",null,"","",null,"","",null,"","",null,"",""]
["54081_2B","coal",7,null,54081,"Spruance Genco, LLC","VA","GEN2","2B","Conventional Boiler","Stoker - underfeed",28.7,375,13.066202090592334,"bituminous","bituminous",8.5779456368863707E-2,5.9170479426858642E-3,null,null,null,null,null,null,null,null,null,null,2.8317405026333334E-6,3.7000093675522646E-5,null,null,2.8317405026333334E-6,3.7000093675522646E-5,1.6932996545912427E-5,2.2124995486819373E-4,null,null,null,null,1.6932996545912427E-5,2.2124995486819373E-4,1.5312389030036015E-4,2.000747695562197E-3,null,null,null,null,1.5312389030036015E-4,2.000747695562197E-3,2.410000000000001E-2,0.31489547038327537,6.5675669546852847E-2,0.85813157073413993,null,null,null,null,2.410000000000001E-2,0.31489547038327537,"SO2 control","Dry FGD - Spray Dryer","1992-05-01","SO2 control","Dry FGD - Spray Dryer","1992-05-01","PM control","Fabric Filter, pulse","1992-05-01","PM control","Fabric Filter, pulse","1992-05-01","","",null,"","",null,"","",null,"","",null,"","",null,"","",null,"","",null,"",""]
["52071_5A","coal",8,null,52071,"Sandow Station","TX","5A","5A","Fluidized bed firing","Fluidized bed firing",282.35000000000002,2960,10.483442535859748,"lignite","lignite",null,null,null,null,null,null,null,null,null,null,null,null,2.6596666666666669E-5,2.7882462664541644E-4,null,null,2.6596666666666669E-5,2.7882462664541644E-4,9.2435416955243219E-5,9.690413819285281E-4,null,null,2.1185903639433637E-5,2.2210120337426442E-4,2.1185903639433637E-5,2.2210120337426442E-4,9.4701052907068646E-5,9.9279304623666777E-4,null,null,2.2410026789463284E-5,2.3493422807441586E-4,2.2410026789463284E-5,2.3493422807441586E-4,null,null,1.1155325630951158E-2,0.11694621522087985,null,null,2.5666666666666667E-2,0.26907502508706688,1.1155325630951158E-2,0.11694621522087985,"NOx control","Selective Noncatalytic Reduction","2009-08-01","Other control","Activated carbon injection","2009-08-01","SO2 control","Dry FGD - Circulating Dry Scrubber","2009-08-01","PM control","Fabric Filter, pulse","2009-08-01","","",null,"","",null,"","",null,"","",null,"","",null,"","",null,"","",null,"",""]
["108_SGU1","coal",9,null,108,"HOLCOMB","KS","SGU1","SGU1","Conventional Boiler","Wall firing - opposed firing",387,3389,8.7571059431524549,"","subbituminous",null,null,null,null,null,null,null,null,null,null,null,null,null,null,9.9999999999999995E-7,8.7571059431524554E-6,9.9999999999999995E-7,8.7571059431524554E-6,null,null,null,null,2.5999999999999998E-5,2.2768475452196381E-4,2.5999999999999998E-5,2.2768475452196381E-4,null,null,null,null,2.8E-5,2.4519896640826875E-4,2.8E-5,2.4519896640826875E-4,null,null,null,null,null,null,null,null,null,null,"SO2 control","Dry FGD - Spray Dryer","1983-08-01","PM control","Fabric Filter, reverse air","1983-08-01","","",null,"","",null,"","",null,"","",null,"","",null,"","",null,"","",null,"","",null,"","",null,"",""]
["3179_1","coal",10,null,3179,"Hatfield's Ferry Power Station","PA","001","1","Conventional Boiler","Wall firing - opposed firing",590,5700,9.6610169491525415,"bituminous","bituminous",3.3235658429717714E-2,4.806972482815748E-3,null,null,null,null,null,null,null,null,null,null,1.9433333333333334E-3,1.8774576271186439E-2,null,null,1.9433333333333334E-3,1.8774576271186439E-2,1.3129629639170115E-4,1.2684557448011805E-3,null,null,2.4700000000000001E-5,2.3862711864406779E-4,2.4700000000000001E-5,2.3862711864406779E-4,7.7175735621229789E-5,7.4559608990001653E-4,null,null,2.4700000000000001E-5,2.3862711864406779E-4,2.4700000000000001E-5,2.3862711864406779E-4,null,null,3.1524908057705477E-2,0.30456267106596813,null,null,null,null,3.1524908057705477E-2,0.30456267106596813,"PM control","Electrostatic precipitator, cold side, unspecified","1969-01-01","SO2 control","Wet FGD - Spray Type","2009-06-01","","",null,"","",null,"","",null,"","",null,"","",null,"","",null,"","",null,"","",null,"","",null,"",""]
["52071_5B","coal",11,null,52071,"Sandow Station","TX","5B","5B","Fluidized bed firing","Fluidized bed firing",282.35000000000002,2960,10.483442535859748,"lignite","lignite",null,null,null,null,null,null,null,null,null,null,null,null,1.6200000000000001E-5,1.6983176908092791E-4,null,null,1.6200000000000001E-5,1.6983176908092791E-4,3.0184528753548627E-5,3.1643777265983328E-4,null,null,2.5523812469302678E-5,2.675774213179951E-4,2.5523812469302678E-5,2.675774213179951E-4,4.452484483656643E-5,4.6677365226221578E-4,null,null,9.5233237559516439E-6,9.9837217345907073E-5,9.5233237559516439E-6,9.9837217345907073E-5,null,null,4.7983219701493718E-2,0.50302932642614273,null,null,3.2000000000000001E-2,0.33547016114751194,3.2000000000000001E-2,0.33547016114751194,"NOx control","Selective Noncatalytic Reduction","2009-07-01","Other control","Activated carbon injection","2009-08-01","SO2 control","Dry FGD - Circulating Dry Scrubber","2009-07-01","PM control","Fabric Filter, pulse","2009-07-01","","",null,"","",null,"","",null,"","",null,"","",null,"","",null,"","",null,"",""]
["6761_101","coal",12,null,6761,"Rawhide","CO","Rawhide101","101","Conventional Boiler","Tangential firing",305,2800,9.1803278688524586,"subbituminous","subbituminous",null,null,null,null,null,null,null,null,null,null,null,null,1.7966666666666665E-5,1.649398907103825E-4,null,null,1.7966666666666665E-5,1.649398907103825E-4,3.3353888445965523E-4,3.0619963163509333E-3,null,null,3.6081010741494353E-5,3.3123550844650553E-4,3.6081010741494353E-5,3.3123550844650553E-4,4.6490665116031651E-5,4.2679954860619216E-4,null,null,3.0000000000000001E-5,2.7540983606557377E-4,3.0000000000000001E-5,2.7540983606557377E-4,7.8533333333333344E-2,0.72096174863387985,null,null,null,null,null,null,7.8533333333333344E-2,0.72096174863387985,"SO2 control","Dry FGD - Spray Dryer","1984-04-01","PM control","Fabric Filter, reverse air","1984-04-01","","",null,"","",null,"","",null,"","",null,"","",null,"","",null,"","",null,"","",null,"","",null,"",""]
["50976_AABO1","coal",13,null,50976,"INDIANTOWN COGENERATION L.P.","FL","001","AABO1","Conventional Boiler","Wall firing - opposed firing",361,3422,9.4792243767313025,"bituminous","bituminous",0.12077607467782207,null,null,null,null,null,null,null,null,null,null,null,6.6999999999999994E-7,6.3510803324099719E-6,null,null,6.6999999999999994E-7,6.3510803324099719E-6,3.5766466360855867E-5,3.3903835979736503E-4,null,null,null,null,3.5766466360855867E-5,3.3903835979736503E-4,9.4655095083139666E-5,8.9725688469391679E-4,null,null,5.0376666666666675E-5,4.77531726685134E-4,5.0376666666666675E-5,4.77531726685134E-4,null,null,0.14692128868684484,1.3926998611811165,null,null,0.12666666666666668,1.200701754385965,0.12666666666666668,1.200701754385965,"NOx control","Selective Catalytic Reduction","1995-12-01","SO2 control","Dry FGD - Spray Dryer","1995-12-01","PM control","Fabric Filter, pulse","1995-12-01","","",null,"","",null,"","",null,"","",null,"","",null,"","",null,"","",null,"","",null,"",""]
["1082_4","coal",14,null,1082,"Walter Scott Jr. Energy Center","IA","4","4","Conventional Boiler","Wall firing - unspecified",850,7675,9.0294117647058822,"subbituminous","subbituminous",8.3194675540765393E-4,2.7620632279534113E-3,null,null,null,null,null,null,null,null,null,null,1.5134333333333332E-6,1.3665412745098037E-5,null,null,1.5134333333333332E-6,1.3665412745098037E-5,7.3723519894592504E-5,6.6568001787176167E-4,null,null,3.8000000000000002E-5,3.4311764705882356E-4,3.8000000000000002E-5,3.4311764705882356E-4,1.5306556117243224E-5,1.3820919788216677E-4,null,null,2.9E-5,2.6185294117647061E-4,1.5306556117243224E-5,1.3820919788216677E-4,7.8E-2,0.70429411764705885,null,null,null,null,4.1000000000000002E-2,0.37020588235294116,4.1000000000000002E-2,0.37020588235294116,"NOx control","Selective Catalytic Reduction","2007-02-01","Other control","Activated carbon injection","2007-02-01","SO2 control","Dry FGD - Circulating Dry Scrubber","2007-02-01","PM control","Fabric Filter, pulse","2007-02-01","","",null,"","",null,"","",null,"","",null,"","",null,"","",null,"","",null,"",""]
["54755_BLR2","coal",15,null,54755,"Roanoke Valley II","NC","Boiler 2","BLR2","Conventional Boiler","Wall firing - front firing",50,560,11.2,"bituminous","bituminous",7.8934332272022956E-2,5.4351607763516059E-3,null,null,null,null,null,null,null,null,null,null,8.5933333333333337E-4,9.6245333333333325E-3,null,null,8.5933333333333337E-4,9.6245333333333325E-3,3.2174808236304253E-5,3.603578522466076E-4,null,null,4.9199999999999992E-4,5.5103999999999986E-3,3.2174808236304253E-5,3.603578522466076E-4,6.0042992413619909E-5,6.7248151503254293E-4,null,null,null,null,6.0042992413619909E-5,6.7248151503254293E-4,null,null,null,null,null,null,null,null,null,null,"NOx control","Selective Noncatalytic Reduction","1995-06-01","SO2 control","Dry FGD - Spray Dryer","1995-06-01","PM control","Fabric Filter, pulse","1995-06-01","","",null,"","",null,"","",null,"","",null,"","",null,"","",null,"","",null,"","",null,"",""]
["10566_Boil 1","coal",16,null,10566,"Chambers Cogeneration LP","NJ","Boil 1","Boil 1","Conventional Boiler","Wall firing - front firing",142.5,1387,9.7333333333333325,"bituminous","bituminous",7.1311416957854951E-2,5.4196676887969765E-3,null,null,null,null,null,null,null,null,null,null,4.3433333333333337E-7,4.2275111111111112E-6,null,null,4.3433333333333337E-7,4.2275111111111112E-6,4.239954027850413E-5,4.1268885871077353E-4,null,null,null,null,4.239954027850413E-5,4.1268885871077353E-4,7.3682066405992618E-6,7.1717211301832806E-5,null,null,1.8360291277318583E-5,1.787068350992342E-4,7.3682066405992618E-6,7.1717211301832806E-5,null,null,0.15911461545440739,1.5487155904228984,null,null,null,null,0.15911461545440739,1.5487155904228984,"NOx control","Selective Catalytic Reduction","1994-03-01","SO2 control","Dry FGD - Spray Dryer","1994-03-01","PM control","Fabric Filter, reverse air","1994-03-01","","",null,"","",null,"","",null,"","",null,"","",null,"","",null,"","",null,"","",null,"",""]
["130_4","coal",17,null,130,"Cross","SC","C4","4","Conventional Boiler","Tangential firing",625,6798,10.876799999999999,"bituminous","bituminous",0.12984834225940944,6.8614819377665226,null,null,null,null,null,null,null,null,null,null,1.7200000000000001E-5,1.8708095999999999E-4,null,null,1.7200000000000001E-5,1.8708095999999999E-4,2.2897081309646017E-4,2.4904697398875778E-3,null,null,4.0966666666666669E-5,4.4558624E-4,4.0966666666666669E-5,4.4558624E-4,1.0289021044368334E-4,1.1191162409538548E-3,null,null,3.2600000000000006E-5,3.5458368000000005E-4,3.2600000000000006E-5,3.5458368000000005E-4,0.1386,1.5075244799999998,null,null,null,null,null,null,0.1386,1.5075244799999998,"NOx control","Selective Catalytic Reduction","2008-05-01","PM control","Electrostatic precipitator, cold side, w/o flue gas conditioning","2008-05-01","SO2 control","Wet FGD - Spray Type","2008-05-01","","",null,"","",null,"","",null,"","",null,"","",null,"","",null,"","",null,"","",null,"",""]
["4941_1","coal",18,null,4941,"Navajo Generating Station","AZ","001","1","Conventional Boiler","Tangential firing",812,7450,9.1748768472906406,"bituminous","bituminous",8.3008217813563547E-4,7.3047231675935917E-3,2.9463112937806957E-4,2.7032043274219436E-3,null,null,null,null,2.9463112937806957E-4,2.7032043274219436E-3,null,null,8.0000000000000004E-4,7.3399014778325125E-3,null,null,8.0000000000000004E-4,7.3399014778325125E-3,6.4809371022371757E-5,5.9461799768062754E-4,5.0000000000000002E-5,4.5874384236453203E-4,null,null,5.0000000000000002E-5,4.5874384236453203E-4,4.9105188229678268E-5,4.50534054570324E-4,5.0000000000000002E-5,4.5874384236453203E-4,null,null,4.9105188229678268E-5,4.50534054570324E-4,null,null,null,null,null,null,null,null,null,null,"PM control","Electrostatic precipitator, hot side, w/o flue gas conditioning","1974-05-01","SO2 control","Wet FGD - Spray Type","1999-04-01","","",null,"","",null,"","",null,"","",null,"","",null,"","",null,"","",null,"","",null,"","",null,"",""]
["54081_4A","coal",19,null,54081,"Spruance Genco, LLC","VA","GEN4","4A","Conventional Boiler","Stoker - underfeed",28.7,375,13.066202090592334,"bituminous","bituminous",8.5854352494476149E-2,5.0534334428819468E-3,null,null,null,null,null,null,null,null,null,null,2.5249155358800001E-5,3.2991056653484323E-4,null,null,2.5249155358800001E-5,3.2991056653484323E-4,3.8420443784819034E-5,5.020092829026877E-4,null,null,null,null,3.8420443784819034E-5,5.020092829026877E-4,1.500858984773281E-4,1.9610526804528933E-3,null,null,null,null,1.500858984773281E-4,1.9610526804528933E-3,4.2300000000000011E-2,0.55270034843205584,9.4105851603070501E-2,1.2296060749530118,null,null,8.9953476184438524E-2,1.1753502985771584,4.2300000000000011E-2,0.55270034843205584,"SO2 control","Dry FGD - Spray Dryer","1992-05-01","SO2 control","Dry FGD - Spray Dryer","1992-05-01","PM control","Fabric Filter, pulse","1992-05-01","PM control","Fabric Filter, pulse","1992-05-01","","",null,"","",null,"","",null,"","",null,"","",null,"","",null,"","",null,"",""]
["54081_4B","coal",20,null,54081,"Spruance Genco, LLC","VA","GEN4","4B","Conventional Boiler","Stoker - underfeed",28.7,375,13.066202090592334,"bituminous","bituminous",8.5854352494476149E-2,5.0534334428819468E-3,null,null,null,null,null,null,null,null,null,null,2.5249155358800001E-5,3.2991056653484323E-4,null,null,2.5249155358800001E-5,3.2991056653484323E-4,3.8420443784819034E-5,5.020092829026877E-4,null,null,null,null,3.8420443784819034E-5,5.020092829026877E-4,1.500858984773281E-4,1.9610526804528933E-3,null,null,null,null,1.500858984773281E-4,1.9610526804528933E-3,4.2300000000000011E-2,0.55270034843205584,9.4105851603070501E-2,1.2296060749530118,null,null,8.9953476184438524E-2,1.1753502985771584,4.2300000000000011E-2,0.55270034843205584,"SO2 control","Dry FGD - Spray Dryer","1992-05-01","SO2 control","Dry FGD - Spray Dryer","1992-05-01","PM control","Fabric Filter, pulse","1992-05-01","PM control","Fabric Filter, pulse","1992-05-01","","",null,"","",null,"","",null,"","",null,"","",null,"","",null,"","",null,"",""]
["10566_Boil 2","coal",21,null,10566,"Chambers Cogeneration LP","NJ","Boil 2","Boil 2","Conventional Boiler","Wall firing - front firing",142.5,1387,9.7333333333333325,"bituminous","bituminous",7.8650078650078656E-2,5.6485056485056483E-3,null,null,null,null,null,null,null,null,null,null,6.6999999999999994E-7,6.5213333333333323E-6,null,null,6.6999999999999994E-7,6.5213333333333323E-6,5.6008863293497171E-5,5.451529360567057E-4,null,null,null,null,5.6008863293497171E-5,5.451529360567057E-4,9.248915907258311E-6,9.0022781497314222E-5,null,null,null,null,9.248915907258311E-6,9.0022781497314222E-5,null,null,0.16815798007889027,1.6367376727678651,null,null,null,null,0.16815798007889027,1.6367376727678651,"NOx control","Selective Catalytic Reduction","1994-03-01","SO2 control","Dry FGD - Spray Dryer","1994-03-01","PM control","Fabric Filter, reverse air","1994-03-01","","",null,"","",null,"","",null,"","",null,"","",null,"","",null,"","",null,"","",null,"",""]
["55749_PC1","coal",22,null,55749,"Hardin Generator Project","MT","PC1","PC1","Conventional Boiler","Wall firing - unspecified",119,1304,10.957983193277311,"bituminous","bituminous",null,null,null,null,null,null,null,null,null,null,null,null,1.0433333333333334E-5,1.1432829131652661E-4,null,null,1.0433333333333334E-5,1.1432829131652661E-4,1.4550461747956969E-4,1.5944371528853688E-3,null,null,5.0000000000000002E-5,5.4789915966386559E-4,5.0000000000000002E-5,5.4789915966386559E-4,2.8873454932100623E-5,3.163948338778085E-4,null,null,5.0000000000000002E-5,5.4789915966386559E-4,2.8873454932100623E-5,3.163948338778085E-4,9.5333333333333339E-2,1.0446610644257703,null,null,null,null,0.104,1.1396302521008403,9.5333333333333339E-2,1.0446610644257703,"NOx control","Selective Catalytic Reduction","2006-04-01","Other control","Activated carbon injection",null,"SO2 control","Dry FGD - Spray Dryer","2006-04-01","PM control","Fabric Filter, pulse","2006-04-01","","",null,"","",null,"","",null,"","",null,"","",null,"","",null,"","",null,"",""]
["2712_2","coal",23,null,2712,"Roxboro Steam Electric Plant","NC","Rox_Cfg_2c","2","Conventional Boiler","Tangential firing",703,6893,9.8051209103840691,"bituminous","bituminous",null,null,null,null,null,null,6.0033333333333327E-5,5.8863409198672357E-4,6.0033333333333327E-5,5.8863409198672357E-4,null,null,null,null,null,null,null,null,null,null,null,null,5.6499999999999998E-5,5.5398933143669987E-4,5.6499999999999998E-5,5.5398933143669987E-4,null,null,null,null,2.1169999999999999E-5,2.0757440967283074E-4,2.1169999999999999E-5,2.0757440967283074E-4,null,null,null,null,null,null,4.1999999999999996E-2,0.41181507823613084,4.1999999999999996E-2,0.41181507823613084,"NOx control","Selective Catalytic Reduction","2005-05-01","PM control","Electrostatic precipitator, cold side, w/o flue gas conditioning","1974-05-01","SO2 control","Wet FGD - Spray/Tray Type","2007-04-20","","",null,"","",null,"","",null,"","",null,"","",null,"","",null,"","",null,"","",null,"",""]
["56224_BLR100","coal",24,null,56224,"TS Power Plant","NV","TSPower","BLR100","Conventional Boiler","Wall firing - opposed firing",242,2112,8.7272727272727266,"subbituminous","subbituminous",6.0792810556807109E-4,3.4306347628746056E-3,null,null,null,null,null,null,null,null,null,null,1.3433333333333334E-4,1.1723636363636363E-3,null,null,1.3433333333333334E-4,1.1723636363636363E-3,6.5138924540459638E-5,5.6848515962582957E-4,null,null,4.0000000000000002E-4,3.490909090909091E-3,6.5138924540459638E-5,5.6848515962582957E-4,6.5138924540459638E-5,5.6848515962582957E-4,null,null,1.5010917030567686E-5,1.3100436681222707E-4,1.5010917030567686E-5,1.3100436681222707E-4,4.2700000000000009E-2,0.37265454545454552,null,null,null,null,4.1666666666666664E-2,0.36363636363636359,4.1666666666666664E-2,0.36363636363636359,"NOx control","Selective Catalytic Reduction","2008-03-01","Other control","Activated carbon injection","2008-03-01","SO2 control","Dry FGD - Spray Dryer","2008-03-01","PM control","Fabric Filter, pulse","2008-01-01","","",null,"","",null,"","",null,"","",null,"","",null,"","",null,"","",null,"",""]
["6076_3","coal",25,null,6076,"Colstrip","MT","Unit3","3","Conventional Boiler","Tangential firing",805,7573,9.4074534161490675,"subbituminous","subbituminous",1.0490130073157864E-2,5.1551847848419199E-3,null,null,null,null,null,null,null,null,null,null,2.2085208191000002E-5,2.0776556724278633E-4,null,null,2.2085208191000002E-5,2.0776556724278633E-4,6.2094025539701585E-5,5.8414665268591314E-4,null,null,null,null,6.2094025539701585E-5,5.8414665268591314E-4,1.4115205326849714E-4,1.3278813657171785E-3,null,null,null,null,1.4115205326849714E-4,1.3278813657171785E-3,null,null,4.5223791369981094E-2,0.42544071061474137,null,null,null,null,4.5223791369981094E-2,0.42544071061474137,"Other control","Activated carbon injection","2009-12-01","SO2 control","Wet FGD - Venturi Type","1984-01-01","PM control","PM scrubber - Venturi","1984-01-01","","",null,"","",null,"","",null,"","",null,"","",null,"","",null,"","",null,"","",null,"",""]
["6041_3","coal",26,null,6041,"H L Spurlock Station","KY","Unit 03","3","Fluidized bed firing","Fluidized bed firing",300,2500,8.3333333333333339,"bituminous","bituminous",null,null,2.7553590737525559E-4,2.2961325614604634E-3,null,null,null,null,2.7553590737525559E-4,2.2961325614604634E-3,null,null,1.1666666666666668E-3,9.7222222222222241E-3,null,null,1.1666666666666668E-3,9.7222222222222241E-3,7.5132547271338502E-5,6.2610456059448755E-4,7.3333333333333331E-5,6.111111111111111E-4,null,null,7.3333333333333331E-5,6.111111111111111E-4,5.740331403651157E-5,4.7836095030426312E-4,5.6666666666666671E-5,4.7222222222222229E-4,null,null,5.6666666666666671E-5,4.7222222222222229E-4,0.28070000000000006,2.3391666666666673,null,null,null,null,null,null,0.28070000000000006,2.3391666666666673,"NOx control","Selective Noncatalytic Reduction","2005-03-01","SO2 control","Dry FGD - Unspecified","2005-03-01","PM control","Fabric Filter, pulse","2005-03-01","","",null,"","",null,"","",null,"","",null,"","",null,"","",null,"","",null,"","",null,"",""]
["4941_2","coal",27,null,4941,"Navajo Generating Station","AZ","002","2","Conventional Boiler","Tangential firing",812,7450,9.1748768472906406,"bituminous","bituminous",9.1496011398650495E-4,7.3632865405510329E-3,3.1431800723246648E-4,2.8838290072436888E-3,null,null,null,null,3.1431800723246648E-4,2.8838290072436888E-3,null,null,8.0000000000000004E-4,7.3399014778325125E-3,null,null,8.0000000000000004E-4,7.3399014778325125E-3,6.9650141399656536E-5,6.3903146973822811E-4,6.666666666666667E-5,6.1165845648604271E-4,null,null,6.666666666666667E-5,6.1165845648604271E-4,5.2386334538744413E-5,4.8063816787394812E-4,5.0000000000000002E-5,4.5874384236453203E-4,null,null,5.0000000000000002E-5,4.5874384236453203E-4,null,null,null,null,null,null,null,null,null,null,"PM control","Electrostatic precipitator, hot side, w/o flue gas conditioning","1975-04-01","SO2 control","Wet FGD - Spray Type","1998-04-01","","",null,"","",null,"","",null,"","",null,"","",null,"","",null,"","",null,"","",null,"","",null,"",""]
["2727_Unit 4","coal",28,null,2727,"Marshall","NC","U4","Unit 4","Conventional Boiler","Tangential firing",700,6029.8,8.6140000000000008,"bituminous","bituminous",7.3534948462433664E-2,8.8441171996144988E-3,null,null,1.7333333333333336E-4,1.4930933333333338E-3,null,null,1.7333333333333336E-4,1.4930933333333338E-3,null,null,1.995E-5,1.7184930000000001E-4,null,null,1.995E-5,1.7184930000000001E-4,2.8343336934549644E-4,2.4414950435421067E-3,null,null,7.5416666666666666E-5,6.4963916666666672E-4,7.5416666666666666E-5,6.4963916666666672E-4,1.7168561116530132E-4,1.4788998545779057E-3,null,null,5.7100000000000004E-6,4.9185940000000009E-5,5.7100000000000004E-6,4.9185940000000009E-5,null,null,9.4491230902303269E-2,0.81394746299244047,null,null,null,null,9.4491230902303269E-2,0.81394746299244047,"NOx control","Selective Noncatalytic Reduction","2006-12-01","PM control","Electrostatic precipitator, cold side, w/ flue gas conditioning","2006-05-01","SO2 control","Wet FGD - Spray Type","2006-10-01","","",null,"","",null,"","",null,"","",null,"","",null,"","",null,"","",null,"","",null,"",""]
["130_3","coal",29,null,130,"Cross","SC","C3","3","Conventional Boiler","Tangential firing",625,6058,9.6928000000000001,"bituminous","bituminous",8.1699608262108259E-2,5.416417378917379E-3,null,null,null,null,null,null,null,null,null,null,1.1373333333333333E-5,1.1023944533333333E-4,null,null,1.1373333333333333E-5,1.1023944533333333E-4,6.8939832141421862E-5,6.6822000498037383E-4,null,null,2.7599999999999999E-4,2.6752128E-3,6.8939832141421862E-5,6.6822000498037383E-4,6.7011157952417624E-5,6.4952575180119354E-4,null,null,4.1533333333333331E-5,4.0257429333333332E-4,4.1533333333333331E-5,4.0257429333333332E-4,7.4300000000000019E-2,0.72017504000000021,null,null,null,null,null,null,7.4300000000000019E-2,0.72017504000000021,"NOx control","Selective Catalytic Reduction","2006-08-01","PM control","Electrostatic precipitator, cold side, w/o flue gas conditioning","2006-08-01","SO2 control","Wet FGD - Spray Type","2006-08-01","","",null,"","",null,"","",null,"","",null,"","",null,"","",null,"","",null,"","",null,"",""]
["54035_BLR1","coal",30,null,54035,"Roanoke Valley I","NC","Boiler 1","BLR1","Conventional Boiler","Wall firing - front firing",182,1700,9.3406593406593412,"bituminous","bituminous",6.5768047256661924E-2,7.58522427192042E-3,null,null,null,null,null,null,null,null,null,null,2.8800000000000001E-4,2.6901098901098903E-3,null,null,2.8800000000000001E-4,2.6901098901098903E-3,7.3156720274684963E-5,6.8333200256573867E-4,null,null,5.6300000000000002E-4,5.2587912087912097E-3,7.3156720274684963E-5,6.8333200256573867E-4,6.5791044464119419E-5,6.1453173400551108E-4,null,null,null,null,6.5791044464119419E-5,6.1453173400551108E-4,null,null,null,null,null,null,null,null,null,null,"SO2 control","Dry FGD - Spray Dryer","1994-05-01","PM control","Fabric Filter, reverse air","1994-05-01","","",null,"","",null,"","",null,"","",null,"","",null,"","",null,"","",null,"","",null,"","",null,"",""]
["4078_4","coal",31,null,4078,"Weston","WI","W4","4","Conventional Boiler","Wall firing - opposed firing",574.5,5173.07,9.0044734551784149,"subbituminous","subbituminous",null,null,null,null,null,null,null,null,null,null,null,null,1.7233333333333334E-4,1.5517709254424135E-3,null,null,1.7233333333333334E-4,1.5517709254424135E-3,null,null,null,null,7.6666666666666669E-5,6.9034296489701183E-4,7.6666666666666669E-5,6.9034296489701183E-4,null,null,null,null,3.1000000000000001E-5,2.7913867711053085E-4,3.1000000000000001E-5,2.7913867711053085E-4,6.1233333333333348E-2,0.55137392457209178,null,null,null,null,5.000000000000001E-2,0.45022367275892083,5.000000000000001E-2,0.45022367275892083,"NOx control","Selective Catalytic Reduction","2008-07-01","Other control","Activated carbon injection","2008-07-01","SO2 control","Dry FGD - Spray Dryer","2008-07-01","PM control","Fabric Filter, pulse","2008-07-01","","",null,"","",null,"","",null,"","",null,"","",null,"","",null,"","",null,"",""]
["56068_1","coal",32,null,56068,"Elm Road Generating Station","WI","ERGS-B1","1","Conventional Boiler","Wall firing - unspecified",677,6515,9.6233382570162487,"bituminous","bituminous",9.2235243265966618E-2,3.6897562916481815E-3,null,null,null,null,null,null,null,null,null,null,1.6666666666666666E-4,1.6038897095027082E-3,null,null,1.6666666666666666E-4,1.6038897095027082E-3,7.6400778323059757E-5,7.3523053290211872E-4,null,null,null,null,7.6400778323059757E-5,7.3523053290211872E-4,5.7205829835858556E-5,5.5051105078377915E-4,null,null,null,null,5.7205829835858556E-5,5.5051105078377915E-4,null,null,null,null,8.9999999999999993E-3,8.6610044313146228E-2,null,null,8.9999999999999993E-3,8.6610044313146228E-2,"NOx control","Selective Catalytic Reduction","2009-10-01","PM control","Fabric Filter, pulse","2009-10-01","SO2 control","Wet FGD - Spray Type","2009-10-01","Other control","Wet electrostatic precipitator","2009-10-01","","",null,"","",null,"","",null,"","",null,"","",null,"","",null,"","",null,"",""]
["113_3","coal",33,null,113,"Cholla","AZ","003","3","Conventional Boiler","Tangential firing",305,2929,9.6032786885245898,"bituminous","bituminous",1.0451029828896323E-3,5.9660168547030351E-3,null,null,null,null,null,null,null,null,null,null,5.3666666666666672E-5,5.1537595628415309E-4,null,null,5.3666666666666672E-5,5.1537595628415309E-4,8.0274153841027222E-5,7.7089507082088102E-4,null,null,null,null,8.0274153841027222E-5,7.7089507082088102E-4,8.2223855437278388E-5,7.8961859860914225E-4,null,null,null,null,8.2223855437278388E-5,7.8961859860914225E-4,null,null,null,null,0.13794274810714288,1.3247026531338408,0.113,1.0851704918032787,0.113,1.0851704918032787,"PM control","Fabric Filter, unspecified","2009-01-01","SO2 control","Wet FGD - Unspecified","2009-01-01","","",null,"","",null,"","",null,"","",null,"","",null,"","",null,"","",null,"","",null,"","",null,"",""]
["708_2","coal",34,null,708,"Hammond","GA","Unit 2","2","Conventional Boiler","Wall firing - front firing",115,1138.0319999999999,9.895930434782608,"bituminous","bituminous",2.2665857455893109E-2,9.7291289683915528E-3,null,null,null,null,null,null,null,null,null,null,8.9383333333333339E-6,8.845312486956521E-5,null,null,8.9383333333333339E-6,8.845312486956521E-5,7.8766681379477131E-5,7.794695995099923E-4,null,null,null,null,7.8766681379477131E-5,7.794695995099923E-4,2.1653933036851598E-5,2.142858149721243E-4,null,null,null,null,2.1653933036851598E-5,2.142858149721243E-4,2.9366666666666673E-2,0.29061049043478265,null,null,null,null,null,null,2.9366666666666673E-2,0.29061049043478265,"PM control","Electrostatic precipitator, cold side, w/ flue gas conditioning","1969-04-01","SO2 control","Wet FGD - Spray Type","2008-05-01","","",null,"","",null,"","",null,"","",null,"","",null,"","",null,"","",null,"","",null,"","",null,"",""]
["708_3","coal",35,null,708,"Hammond","GA","Unit 3","3","Conventional Boiler","Wall firing - front firing",115,1141.3920000000001,9.9251478260869561,"bituminous","bituminous",2.2665857455893109E-2,9.7291289683915528E-3,null,null,null,null,null,null,null,null,null,null,8.9383333333333339E-6,8.8714279652173913E-5,null,null,8.9383333333333339E-6,8.8714279652173913E-5,7.8766681379477131E-5,7.8177095646160132E-4,null,null,null,null,7.8766681379477131E-5,7.8177095646160132E-4,2.1653933036851598E-5,2.1491848640694015E-4,null,null,null,null,2.1653933036851598E-5,2.1491848640694015E-4,2.9366666666666673E-2,0.29146850782608702,null,null,null,null,null,null,2.9366666666666673E-2,0.29146850782608702,"PM control","Electrostatic precipitator, cold side, w/ flue gas conditioning","1968-12-01","SO2 control","Wet FGD - Spray Type","2008-05-01","","",null,"","",null,"","",null,"","",null,"","",null,"","",null,"","",null,"","",null,"","",null,"",""]
["708_1","coal",36,null,708,"Hammond","GA","Unit 1","1","Conventional Boiler","Wall firing - front firing",115,1158.752,10.076104347826087,"bituminous","bituminous",2.2665857455893109E-2,9.7291289683915528E-3,null,null,null,null,null,null,null,null,null,null,8.9383333333333339E-6,9.0063579362318843E-5,null,null,8.9383333333333339E-6,9.0063579362318843E-5,7.8766681379477131E-5,7.9366130071158159E-4,null,null,null,null,7.8766681379477131E-5,7.9366130071158159E-4,2.1653933036851598E-5,2.1818728882015532E-4,null,null,null,null,2.1653933036851598E-5,2.1818728882015532E-4,2.9366666666666673E-2,0.29590159768115948,null,null,null,null,null,null,2.9366666666666673E-2,0.29590159768115948,"PM control","Electrostatic precipitator, cold side, w/ flue gas conditioning","1971-02-01","SO2 control","Wet FGD - Spray Type","2008-05-01","","",null,"","",null,"","",null,"","",null,"","",null,"","",null,"","",null,"","",null,"","",null,"",""]
["2079_5A","coal",37,null,2079,"Hawthorn","MO","5A","5A","Conventional Boiler","Wall firing - opposed firing",594,6600,11.111111111111111,"subbituminous,  bituminous","subbituminous,  bituminous",8.6835030285458976E-4,6.1392498021393621E-3,null,null,null,null,null,null,null,null,null,null,4.6266666666666669E-5,5.1407407407407413E-4,null,null,4.6266666666666669E-5,5.1407407407407413E-4,7.2108461727332144E-5,8.0120513030369051E-4,null,null,2.7E-4,3.0000000000000001E-3,7.2108461727332144E-5,8.0120513030369051E-4,7.3847391096191049E-5,8.2052656773545611E-4,null,null,null,null,7.3847391096191049E-5,8.2052656773545611E-4,null,null,0.12535393243236512,1.3928214714707234,null,null,null,null,0.12535393243236512,1.3928214714707234,"NOx control","Selective Catalytic Reduction","2001-05-01","SO2 control","Dry FGD - Spray Dryer","2001-05-01","PM control","Fabric Filter, pulse","2001-05-01","","",null,"","",null,"","",null,"","",null,"","",null,"","",null,"","",null,"","",null,"",""]
["963_34","coal",38,null,963,"Dallman","IL","34","34","Conventional Boiler","Wall firing - opposed firing",229.4,1924.9,8.3910200523103757,"bituminous","bituminous",0.15592436568678714,3.4104745573143129E-3,null,null,null,null,null,null,null,null,null,null,2.4466666666666663E-4,2.0530029061319381E-3,null,null,2.4466666666666663E-4,2.0530029061319381E-3,null,null,1.0033333333333334E-4,8.4189901191514109E-4,9.7E-5,8.1392894507410643E-4,9.7E-5,8.1392894507410643E-4,null,null,6.7000000000000002E-5,5.6219834350479522E-4,6.8999999999999997E-5,5.7898038360941592E-4,6.7000000000000002E-5,5.6219834350479522E-4,0.11800000000000002,0.99014036617262446,null,null,null,null,null,null,0.11800000000000002,0.99014036617262446,"NOx control","Selective Catalytic Reduction","2009-05-01","PM control","Fabric Filter, pulse","2009-05-01","SO2 control","Wet FGD - Packed Type","2009-05-01","Other control","Wet electrostatic precipitator","2009-05-01","","",null,"","",null,"","",null,"","",null,"","",null,"","",null,"","",null,"",""]
["708_4","coal",39,null,708,"Hammond","GA","Unit 4","4","Conventional Boiler","Wall firing - front firing",520,5458.53,10.497173076923076,"bituminous","bituminous",2.2665857455893109E-2,9.7291289683915528E-3,null,null,null,null,null,null,null,null,null,null,8.9383333333333339E-6,9.3827232019230768E-5,null,null,8.9383333333333339E-6,9.3827232019230768E-5,7.8766681379477131E-5,8.2682748713522553E-4,null,null,null,null,7.8766681379477131E-5,8.2682748713522553E-4,2.1653933036851598E-5,2.2730508288393373E-4,null,null,null,null,2.1653933036851598E-5,2.2730508288393373E-4,2.9366666666666673E-2,0.30826698269230773,null,null,null,null,null,null,2.9366666666666673E-2,0.30826698269230773,"NOx control","Selective Catalytic Reduction","2002-05-01","PM control","Electrostatic precipitator, cold side, w/ flue gas conditioning","1970-12-01","SO2 control","Wet FGD - Spray Type","2008-05-01","","",null,"","",null,"","",null,"","",null,"","",null,"","",null,"","",null,"","",null,"",""]
["7097_BLR1","coal",40,null,7097,"J K Spruce","TX","1","BLR1","Conventional Boiler","Tangential firing",580,6361,10.967241379310344,"bituminous","bituminous",2.9487179487179493E-3,3.1794871794871798E-3,null,null,null,null,null,null,null,null,null,null,3.166666666666667E-4,3.472959770114943E-3,null,null,3.166666666666667E-4,3.472959770114943E-3,7.6236903942463802E-5,8.3610852754829694E-4,null,null,null,null,7.6236903942463802E-5,8.3610852754829694E-4,4.9757200409507591E-5,5.4569922724978927E-4,null,null,1.5333333333333334E-4,1.6816436781609196E-3,4.9757200409507591E-5,5.4569922724978927E-4,null,null,null,null,null,null,null,null,null,null,"PM control","Fabric Filter, reverse air","1992-07-01","SO2 control","Wet FGD - Spray Type","1992-12-01","","",null,"","",null,"","",null,"","",null,"","",null,"","",null,"","",null,"","",null,"","",null,"",""]
["113_4","coal",41,null,113,"Cholla","AZ","004","4","Conventional Boiler","Tangential firing",425,4268,10.042352941176471,"bituminous","bituminous",1.6079466429935177E-3,4.7511495043464132E-3,null,null,null,null,null,null,null,null,null,null,5.9666666666666669E-5,5.9919372549019616E-4,null,null,5.9666666666666669E-5,5.9919372549019616E-4,8.5239102390997849E-5,8.5600115059947962E-4,null,null,null,null,8.5239102390997849E-5,8.5600115059947962E-4,8.7302245290867627E-5,8.7671995976805429E-4,null,null,null,null,8.7302245290867627E-5,8.7671995976805429E-4,null,null,null,null,0.15057526065142857,1.5121299116712874,0.1,1.0042352941176471,0.1,1.0042352941176471,"PM control","Fabric Filter, unspecified","2008-01-01","SO2 control","Wet FGD - Packed Type","2008-01-01","","",null,"","",null,"","",null,"","",null,"","",null,"","",null,"","",null,"","",null,"","",null,"",""]
["4941_3","coal",42,null,4941,"Navajo Generating Station","AZ","003","3","Conventional Boiler","Tangential firing",812,7450,9.1748768472906406,"bituminous","bituminous",8.3111702127659575E-4,5.6515957446808514E-3,3.4737066285337771E-4,3.1870830520414582E-3,null,null,null,null,3.4737066285337771E-4,3.1870830520414582E-3,null,null,8.3333333333333339E-4,7.6457307060755339E-3,null,null,8.3333333333333339E-4,7.6457307060755339E-3,9.3828093167331065E-5,8.6086119962637498E-4,9.6666666666666667E-5,8.8690476190476193E-4,null,null,9.3828093167331065E-5,8.6086119962637498E-4,5.7895110475562963E-5,5.3118050867357648E-4,6.0000000000000002E-5,5.5049261083743844E-4,null,null,5.7895110475562963E-5,5.3118050867357648E-4,null,null,null,null,null,null,null,null,null,null,"PM control","Electrostatic precipitator, hot side, w/o flue gas conditioning","1976-05-01","SO2 control","Wet FGD - Spray Type","1997-04-01","","",null,"","",null,"","",null,"","",null,"","",null,"","",null,"","",null,"","",null,"","",null,"",""]
["10771_10771-01","coal",43,null,10771,"Hopewell","VA","1 & 2","10771-01","Conventional Boiler","Stoker - spreader",34,433,12.735294117647058,"bituminous","bituminous",0.10466666666666666,3.5666666666666668E-3,null,null,null,null,null,null,null,null,null,null,8.7433333333333341E-4,1.0993455882352943E-2,null,null,8.7433333333333341E-4,1.0993455882352943E-2,7.3366827978427467E-5,9.2247996943463947E-4,null,null,null,null,7.3366827978427467E-5,9.2247996943463947E-4,7.3037782192353056E-5,9.1834270256561565E-4,null,null,null,null,7.3037782192353056E-5,9.1834270256561565E-4,null,null,2.3157477373991747E-2,0.29117122286416097,null,null,null,null,2.3157477373991747E-2,0.29117122286416097,"NOx control","Selective Noncatalytic Reduction","1992-04-01","NOx control","Selective Noncatalytic Reduction","1992-04-01","PM control","Multiple cyclone","1992-04-01","PM control","Multiple cyclone","1992-04-01","SO2 control","Dry FGD - Spray Dryer","1992-04-01","SO2 control","Dry FGD - Spray Dryer","1992-04-01","PM control","Fabric Filter, pulse","1992-04-01","PM control","Fabric Filter, pulse","1992-04-01","","",null,"","",null,"","",null,"",""]
["10771_10771-02","coal",44,null,10771,"Hopewell","VA","1 & 2","10771-02","Conventional Boiler","Stoker - underfeed",34,422,12.411764705882353,"bituminous","bituminous",0.10466666666666666,3.5666666666666668E-3,null,null,null,null,null,null,null,null,null,null,8.7433333333333341E-4,1.0993455882352943E-2,null,null,8.7433333333333341E-4,1.0993455882352943E-2,7.3366827978427467E-5,9.2247996943463947E-4,null,null,null,null,7.3366827978427467E-5,9.2247996943463947E-4,7.3037782192353056E-5,9.1834270256561565E-4,null,null,null,null,7.3037782192353056E-5,9.1834270256561565E-4,null,null,2.3157477373991747E-2,0.29117122286416097,null,null,null,null,2.3157477373991747E-2,0.29117122286416097,"NOx control","Selective Noncatalytic Reduction","1992-04-01","NOx control","Selective Noncatalytic Reduction","1992-04-01","PM control","Multiple cyclone","1992-04-01","PM control","Multiple cyclone","1992-04-01","SO2 control","Dry FGD - Spray Dryer","1992-04-01","SO2 control","Dry FGD - Spray Dryer","1992-04-01","PM control","Fabric Filter, pulse","1992-04-01","PM control","Fabric Filter, pulse","1992-04-01","","",null,"","",null,"","",null,"",""]
["68029_BLR2","coal",45,null,68029,"AES Puerto Rico Cogeneration Facility","PR","Unit_2","BLR2","Fluidized bed firing","Fluidized bed firing",255,2461.4,9.652549019607843,"bituminous","bituminous",3.7803285553972398E-3,2.6186667816706145E-3,null,null,null,null,null,null,null,null,null,null,1.5406900700000003E-3,1.4871586424698041E-2,null,null,1.5406900700000003E-3,1.4871586424698041E-2,9.5966190420016908E-5,9.2631835725423377E-4,null,null,null,null,9.5966190420016908E-5,9.2631835725423377E-4,9.8457318607069366E-5,9.5036409419388445E-4,null,null,null,null,9.8457318607069366E-5,9.5036409419388445E-4,8.7100000000000025E-3,8.4073701960784342E-2,null,null,null,null,null,null,8.7100000000000025E-3,8.4073701960784342E-2,"NOx control","Selective Noncatalytic Reduction",null,"SO2 control","Dry FGD - Spray Dryer",null,"PM control","Electrostatic precipitator, cold side, w/o flue gas conditioning",null,"","",null,"","",null,"","",null,"","",null,"","",null,"","",null,"","",null,"","",null,"",""]
["6170_2","coal",46,null,6170,"Pleasant Prairie","WI","PPPPB2","2","Conventional Boiler","Wall firing - opposed firing",643,6449,10.029548989113531,"subbituminous","subbituminous",2.9915975992055172E-3,7.2304505307177374E-3,null,null,null,null,null,null,null,null,null,null,2.1000000000000001E-4,2.1062052877138413E-3,null,null,2.1000000000000001E-4,2.1062052877138413E-3,9.4427057573626377E-5,9.4706079983252964E-4,null,null,null,null,9.4427057573626377E-5,9.4706079983252964E-4,7.6263021692990162E-5,7.6488371212767275E-4,null,null,null,null,7.6263021692990162E-5,7.6488371212767275E-4,null,null,null,null,null,null,null,null,null,null,"NOx control","Selective Catalytic Reduction","2003-04-01","PM control","Electrostatic precipitator, cold side, w/o flue gas conditioning","1985-05-01","SO2 control","Wet FGD - Spray Type","2007-03-01","","",null,"","",null,"","",null,"","",null,"","",null,"","",null,"","",null,"","",null,"",""]
["6170_1","coal",47,null,6170,"Pleasant Prairie","WI","PPPPB1","1","Conventional Boiler","Wall firing - opposed firing",655,6449,9.8458015267175565,"subbituminous","subbituminous",4.0028906532045437E-3,7.4702231334416586E-3,null,null,null,null,null,null,null,null,null,null,1.953333333333333E-4,1.9232132315521624E-3,null,null,1.953333333333333E-4,1.9232132315521624E-3,9.6555893080218014E-5,9.5067015950278764E-4,null,null,null,null,9.6555893080218014E-5,9.5067015950278764E-4,5.9544349936959351E-5,5.8626185151671882E-4,null,null,null,null,5.9544349936959351E-5,5.8626185151671882E-4,null,null,null,null,null,null,null,null,null,null,"NOx control","Selective Catalytic Reduction","2006-11-01","PM control","Electrostatic precipitator, cold side, w/o flue gas conditioning","1980-06-01","SO2 control","Wet FGD - Spray Type","2006-11-01","","",null,"","",null,"","",null,"","",null,"","",null,"","",null,"","",null,"","",null,"",""]
["68029_BLR1","coal",48,null,68029,"AES Puerto Rico Cogeneration Facility","PR","Unit_1","BLR1","Fluidized bed firing","Fluidized bed firing",255,2461.4,9.652549019607843,"bituminous","bituminous",3.5929001534478291E-3,2.8646664116698233E-3,null,null,null,null,null,null,null,null,null,null,1.25217378236E-3,1.2086668815297663E-2,null,null,1.25217378236E-3,1.2086668815297663E-2,1.0185307653015406E-4,9.8314181400518106E-4,null,null,null,null,1.0185307653015406E-4,9.8314181400518106E-4,1.025249297886349E-4,9.8962691051665075E-4,null,null,null,null,1.025249297886349E-4,9.8962691051665075E-4,9.0000000000000045E-3,8.6872941176470625E-2,null,null,null,null,null,null,9.0000000000000045E-3,8.6872941176470625E-2,"NOx control","Selective Noncatalytic Reduction",null,"SO2 control","Dry FGD - Spray Dryer",null,"PM control","Electrostatic precipitator, cold side, w/o flue gas conditioning",null,"","",null,"","",null,"","",null,"","",null,"","",null,"","",null,"","",null,"","",null,"",""]
["10774_1","coal",49,null,10774,"Southampton Power Station","VA","Unit 1 & 2","1","Conventional Boiler","Stoker - spreader",34,442,13,"bituminous","bituminous",0.1013838383838384,5.3006993006993013E-3,null,null,null,null,null,null,null,null,null,null,3.9548503803E-3,5.1703852765980884E-2,null,null,3.9548503803E-3,5.1703852765980884E-2,7.763296516269501E-5,1.0149368533769981E-3,null,null,null,null,7.763296516269501E-5,1.0149368533769981E-3,7.4975102611615297E-5,9.8018920914302952E-4,null,null,null,null,7.4975102611615297E-5,9.8018920914302952E-4,null,null,2.8694882963040458E-2,0.37514339638445543,null,null,null,null,2.8694882963040458E-2,0.37514339638445543,"PM control","Multiple cyclone","1992-03-01","PM control","Multiple cyclone","1992-03-01","SO2 control","Dry FGD - Spray Dryer","1992-03-01","SO2 control","Dry FGD - Spray Dryer","1992-03-01","PM control","Fabric Filter, pulse","1992-03-01","PM control","Fabric Filter, pulse","1992-03-01","","",null,"","",null,"","",null,"","",null,"","",null,"",""]
["10774_2","coal",50,null,10774,"Southampton Power Station","VA","Unit 1 & 2","2","Conventional Boiler","Stoker - spreader",34,447,13.147058823529411,"bituminous","bituminous",0.1013838383838384,5.3006993006993013E-3,null,null,null,null,null,null,null,null,null,null,3.9548503803E-3,5.1703852765980884E-2,null,null,3.9548503803E-3,5.1703852765980884E-2,7.763296516269501E-5,1.0149368533769981E-3,null,null,null,null,7.763296516269501E-5,1.0149368533769981E-3,7.4975102611615297E-5,9.8018920914302952E-4,null,null,null,null,7.4975102611615297E-5,9.8018920914302952E-4,null,null,2.8694882963040458E-2,0.37514339638445543,null,null,null,null,2.8694882963040458E-2,0.37514339638445543,"PM control","Multiple cyclone","1992-03-01","PM control","Multiple cyclone","1992-03-01","SO2 control","Dry FGD - Spray Dryer","1992-03-01","SO2 control","Dry FGD - Spray Dryer","1992-03-01","PM control","Fabric Filter, pulse","1992-03-01","PM control","Fabric Filter, pulse","1992-03-01","","",null,"","",null,"","",null,"","",null,"","",null,"",""]
["2451_Unit 3","coal",51,null,2451,"San Juan","NM","Unit 3","Unit 3","Conventional Boiler","Wall firing - opposed firing",544,5758,10.584558823529411,"subbituminous","subbituminous",null,null,null,null,null,null,null,null,null,null,null,null,1.4709290016333334E-5,1.5569134543023407E-4,null,null,1.4709290016333334E-5,1.5569134543023407E-4,9.5978746589312882E-5,1.015892689083205E-3,null,null,null,null,9.5978746589312882E-5,1.015892689083205E-3,1.1110052853993846E-4,1.1759500796561869E-3,null,null,null,null,1.1110052853993846E-4,1.1759500796561869E-3,3.55483870967742E-2,0.37626399430740043,null,null,null,null,null,null,3.55483870967742E-2,0.37626399430740043,"Other control","Activated carbon injection","2008-04-01","PM control","Fabric Filter, pulse","2008-03-01","SO2 control","Wet FGD - Spray Type","1998-05-01","","",null,"","",null,"","",null,"","",null,"","",null,"","",null,"","",null,"","",null,"",""]
["6041_4","coal",52,null,6041,"H L Spurlock Station","KY","Unit 04","4","Fluidized bed firing","Fluidized bed firing",300,2800,9.3333333333333339,"bituminous","bituminous",null,9.1676003627869738E-3,2.9109397387203339E-4,2.7168770894723119E-3,null,null,null,null,2.9109397387203339E-4,2.7168770894723119E-3,null,null,2.6999999999999997E-3,2.52E-2,null,null,2.6999999999999997E-3,2.52E-2,1.3023959363441052E-4,1.2155695405878316E-3,2.0000000000000001E-4,1.8666666666666669E-3,1.1843833333333333E-4,1.1054244444444444E-3,1.1843833333333333E-4,1.1054244444444444E-3,4.8515662312005565E-5,4.5281284824538531E-4,1E-4,9.3333333333333343E-4,1.3333333333333332E-5,1.2444444444444444E-4,1.3333333333333332E-5,1.2444444444444444E-4,9.7766666666666696E-2,0.91248888888888924,null,null,null,null,9.9333333333333329E-2,0.92711111111111111,9.7766666666666696E-2,0.91248888888888924,"NOx control","Selective Noncatalytic Reduction","2009-04-01","SO2 control","Dry FGD - Unspecified","2009-04-01","PM control","Fabric Filter, pulse","2009-04-01","","",null,"","",null,"","",null,"","",null,"","",null,"","",null,"","",null,"","",null,"",""]
["1082_3","coal",53,null,1082,"Walter Scott Jr. Energy Center","IA","3","3","Conventional Boiler","Wall firing - unspecified",765,7700,10.065359477124183,"","Subbituminous",null,null,null,null,null,null,null,null,null,null,null,null,null,null,null,null,null,null,null,null,null,null,1.1E-4,1.1071895424836602E-3,1.1E-4,1.1071895424836602E-3,null,null,null,null,1.4200000000000001E-4,1.4292810457516339E-3,1.4200000000000001E-4,1.4292810457516339E-3,null,null,null,null,null,null,null,null,null,null,"SO2 control","Dry FGD - Circulating Dry Scrubber","2009-05-01","PM control","Fabric Filter, pulse","2009-05-01","","",null,"","",null,"","",null,"","",null,"","",null,"","",null,"","",null,"","",null,"","",null,"",""]
["2451_Unit 1","coal",54,null,2451,"San Juan","NM","Unit 1","Unit 1","Conventional Boiler","Wall firing - front firing",370,3707,10.018918918918919,"subbituminous","subbituminous",null,null,null,null,null,null,null,null,null,null,null,null,2.5289249734433331E-4,2.5337094260957935E-3,null,null,2.5289249734433331E-4,2.5337094260957935E-3,1.1135261445682932E-4,1.1156328156526115E-3,null,null,null,null,1.1135261445682932E-4,1.1156328156526115E-3,2.2658536573050511E-4,2.2701404074675201E-3,null,null,null,null,2.2658536573050511E-4,2.2701404074675201E-3,6.5473684210526309E-2,0.65597553342816495,null,null,null,null,null,null,6.5473684210526309E-2,0.65597553342816495,"Other control","Activated carbon injection","2009-06-01","PM control","Fabric Filter, pulse","2008-10-01","SO2 control","Wet FGD - Spray Type","1998-05-01","","",null,"","",null,"","",null,"","",null,"","",null,"","",null,"","",null,"","",null,"",""]
["703_4","coal",55,null,703,"Bowen","GA","Unit 4","4","Conventional Boiler","Tangential firing",933,8887.7430000000004,9.5259839228295817,"bituminous","bituminous",0.11636286470232371,4.7039593453851482E-3,null,null,null,null,null,null,null,null,null,null,1.0833333333333332E-5,1.0319815916398712E-4,null,null,1.0833333333333332E-5,1.0319815916398712E-4,1.1939149442247827E-4,1.1373214563911256E-3,null,null,null,null,1.1939149442247827E-4,1.1373214563911256E-3,5.7473891557784769E-5,5.4749536696190851E-4,null,null,null,null,5.7473891557784769E-5,5.4749536696190851E-4,5.3933333333333347E-2,0.51376806623794224,null,null,null,null,null,null,5.3933333333333347E-2,0.51376806623794224,"NOx control","Selective Catalytic Reduction","2003-05-01","PM control","Electrostatic precipitator, cold side, w/ flue gas conditioning","1975-11-01","SO2 control","Wet FGD - Spray Type","2008-12-01","","",null,"","",null,"","",null,"","",null,"","",null,"","",null,"","",null,"","",null,"",""]
["2451_Unit 4","coal",56,null,2451,"San Juan","NM","Unit 4","Unit 4","Conventional Boiler","Wall firing - opposed firing",544,5649,10.384191176470589,"subbituminous","subbituminous",null,null,null,null,null,null,null,null,null,null,null,null,2.0997349701666671E-5,2.180404935013144E-4,null,null,2.0997349701666671E-5,2.180404935013144E-4,1.178198173825542E-4,1.2234635080772955E-3,null,null,null,null,1.178198173825542E-4,1.2234635080772955E-3,1.1284648212062037E-4,1.1718194439326922E-3,null,null,null,null,1.1284648212062037E-4,1.1718194439326922E-3,5.8870967741935482E-2,0.61132738377609108,null,null,null,null,null,null,5.8870967741935482E-2,0.61132738377609108,"Other control","Activated carbon injection","2008-04-01","PM control","Fabric Filter, pulse","2007-10-01","SO2 control","Wet FGD - Spray Type","1998-04-01","","",null,"","",null,"","",null,"","",null,"","",null,"","",null,"","",null,"","",null,"",""]
["2828_1","coal",57,null,2828,"Cardinal","OH","CD-U1","1","Conventional Boiler","Wall firing - opposed firing",615.20000000000005,5275,8.5744473342002596,"bituminous","bituminous",4.3095208871103553E-2,4.2617343879899671E-3,null,null,null,null,null,null,null,null,null,null,2.4633333333333338E-4,2.1121721933246643E-3,null,null,2.4633333333333338E-4,2.1121721933246643E-3,1.4296170455888643E-4,1.2258176065476688E-3,null,null,null,null,1.4296170455888643E-4,1.2258176065476688E-3,8.6175465363034844E-5,7.3890698925554088E-4,null,null,null,null,8.6175465363034844E-5,7.3890698925554088E-4,0.23494999999999999,2.014566401170351,null,null,null,null,null,null,0.23494999999999999,2.014566401170351,"NOx control","Selective Catalytic Reduction","2003-01-01","Other control","Dry sorbent injection","2008-03-01","PM control","Electrostatic precipitator, cold side, w/o flue gas conditioning","1980-05-01","SO2 control","Wet FGD - Jet Bubbling Reactor","2008-03-01","","",null,"","",null,"","",null,"","",null,"","",null,"","",null,"","",null,"",""]
["2451_Unit 2","coal",58,null,2451,"San Juan","NM","Unit 2","Unit 2","Conventional Boiler","Wall firing - front firing",370,3688,9.967567567567567,"subbituminous","subbituminous",null,null,null,null,null,null,null,null,null,null,null,null,2.2185346712E-5,2.2113394236177296E-4,null,null,2.2185346712E-5,2.2113394236177296E-4,1.2405851099797505E-4,1.2365615907041405E-3,null,null,null,null,1.2405851099797505E-4,1.2365615907041405E-3,2.5217262171133291E-4,2.513547645598367E-3,null,null,null,null,2.5217262171133291E-4,2.513547645598367E-3,8.328571428571431E-2,0.83015598455598472,null,null,null,null,null,null,8.328571428571431E-2,0.83015598455598472,"Other control","Activated carbon injection","2009-06-01","PM control","Fabric Filter, pulse","2009-04-01","SO2 control","Wet FGD - Spray Type","1998-05-01","","",null,"","",null,"","",null,"","",null,"","",null,"","",null,"","",null,"","",null,"",""]
["6180_1","coal",59,null,6180,"Oak Grove","TX","OG1","1","Conventional Boiler","Tangential firing",817,8970,10.979192166462669,"lignite","lignite",1.1838531059731247E-2,8.5308560137224484E-3,null,null,null,null,null,null,null,null,null,null,1.5866666666666665E-5,1.7420318237454101E-4,null,null,1.5866666666666665E-5,1.7420318237454101E-4,1.2025861536760588E-4,1.3203424477936656E-3,null,null,2.2666666666666668E-4,2.488616891064872E-3,1.2025861536760588E-4,1.3203424477936656E-3,9.3473123434899947E-5,1.0262593845912517E-3,null,null,1.3999999999999999E-4,1.5370869033047734E-3,9.3473123434899947E-5,1.0262593845912517E-3,null,null,5.6334649225308044E-2,0.61850893947492436,null,null,5.3999999999999999E-2,0.5928763769889841,5.3999999999999999E-2,0.5928763769889841,"NOx control","Selective Catalytic Reduction","2009-08-01","Other control","Activated carbon injection","2009-08-01","PM control","Fabric Filter, pulse","2009-08-01","SO2 control","Wet FGD - Spray Type","2009-08-01","","",null,"","",null,"","",null,"","",null,"","",null,"","",null,"","",null,"",""]
["525_2","coal",60,null,525,"Hayden","CO","Unit 2","2","Conventional Boiler","Tangential firing",285,2712,9.5157894736842099,"bituminous","bituminous",2.3436707007811163E-3,1.0113424440293705E-2,null,null,null,null,null,null,null,null,null,null,1.7066666666666667E-6,1.6240280701754386E-5,null,null,1.7066666666666667E-6,1.6240280701754386E-5,1.425588125755343E-4,1.3565596480871894E-3,null,null,null,null,1.425588125755343E-4,1.3565596480871894E-3,6.2331341373674429E-5,5.9313192212422821E-4,null,null,null,null,6.2331341373674429E-5,5.9313192212422821E-4,0.13686206896551725,1.3023506352087115,null,null,0.12140945273666666,1.1553067923573332,null,null,0.12140945273666666,1.1553067923573332,"SO2 control","Dry FGD - Spray Dryer","1999-06-01","PM control","Fabric Filter, reverse air","1999-06-01","","",null,"","",null,"","",null,"","",null,"","",null,"","",null,"","",null,"","",null,"","",null,"",""]
["703_2","coal",61,null,703,"Bowen","GA","Unit 2","2","Conventional Boiler","Tangential firing",755,7284.11,9.6478278145695366,"bituminous","bituminous",6.963434560625259E-2,4.487640555992249E-3,null,null,null,null,null,null,null,null,null,null,1.0733333333333333E-5,1.0355335187637969E-4,null,null,1.0733333333333333E-5,1.0355335187637969E-4,1.5566627684618814E-4,1.5018414355471358E-3,null,null,null,null,1.5566627684618814E-4,1.5018414355471358E-3,2.9983454644210921E-5,2.8927520769330225E-4,null,null,null,null,2.9983454644210921E-5,2.8927520769330225E-4,null,null,null,null,null,null,null,null,null,null,"NOx control","Selective Catalytic Reduction","2001-06-01","PM control","Electrostatic precipitator, cold side, w/ flue gas conditioning","1981-01-01","PM control","Electrostatic precipitator, cold side, w/ flue gas conditioning","1972-09-01","SO2 control","Wet FGD - Spray Type","2009-05-01","","",null,"","",null,"","",null,"","",null,"","",null,"","",null,"","",null,"",""]
["994_2","coal",62,null,994,"AES Petersburg","IN","2ss","2","Conventional Boiler","Tangential firing",445,4144,9.3123595505617978,"bituminous","bituminous",3.1570889306458315E-2,3.1575393008456032E-3,null,null,null,null,null,null,null,null,null,null,2.1131347420999997E-5,1.9678270497218873E-4,null,null,2.1131347420999997E-5,1.9678270497218873E-4,1.6244583360268774E-4,1.5127540099989618E-3,null,null,null,null,1.6244583360268774E-4,1.5127540099989618E-3,1.1555195522492338E-4,1.0760613538249044E-3,null,null,null,null,1.1555195522492338E-4,1.0760613538249044E-3,9.8233333333333311E-2,0.91478411985018704,null,null,null,null,null,null,9.8233333333333311E-2,0.91478411985018704,"NOx control","Selective Catalytic Reduction","2004-12-01","PM control","Electrostatic precipitator, cold side, w/ flue gas conditioning","1969-12-01","SO2 control","Wet FGD - Spray Type","1996-12-01","","",null,"","",null,"","",null,"","",null,"","",null,"","",null,"","",null,"","",null,"",""]
["994_1","coal",63,null,994,"AES Petersburg","IN","1s","1","Conventional Boiler","Tangential firing",255,2200,8.6274509803921564,"bituminous","bituminous",1.8920914613289059E-2,3.3040621205817065E-3,null,null,null,null,null,null,null,null,null,null,2.9085264040999999E-5,2.5093168976549019E-4,null,null,2.9085264040999999E-5,2.5093168976549019E-4,1.7578119375756386E-4,1.5165436324181979E-3,null,null,null,null,1.7578119375756386E-4,1.5165436324181979E-3,1.6913825975701027E-4,1.4592320449624415E-3,null,null,null,null,1.6913825975701027E-4,1.4592320449624415E-3,4.7470588235294126E-2,0.40955017301038066,null,null,null,null,null,null,4.7470588235294126E-2,0.40955017301038066,"PM control","Electrostatic precipitator, cold side, w/ flue gas conditioning","1967-12-01","SO2 control","Wet FGD - Spray Type","1996-12-01","","",null,"","",null,"","",null,"","",null,"","",null,"","",null,"","",null,"","",null,"","",null,"",""]
["2840_4","coal",64,null,2840,"Conesville","OH","CV-4","4","Conventional Boiler","Tangential firing",841.5,7960,9.4592988710635773,"bituminous","bituminous",4.1287908633679156E-2,4.285864176145124E-3,null,null,null,null,null,null,null,null,null,null,2.3333333333333336E-4,2.2071697365815017E-3,null,null,2.3333333333333336E-4,2.2071697365815017E-3,1.6321428202238091E-4,1.54389267367576E-3,null,null,null,null,1.6321428202238091E-4,1.54389267367576E-3,6.5254713002610901E-5,6.17263833037175E-4,null,null,null,null,6.5254713002610901E-5,6.17263833037175E-4,0.157,1.4851099227569817,null,null,null,null,null,null,0.157,1.4851099227569817,"NOx control","Selective Catalytic Reduction","2009-01-01","PM control","Electrostatic precipitator, cold side, w/o flue gas conditioning","1973-06-01","Other control","Dry sorbent injection","2009-06-01","SO2 control","Wet FGD - Jet Bubbling Reactor","2009-06-01","","",null,"","",null,"","",null,"","",null,"","",null,"","",null,"","",null,"",""]
[{"$f":"E66&\"_\"&I66","v":"3935_2"},"coal",65,null,3935,"John E. Amos","WV","AM-2","2","Conventional Boiler","Wall firing - opposed firing",816.3,7020,8.5997794928335178,"bituminous","bituminous",5.3657029534906288E-2,4.8561142989226418E-3,null,null,null,null,null,null,null,null,null,null,2.0899999999999998E-4,1.7973539140022051E-3,null,null,2.0899999999999998E-4,1.7973539140022051E-3,1.8273986732325522E-4,1.5715225635296482E-3,null,null,null,null,1.8273986732325522E-4,1.5715225635296482E-3,8.4781553243118838E-5,7.2910266295074641E-4,null,null,null,null,8.4781553243118838E-5,7.2910266295074641E-4,4.5066666666666678E-2,0.38756339581036398,null,null,null,null,null,null,4.5066666666666678E-2,0.38756339581036398,"NOx control","Selective Catalytic Reduction",null,"PM control","Electrostatic precipitator, cold side, w/o flue gas conditioning","1977-12-01","SO2 control","Wet FGD - Spray Type","2009-02-01","","",null,"","",null,"","",null,"","",null,"","",null,"","",null,"","",null,"","",null,"",""]
["2917_9","coal",66,null,2917,"Hamilton","OH","Unit 9","9","Conventional Boiler","Tangential firing",50.6,729,14.407114624505928,"bituminous","bituminous",5.4811087552181559E-2,5.0888663028614894E-3,null,null,null,null,null,null,null,null,null,null,5.9000000000000004E-5,8.5001976284584978E-4,null,null,5.9000000000000004E-5,8.5001976284584978E-4,1.1019147818598461E-4,1.5875412568692249E-3,null,null,null,null,1.1019147818598461E-4,1.5875412568692249E-3,1.0963286992664967E-4,1.5794933236467907E-3,null,null,null,null,1.0963286992664967E-4,1.5794933236467907E-3,null,null,0.9356540745994294,13.48007550164,null,null,null,null,0.9356540745994294,13.48007550164,"PM control","Electrostatic precipitator, hot side, w/o flue gas conditioning","1974-06-01","SO2 control","Dry FGD - Spray Dryer","2001-06-01","PM control","Single cyclone","1997-01-01","PM control","Fabric Filter, pulse","1997-01-01","","",null,"","",null,"","",null,"","",null,"","",null,"","",null,"","",null,"",""]
["2828_2","coal",67,null,2828,"Cardinal","OH","CD-U2","2","Conventional Boiler","Wall firing - opposed firing",615.20000000000005,5275,8.5744473342002596,"bituminous","bituminous",7.367303188130396E-2,7.191851399775382E-3,null,null,null,null,null,null,null,null,null,null,2.3666666666666668E-4,2.0292858690940615E-3,null,null,2.3666666666666668E-4,2.0292858690940615E-3,1.8535803671598547E-4,1.5893427237919755E-3,null,null,null,null,1.8535803671598547E-4,1.5893427237919755E-3,8.1572328154487861E-5,6.994376316887572E-4,null,null,null,null,8.1572328154487861E-5,6.994376316887572E-4,0.13689999999999999,1.1738418400520154,null,null,null,null,null,null,0.13689999999999999,1.1738418400520154,"NOx control","Selective Catalytic Reduction","2003-01-01","Other control","Dry sorbent injection","2007-12-01","PM control","Electrostatic precipitator, cold side, w/o flue gas conditioning","1980-05-01","SO2 control","Wet FGD - Jet Bubbling Reactor","2007-12-01","","",null,"","",null,"","",null,"","",null,"","",null,"","",null,"","",null,"",""]
["60_1","coal",68,null,60,"Whelan Energy Center Unit 1 (WEC1)","NE","1","1","Conventional Boiler","Tangential firing",83.6,845.1,10.10885167464115,"subbituminous","subbituminous",null,null,null,null,null,null,null,null,null,null,null,null,4.3299999999999996E-3,4.3771327751196173E-2,null,null,4.3299999999999996E-3,4.3771327751196173E-2,1.624030166840946E-4,1.6417080071737843E-3,null,null,null,null,1.624030166840946E-4,1.6417080071737843E-3,2.6260639602565994E-4,2.6546491062354695E-3,null,null,null,null,2.6260639602565994E-4,2.6546491062354695E-3,null,null,0.70876122842824418,7.1647621309175742,null,null,null,null,0.70876122842824418,7.1647621309175742,"PM control","Electrostatic precipitator, cold side, w/o flue gas conditioning",null,"","",null,"","",null,"","",null,"","",null,"","",null,"","",null,"","",null,"","",null,"","",null,"","",null,"",""]
["728_Y1BR","coal",69,null,728,"Yates","GA","Y1BR","Y1BR","Conventional Boiler","Tangential firing",107,1094.742,10.231233644859813,"bituminous","bituminous",3.784448908985396E-2,7.2914308312312754E-3,null,null,null,null,null,null,null,null,null,null,3.6300000000000004E-4,3.7139378130841127E-3,null,null,3.6300000000000004E-4,3.7139378130841127E-3,1.630606070109156E-4,1.6683111686013436E-3,null,null,null,null,1.630606070109156E-4,1.6683111686013436E-3,1.2766693332212176E-4,1.3061902235413664E-3,null,null,null,null,1.2766693332212176E-4,1.3061902235413664E-3,9.3700000000000019E-2,0.95866659252336472,null,null,null,null,null,null,9.3700000000000019E-2,0.95866659252336472,"PM control","Electrostatic precipitator, cold side, w/o flue gas conditioning","1971-05-01","SO2 control","Wet FGD - Spray Type","1992-10-01","","",null,"","",null,"","",null,"","",null,"","",null,"","",null,"","",null,"","",null,"","",null,"",""]
["55479_3","coal",70,null,55479,"Wygen 1","WY","WYG1Cfg","3","Conventional Boiler","Wall firing - front firing",91,1053,11.571428571428571,"subbituminous","subbituminous",8.5128117817315056E-4,8.1722993104622454E-3,null,null,null,null,null,null,null,null,null,null,4.5500000000000001E-5,5.2650000000000006E-4,null,null,4.5500000000000001E-5,5.2650000000000006E-4,1.5658193226885682E-4,1.8118766448253431E-3,1.5349999999999999E-4,1.7762142857142855E-3,null,null,1.5349999999999999E-4,1.7762142857142855E-3,3.9127996095094758E-4,4.5276681195752502E-3,3.8400000000000001E-4,4.4434285714285713E-3,null,null,3.8400000000000001E-4,4.4434285714285713E-3,0.12766666666666671,1.4772857142857148,null,null,null,null,null,null,0.12766666666666671,1.4772857142857148,"NOx control","Selective Catalytic Reduction","2003-04-01","SO2 control","Dry FGD - Spray Dryer","2003-04-01","PM control","Fabric Filter, pulse","2003-04-01","","",null,"","",null,"","",null,"","",null,"","",null,"","",null,"","",null,"","",null,"",""]
["6139_1","coal",71,null,6139,"Welsh","TX","WE-1","1","Conventional Boiler","Wall firing - opposed firing",558,5156,9.2401433691756267,"subbituminous","subbituminous",2.013129439649609E-3,5.5315872073265016E-3,null,null,null,null,null,null,null,null,null,null,2.2433333333333333E-4,2.0728721624850657E-3,null,null,2.2433333333333333E-4,2.0728721624850657E-3,1.9444687992610377E-4,1.7967170482060771E-3,null,null,null,null,1.9444687992610377E-4,1.7967170482060771E-3,1.3660983948181969E-4,1.2622945024520829E-3,null,null,null,null,1.3660983948181969E-4,1.2622945024520829E-3,0.47975000000000007,4.4329587813620073,null,null,null,null,null,null,0.47975000000000007,4.4329587813620073,"PM control","Electrostatic precipitator, hot side, w/o flue gas conditioning","1977-03-01","","",null,"","",null,"","",null,"","",null,"","",null,"","",null,"","",null,"","",null,"","",null,"","",null,"",""]
["7504_2","coal",72,null,7504,"Neil Simpson II","WY","NS2Cfg","2","Conventional Boiler","Wall firing - front firing",88,1100,12.5,"subbituminous","subbituminous",7.844504488799791E-4,5.4911531421598537E-3,null,null,null,null,null,null,null,null,null,null,4.9999999999999996E-5,6.249999999999999E-4,null,null,4.9999999999999996E-5,6.249999999999999E-4,1.4749511877297958E-4,1.8436889846622448E-3,1.4766666666666669E-4,1.8458333333333337E-3,null,null,1.4749511877297958E-4,1.8436889846622448E-3,3.6952649458441705E-4,4.6190811823052132E-3,3.6966666666666674E-4,4.6208333333333344E-3,null,null,3.6952649458441705E-4,4.6190811823052132E-3,9.2100000000000015E-2,1.1512500000000001,null,null,null,null,null,null,9.2100000000000015E-2,1.1512500000000001,"SO2 control","Dry FGD - Circulating Dry Scrubber","1995-09-01","PM control","Electrostatic precipitator, cold side, w/o flue gas conditioning","1995-09-01","","",null,"","",null,"","",null,"","",null,"","",null,"","",null,"","",null,"","",null,"","",null,"",""]
["6264_1","coal",73,null,6264,"Mountaineer","WV","Mt-1","1","Conventional Boiler","Wall firing - opposed firing",1320,11960,9.0606060606060606,"bituminous","bituminous",6.9484590218218359E-2,5.4160464205181566E-3,null,null,null,null,null,null,null,null,null,null,2.3700000000000001E-4,2.1473636363636365E-3,null,null,2.3700000000000001E-4,2.1473636363636365E-3,2.1404790232427119E-4,1.9394037210593055E-3,null,null,null,null,2.1404790232427119E-4,1.9394037210593055E-3,2.0348171728169222E-4,1.8436676808250296E-3,null,null,null,null,2.0348171728169222E-4,1.8436676808250296E-3,3.1400000000000011E-2,0.28450303030303042,null,null,null,null,null,null,3.1400000000000011E-2,0.28450303030303042,"NOx control","Selective Catalytic Reduction","2002-01-01","Other control","Dry sorbent injection","2007-01-01","PM control","Electrostatic precipitator, cold side, w/o flue gas conditioning","1980-09-01","SO2 control","Wet FGD - Spray Type","2007-01-01","","",null,"","",null,"","",null,"","",null,"","",null,"","",null,"","",null,"",""]
["508_4","coal",74,null,508,"Lamar Plant","CO","001","4","Fluidized bed firing","Fluidized bed firing",44,509.8,11.586363636363636,"","subbituminous",null,null,null,null,null,null,null,null,null,null,null,null,null,null,null,null,null,null,null,null,null,null,1.6837700370974512E-4,1.9508771929824559E-3,1.6837700370974512E-4,1.9508771929824559E-3,null,null,null,null,5.9810176677472414E-5,6.9298245614035083E-4,5.9810176677472414E-5,6.9298245614035083E-4,null,null,null,null,null,null,null,null,null,null,"NOx control","Selective Noncatalytic Reduction",null,"PM control","Fabric Filter, unspecified","2009-05-01","","",null,"","",null,"","",null,"","",null,"","",null,"","",null,"","",null,"","",null,"","",null,"",""]
["477_5","coal",75,null,477,"Valmont","CO","Unit 5","5","Conventional Boiler","Tangential firing",196,1845,9.4132653061224492,"bituminous","bituminous",4.1122711949178993E-3,8.1140981190684983E-3,null,null,null,null,null,null,null,null,null,null,1.9766666666666662E-6,1.8606887755102036E-5,null,null,1.9766666666666662E-6,1.8606887755102036E-5,2.1110907253864804E-4,1.9872257083357429E-3,null,null,null,null,2.1110907253864804E-4,1.9872257083357429E-3,7.2460030086837827E-5,6.8208548729701939E-4,null,null,null,null,7.2460030086837827E-5,6.8208548729701939E-4,0.11411538461538463,1.0741983908948196,null,null,0.11116085312966667,1.0463866021644643,null,null,0.11116085312966667,1.0463866021644643,"SO2 control","Dry FGD - Spray Dryer","2002-04-01","PM control","Fabric Filter, reverse air","1984-04-01","","",null,"","",null,"","",null,"","",null,"","",null,"","",null,"","",null,"","",null,"","",null,"",""]
["6664_101","coal",76,null,6664,"Louisa","IA","101","101","Conventional Boiler","Wall firing - unspecified",805,8624,10.71304347826087,"subbituminous","subbituminous",6.7396798652064028E-4,3.016006739679865E-3,null,null,null,null,null,null,null,null,null,null,1.03E-5,1.1034434782608696E-4,null,null,1.03E-5,1.1034434782608696E-4,1.9103938330077767E-4,2.0466132193613746E-3,null,null,null,null,1.9103938330077767E-4,2.0466132193613746E-3,1.922301064312818E-4,2.0593694880290366E-3,null,null,null,null,1.922301064312818E-4,2.0593694880290366E-3,0.26829999999999998,2.8743095652173913,null,null,null,null,null,null,0.26829999999999998,2.8743095652173913,"SO2 control","Dry FGD - Circulating Dry Scrubber","2007-12-01","PM control","Fabric Filter, pulse","2007-12-01","","",null,"","",null,"","",null,"","",null,"","",null,"","",null,"","",null,"","",null,"","",null,"",""]
["6052_2","coal",77,null,6052,"Wansley","GA","Unit 2","2","Conventional Boiler","Tangential firing",920,8554.2800000000007,9.2981304347826086,"bituminous","bituminous",0.11286966101797606,6.320742532759098E-3,null,null,null,null,null,null,null,null,null,null,3.1466666666666671E-4,2.9258117101449281E-3,null,null,3.1466666666666671E-4,2.9258117101449281E-3,2.2051861560499681E-4,2.0504108511929481E-3,null,null,null,null,2.2051861560499681E-4,2.0504108511929481E-3,6.6758774555956889E-5,6.2073179348753362E-4,null,null,null,null,6.6758774555956889E-5,6.2073179348753362E-4,null,null,null,null,null,null,null,null,null,null,"NOx control","Selective Catalytic Reduction","2003-05-01","PM control","Electrostatic precipitator, cold side, w/ flue gas conditioning","1978-04-01","SO2 control","Wet FGD - Spray Type","2009-05-01","","",null,"","",null,"","",null,"","",null,"","",null,"","",null,"","",null,"","",null,"",""]
["2706_2","coal",78,null,2706,"Asheville Steam Electric Plant","NC","Ash_Cfg_2","2","Conventional Boiler","Wall firing - front firing",204,1902,9.3235294117647065,"bituminous","bituminous",null,null,null,null,null,null,null,null,null,null,null,null,null,null,null,null,null,null,null,null,null,null,2.2000000000000001E-4,2.0511764705882355E-3,2.2000000000000001E-4,2.0511764705882355E-3,null,null,null,null,1.3533333333333333E-4,1.2617843137254902E-3,1.3533333333333333E-4,1.2617843137254902E-3,null,null,4.6387589212262714E-2,0.4324960523613906,null,null,4.4413856309782805E-2,0.4140938955941515,4.4413856309782805E-2,0.4140938955941515,"NOx control","Selective Catalytic Reduction","2006-06-14","PM control","Electrostatic precipitator, cold side, w/o flue gas conditioning","1971-05-01","SO2 control","Wet FGD - Spray/Tray Type","2006-05-15","","",null,"","",null,"","",null,"","",null,"","",null,"","",null,"","",null,"","",null,"",""]
["525_1","coal",79,null,525,"Hayden","CO","Unit 1","1","Conventional Boiler","Wall firing - front firing",202,1963,9.717821782178218,"bituminous","bituminous",1.8327024869948369E-3,1.0892833742873193E-2,null,null,null,null,null,null,null,null,null,null,6.1299999999999998E-6,5.9570247524752472E-5,null,null,6.1299999999999998E-6,5.9570247524752472E-5,2.1783347947369278E-4,2.1168669317171234E-3,null,null,null,null,2.1783347947369278E-4,2.1168669317171234E-3,7.3150045445385684E-5,7.1085910499649554E-4,null,null,null,null,7.3150045445385684E-5,7.1085910499649554E-4,0.11896666666666669,1.1560968646864689,null,null,0.12021440316999998,1.1682221456569801,null,null,0.11896666666666669,1.1560968646864689,"SO2 control","Dry FGD - Spray Dryer","1998-12-01","PM control","Fabric Filter, reverse air","1998-12-01","","",null,"","",null,"","",null,"","",null,"","",null,"","",null,"","",null,"","",null,"","",null,"",""]
["6288_001","coal",80,null,6288,"Healy","AK","1","001","Conventional Boiler","Wall firing - front firing",25,347,13.88,"subbituminous","subbituminous",5.1256478290381676E-3,8.574838975716103E-3,null,null,null,null,null,null,null,null,null,null,4.466666666666667E-5,6.1997333333333338E-4,null,null,4.466666666666667E-5,6.1997333333333338E-4,1.5404755683334943E-4,2.1381800888468903E-3,null,null,null,null,1.5404755683334943E-4,2.1381800888468903E-3,2.6376841946594968E-3,3.6611056621873819E-2,null,null,null,null,2.6376841946594968E-3,3.6611056621873819E-2,null,null,0.34595441962872497,4.8018473444467027,null,null,null,null,0.34595441962872497,4.8018473444467027,"PM control","Fabric Filter, pulse","1980-01-01","","",null,"","",null,"","",null,"","",null,"","",null,"","",null,"","",null,"","",null,"","",null,"","",null,"",""]
["1356_1","coal",81,null,1356,"Ghent","KY","GH1","1","Conventional Boiler","Tangential firing",520,6286,12.088461538461539,"bituminous","bituminous",5.0520665123299169E-2,6.0389103241906411E-3,3.9702626734730139E-4,4.7994367625868017E-3,3.97E-4,4.7991192307692311E-3,null,null,3.97E-4,4.7991192307692311E-3,null,null,1.1000000000000001E-3,1.3297307692307693E-2,null,null,1.1000000000000001E-3,1.3297307692307693E-2,1.7960541830365118E-4,2.1711531912629836E-3,null,null,null,null,1.7960541830365118E-4,2.1711531912629836E-3,8.3899719035931847E-5,1.0142185266535915E-3,null,null,null,null,8.3899719035931847E-5,1.0142185266535915E-3,8.443333333333336E-2,1.020669102564103,null,null,null,null,null,null,8.443333333333336E-2,1.020669102564103,"NOx control","Selective Catalytic Reduction","2004-05-01","Other control","Other (specify): Sorbent injection for SO3 reduction","2008-06-01","PM control","Electrostatic precipitator, cold side, w/o flue gas conditioning","1973-12-01","Other control","Other (specify): Sorbent injection for SO3 reduction","2008-06-01","SO2 control","Wet FGD - Spray Type","1994-11-01","","",null,"","",null,"","",null,"","",null,"","",null,"","",null,"",""]
["469_4","coal",82,null,469,"Cherokee","CO","Unit 4","4","Conventional Boiler","Tangential firing",383,3520,9.1906005221932112,"bituminous","bituminous",1.2464660532231517E-3,8.1385777148502078E-3,null,null,null,null,null,null,null,null,null,null,4.0333333333333334E-6,3.706875543951262E-5,null,null,4.0333333333333334E-6,3.706875543951262E-5,2.3684056901197341E-4,2.1767070572379799E-3,null,null,null,null,2.3684056901197341E-4,2.1767070572379799E-3,1.2964218602943759E-4,1.1914895426204184E-3,null,null,null,null,1.2964218602943759E-4,1.1914895426204184E-3,0.12536666666666668,1.152194952132289,null,null,0.11387154009666667,1.0465478358753699,null,null,0.11387154009666667,1.0465478358753699,"SO2 control","Dry FGD - Spray Dryer","2002-10-01","PM control","Fabric Filter, reverse air","1989-04-01","","",null,"","",null,"","",null,"","",null,"","",null,"","",null,"","",null,"","",null,"","",null,"",""]
["703_3","coal",83,null,703,"Bowen","GA","Unit 3","3","Conventional Boiler","Tangential firing",933,8184.7479999999996,8.772505894962487,"bituminous","bituminous",8.6572741679824913E-2,5.0254664589839196E-3,null,null,null,null,null,null,null,null,null,null,1.1300000000000002E-5,9.9129316613076122E-5,null,null,1.1300000000000002E-5,9.9129316613076122E-5,2.4954833540198677E-4,2.1891642433920049E-3,null,null,null,null,2.4954833540198677E-4,2.1891642433920049E-3,4.4955339049647304E-5,3.9437097682306824E-4,null,null,null,null,4.4955339049647304E-5,3.9437097682306824E-4,7.1933333333333335E-2,0.63103559071096826,null,null,null,null,null,null,7.1933333333333335E-2,0.63103559071096826,"NOx control","Selective Catalytic Reduction","2003-05-01","PM control","Electrostatic precipitator, cold side, w/ flue gas conditioning","1974-12-01","SO2 control","Wet FGD - Spray Type","2008-05-01","","",null,"","",null,"","",null,"","",null,"","",null,"","",null,"","",null,"","",null,"",""]
["469_2","coal",84,null,469,"Cherokee","CO","Unit 2","2","Conventional Boiler","Vertical firing",114,1392,12.210526315789474,"bituminous","bituminous",1.0926695799908807E-3,7.5974860467591387E-3,null,null,null,null,null,null,null,null,null,null,3.6633333333333327E-5,4.4731228070175432E-4,null,null,3.6633333333333327E-5,4.4731228070175432E-4,1.8636690352363816E-4,2.2756379798675817E-3,null,null,null,null,1.8636690352363816E-4,2.2756379798675817E-3,7.1595957587440747E-4,8.7422432422559239E-3,null,null,null,null,7.1595957587440747E-4,8.7422432422559239E-3,0.52592592592592591,6.4218323586744637,null,null,0.44218137887333331,5.3992673630849124,null,null,0.44218137887333331,5.3992673630849124,"SO2 control","Dry FGD - Sorbent Injection","2002-12-01","PM control","Fabric Filter, reverse air","1985-05-01","","",null,"","",null,"","",null,"","",null,"","",null,"","",null,"","",null,"","",null,"","",null,"",""]
["6113_4","coal",85,null,6113,"Gibson","IN","4","4","Conventional Boiler","Wall firing - opposed firing",661,6265,9.4780635400907709,"bituminous","bituminous",2.8909348160610304E-2,6.769921337122565E-3,null,null,null,null,null,null,null,null,null,null,4.4366666666666663E-5,4.2051008572869386E-4,null,null,4.4366666666666663E-5,4.2051008572869386E-4,2.605774768912504E-4,2.469769883091806E-3,null,null,5.4699263348207121E-4,5.1844309361046533E-3,2.605774768912504E-4,2.469769883091806E-3,1.5811221721040368E-4,1.4985976411848395E-3,null,null,5.6145242224197967E-5,5.3214817327473557E-4,5.6145242224197967E-5,5.3214817327473557E-4,null,null,0.16690713839146307,1.5819564629690106,null,null,0.38100000000000001,3.6111422087745839,0.16690713839146307,1.5819564629690106,"NOx control","Selective Catalytic Reduction","2003-04-01","Other control","Other (specify): Soda Ash Injection for SO3 mitigation","2004-06-01","PM control","Electrostatic precipitator, cold side, w/o flue gas conditioning","1978-01-01","SO2 control","Wet FGD - Tray Type","1994-12-01","","",null,"","",null,"","",null,"","",null,"","",null,"","",null,"","",null,"",""]
["6639_G2","coal",86,null,6639,"R D Green","KY","2","G2","Conventional Boiler","Wall firing - opposed firing",239,2726.6,11.40836820083682,"bituminous,  Petroleum coke","bituminous,  Petroleum coke",4.1716429807151241E-2,4.924541139999585E-3,null,null,null,null,null,null,null,null,null,null,1.88E-5,2.1447732217573222E-4,null,null,1.88E-5,2.1447732217573222E-4,2.2267496503035716E-4,2.5403579901747777E-3,null,null,null,null,2.2267496503035716E-4,2.5403579901747777E-3,1.181308962185379E-4,1.3476807599559224E-3,null,null,null,null,1.181308962185379E-4,1.3476807599559224E-3,8.0266666666666667E-2,0.91571168758716881,null,null,null,null,null,null,8.0266666666666667E-2,0.91571168758716881,"PM control","Electrostatic precipitator, cold side, w/o flue gas conditioning","1981-01-01","SO2 control","Wet FGD - Spray Type","1981-01-01","","",null,"","",null,"","",null,"","",null,"","",null,"","",null,"","",null,"","",null,"","",null,"",""]
["130_1","coal",87,null,130,"Cross","SC","C1","1","Conventional Boiler","Wall firing - opposed firing",610,6502,10.659016393442624,"bituminous","bituminous",6.8972947601979862E-2,9.9661204983785626E-3,null,null,null,null,null,null,null,null,null,null,2.0666666666666666E-5,2.2028633879781422E-4,null,null,2.0666666666666666E-5,2.2028633879781422E-4,2.4374610486427211E-4,2.5980937275860614E-3,null,null,null,null,2.4374610486427211E-4,2.5980937275860614E-3,1.2185810735632822E-4,1.2988875639849938E-3,null,null,null,null,1.2185810735632822E-4,1.2988875639849938E-3,null,null,null,null,null,null,null,null,null,null,"NOx control","Selective Catalytic Reduction","2003-06-01","PM control","Electrostatic precipitator, cold side, w/o flue gas conditioning","1995-05-01","SO2 control","Wet FGD - Spray Type","1995-05-01","","",null,"","",null,"","",null,"","",null,"","",null,"","",null,"","",null,"","",null,"",""]
["2727_Unit 1","coal",88,null,2727,"Marshall","NC","U12007","Unit 1","Conventional Boiler","Tangential firing",400,3658.2,9.1455000000000002,"bituminous","bituminous",7.3401059000899493E-2,7.0391366859901194E-3,null,null,1.7666666666666669E-4,1.6157050000000003E-3,null,null,1.7666666666666669E-4,1.6157050000000003E-3,null,null,5.3933333333333334E-5,4.9324730000000004E-4,null,null,5.3933333333333334E-5,4.9324730000000004E-4,2.8590391691690693E-4,2.6147342721635726E-3,null,null,null,null,2.8590391691690693E-4,2.6147342721635726E-3,1.7508124189080448E-4,1.6012054977123523E-3,null,null,null,null,1.7508124189080448E-4,1.6012054977123523E-3,null,null,8.2923525221707775E-2,0.75837709991512847,null,null,null,null,8.2923525221707775E-2,0.75837709991512847,"NOx control","Selective Noncatalytic Reduction","2006-04-01","PM control","Electrostatic precipitator, cold side, w/ flue gas conditioning","1998-12-01","SO2 control","Wet FGD - Spray Type","2007-05-01","","",null,"","",null,"","",null,"","",null,"","",null,"","",null,"","",null,"","",null,"",""]
["2727_Unit 2","coal",89,null,2727,"Marshall","NC","U22007","Unit 2","Conventional Boiler","Tangential firing",400,3663.2,9.1579999999999995,"bituminous","bituminous",7.3401059000899493E-2,7.0391366859901194E-3,null,null,1.7666666666666669E-4,1.6179133333333335E-3,null,null,1.7666666666666669E-4,1.6179133333333335E-3,null,null,5.3933333333333334E-5,4.939214666666666E-4,null,null,5.3933333333333334E-5,4.939214666666666E-4,2.8590391691690693E-4,2.6183080711250336E-3,null,null,null,null,2.8590391691690693E-4,2.6183080711250336E-3,1.7508124189080448E-4,1.6033940132359873E-3,null,null,null,null,1.7508124189080448E-4,1.6033940132359873E-3,null,null,8.2923525221707775E-2,0.75941364398039979,null,null,null,null,8.2923525221707775E-2,0.75941364398039979,"NOx control","Selective Noncatalytic Reduction","2007-05-01","PM control","Electrostatic precipitator, cold side, w/ flue gas conditioning","2002-01-01","SO2 control","Wet FGD - Spray Type","2007-05-01","","",null,"","",null,"","",null,"","",null,"","",null,"","",null,"","",null,"","",null,"",""]
["628_5","coal",90,null,628,"Crystal River Power Plant","FL","CryR_Cfg_5c","5","Conventional Boiler","Wall firing - opposed firing",767,7423,9.6779661016949152,"bituminous","bituminous",7.1421631367284757E-2,4.3419853977459009E-3,null,null,null,null,null,null,null,null,null,null,3.7599999999999999E-5,3.6389152542372881E-4,null,null,3.7599999999999999E-5,3.6389152542372881E-4,2.7384385685413096E-4,2.6502515637916741E-3,null,null,null,null,2.7384385685413096E-4,2.6502515637916741E-3,2.5605790885041042E-4,2.4781197619251584E-3,null,null,null,null,2.5605790885041042E-4,2.4781197619251584E-3,null,null,6.5224192332729192E-2,0.63123752240658249,null,null,null,null,6.5224192332729192E-2,0.63123752240658249,"NOx control","Selective Catalytic Reduction","2009-05-15","PM control","Electrostatic precipitator, cold side, w/o flue gas conditioning","1984-01-01","SO2 control","Wet FGD - Spray/Tray Type","2009-11-30","","",null,"","",null,"","",null,"","",null,"","",null,"","",null,"","",null,"","",null,"",""]
["469_1","coal",91,null,469,"Cherokee","CO","Unit 1","1","Conventional Boiler","Vertical firing",117,1392,11.897435897435898,"bituminous","bituminous",8.2908941246332248E-4,7.0234535387298444E-3,null,null,null,null,null,null,null,null,null,null,3.1033333333333333E-5,3.6921709401709405E-4,null,null,3.1033333333333333E-5,3.6921709401709405E-4,2.253718661946499E-4,2.6813473311363477E-3,null,null,null,null,2.253718661946499E-4,2.6813473311363477E-3,6.3931980459414333E-4,7.6062663931200647E-3,null,null,null,null,6.3931980459414333E-4,7.6062663931200647E-3,0.51596153846153847,6.1386193293885603,null,null,0.48371148998999997,5.7549264450092306,null,null,0.48371148998999997,5.7549264450092306,"SO2 control","Dry FGD - Sorbent Injection","1998-02-01","PM control","Fabric Filter, reverse air","1989-09-01","","",null,"","",null,"","",null,"","",null,"","",null,"","",null,"","",null,"","",null,"","",null,"",""]
["2103_2","coal",92,null,2103,"Labadie","MO","002","2","Conventional Boiler","Tangential firing",623,6183,9.924558587479936,"","Bituminous, Subbituminous",null,null,null,null,null,null,null,null,null,null,null,null,null,null,null,null,null,null,null,null,null,null,2.7302749996087084E-4,2.7096774193548388E-3,2.7302749996087084E-4,2.7096774193548388E-3,null,null,null,null,7.5407595227288142E-4,7.4838709677419353E-3,7.5407595227288142E-4,7.4838709677419353E-3,null,null,null,null,null,null,null,null,null,null,"Other control","Other (specify): FGC SO3 Injection","1992-11-01","PM control","Electrostatic precipitator, cold side, w/ flue gas conditioning","1982-12-01","","",null,"","",null,"","",null,"","",null,"","",null,"","",null,"","",null,"","",null,"","",null,"",""]
["1382_H1","coal",93,null,1382,"HMP&L Station Two Henderson","KY","1","H1","Conventional Boiler","Wall firing - rear firing",166.1,1799,10.830824804334739,"bituminous","bituminous",0.10266024498950375,7.343237256804875E-3,null,null,null,null,null,null,null,null,null,null,2.2033333333333335E-5,2.3863917318884211E-4,null,null,2.2033333333333335E-5,2.3863917318884211E-4,2.519679532483311E-4,2.7290207579394802E-3,null,null,null,null,2.519679532483311E-4,2.7290207579394802E-3,2.6770179602740216E-4,2.8994312525785462E-3,null,null,null,null,2.6770179602740216E-4,2.8994312525785462E-3,0.17536666666666664,1.8993656431868351,null,null,null,null,null,null,0.17536666666666664,1.8993656431868351,"NOx control","Selective Catalytic Reduction","2003-10-01","PM control","Electrostatic precipitator, cold side, w/o flue gas conditioning","1973-06-01","SO2 control","Wet FGD - Tray Type","1995-06-01","","",null,"","",null,"","",null,"","",null,"","",null,"","",null,"","",null,"","",null,"",""]
["2706_1","coal",94,null,2706,"Asheville Steam Electric Plant","NC","Ash_Cfg_1d","1","Conventional Boiler","Wall firing - front firing",207,1914,9.2463768115942031,"bituminous","bituminous",5.8233856305033894E-2,null,null,null,null,null,1.2366666666666666E-5,1.1434685990338165E-4,1.2366666666666666E-5,1.1434685990338165E-4,null,null,3.2100000000000005E-4,2.9680869565217398E-3,null,null,3.2100000000000005E-4,2.9680869565217398E-3,6.1356067479820921E-3,5.6732131959602534E-2,null,null,2.9533333333333337E-4,2.7307632850241551E-3,2.9533333333333337E-4,2.7307632850241551E-3,6.2577486091186028E-5,5.7861501632140125E-4,null,null,5.0100000000000005E-5,4.6324347826086961E-4,5.0100000000000005E-5,4.6324347826086961E-4,null,null,5.1660855288056161E-2,0.47767573440260624,null,null,3.7999999999999999E-2,0.35136231884057972,3.7999999999999999E-2,0.35136231884057972,"NOx control","Selective Catalytic Reduction","2007-06-14","PM control","Electrostatic precipitator, cold side, w/o flue gas conditioning","2005-11-17","SO2 control","Wet FGD - Spray/Tray Type","2005-11-17","","",null,"","",null,"","",null,"","",null,"","",null,"","",null,"","",null,"","",null,"",""]
["3149_1","coal",95,null,3149,"PPL Montour","PA","U1","1","Conventional Boiler","Tangential firing",797,7239,9.0828105395232122,"bituminous","bituminous",7.0131861303494622E-2,null,null,null,null,null,null,null,null,null,null,null,7.9166666666666662E-5,7.190558343789209E-4,null,null,7.9166666666666662E-5,7.190558343789209E-4,3.0150224469107306E-4,2.7384877657699847E-3,null,null,null,null,3.0150224469107306E-4,2.7384877657699847E-3,3.0150224469107306E-4,2.7384877657699847E-3,null,null,null,null,3.0150224469107306E-4,2.7384877657699847E-3,null,null,0.45804453827123409,4.1603317597810081,null,null,null,null,0.45804453827123409,4.1603317597810081,"PM control","Electrostatic precipitator, cold side, w/o flue gas conditioning","2001-05-01","NOx control","Selective Catalytic Reduction","2001-05-01","SO2 control","Wet FGD - Tray Type","2008-05-01","","",null,"","",null,"","",null,"","",null,"","",null,"","",null,"","",null,"","",null,"",""]
["3118_1","coal",96,null,3118,"Conemaugh","PA","CON-1","1","Conventional Boiler","Tangential firing",936,8985,9.5993589743589745,"bituminous","bituminous",5.5237569039254308E-2,4.6158433577055237E-3,null,null,null,null,null,null,null,null,null,null,3.3533333333333336E-6,3.2189850427350427E-5,null,null,3.3533333333333336E-6,3.2189850427350427E-5,2.8801368141275391E-4,2.764746717407686E-3,null,null,3.3E-4,3.1677884615384615E-3,2.8801368141275391E-4,2.764746717407686E-3,9.45100825579908E-5,9.0723620917045652E-4,null,null,1.7000000000000001E-4,1.6318910256410259E-3,9.45100825579908E-5,9.0723620917045652E-4,null,null,0.13917258373969707,1.335967590706387,null,null,null,null,0.13917258373969707,1.335967590706387,"PM control","Electrostatic precipitator, cold side, w/ flue gas conditioning","1970-05-01","SO2 control","Wet FGD - Spray Type","1995-01-01","","",null,"","",null,"","",null,"","",null,"","",null,"","",null,"","",null,"","",null,"","",null,"",""]
["6096_NC2","coal",97,null,6096,"Nebraska City","NE","NC2","NC2","Conventional Boiler","Wall firing - front firing",682,6920.2539999999999,10.147,"bituminous","bituminous",null,3.6238143467922832E-3,null,null,null,null,null,null,null,null,null,null,8.0749999999999995E-4,8.1937025000000004E-3,null,null,8.0749999999999995E-4,8.1937025000000004E-3,2.7639906975612452E-4,2.8046213608153956E-3,null,null,null,null,2.7639906975612452E-4,2.8046213608153956E-3,1.5207148870173038E-4,1.5430693958564583E-3,null,null,null,null,1.5207148870173038E-4,1.5430693958564583E-3,9.2366666666666666E-2,0.93724456666666667,null,null,null,null,null,null,9.2366666666666666E-2,0.93724456666666667,"NOx control","Selective Catalytic Reduction","2009-05-01","Other control","Activated carbon injection","2009-05-01","SO2 control","Dry FGD - Spray Dryer","2009-05-01","PM control","Fabric Filter, pulse","2009-05-01","","",null,"","",null,"","",null,"","",null,"","",null,"","",null,"","",null,"",""]
["2727_Unit 3","coal",98,null,2727,"Marshall","NC","U3","Unit 3","Conventional Boiler","Tangential firing",700,6103.1,8.7187142857142863,"bituminous","bituminous",9.539892359412111E-2,6.5797890321515418E-3,null,null,1.6666666666666666E-4,1.4531190476190477E-3,null,null,1.6666666666666666E-4,1.4531190476190477E-3,null,null,2.3866666666666663E-5,2.0808664761904759E-4,null,null,2.3866666666666663E-5,2.0808664761904759E-4,3.2635035851711166E-4,2.8453555329511202E-3,null,null,null,null,3.2635035851711166E-4,2.8453555329511202E-3,1.7206135526247912E-4,1.5001537961463376E-3,null,null,null,null,1.7206135526247912E-4,1.5001537961463376E-3,null,null,0.13037421534856655,1.136695533848338,null,null,null,null,0.13037421534856655,1.136695533848338,"NOx control","Selective Catalytic Reduction","2008-12-01","PM control","Electrostatic precipitator, cold side, w/ flue gas conditioning","2006-12-01","SO2 control","Wet FGD - Spray Type","2007-03-01","","",null,"","",null,"","",null,"","",null,"","",null,"","",null,"","",null,"","",null,"",""]
["6052_1","coal",99,null,6052,"Wansley","GA","Unit 1","1","Conventional Boiler","Tangential firing",920,8445.7889999999989,9.1802054347826072,"bituminous","bituminous",0.10541088882965592,6.1970904247550763E-3,null,null,null,null,null,null,null,null,null,null,3.2766666666666664E-4,3.0080473141304341E-3,null,null,3.2766666666666664E-4,3.0080473141304341E-3,3.1073736993613934E-4,2.8526328922777997E-3,null,null,null,null,3.1073736993613934E-4,2.8526328922777997E-3,9.1809948880925359E-5,8.4283419168378428E-4,null,null,null,null,9.1809948880925359E-5,8.4283419168378428E-4,null,null,null,null,null,null,null,null,null,null,"NOx control","Selective Catalytic Reduction","2003-05-01","PM control","Electrostatic precipitator, cold side, w/ flue gas conditioning","1976-12-01","SO2 control","Wet FGD - Spray Type","2008-12-01","","",null,"","",null,"","",null,"","",null,"","",null,"","",null,"","",null,"","",null,"",""]
["8223_3","coal",100,null,8223,"Springerville","AZ","3","3","Conventional Boiler","Wall firing - opposed firing",450,4200,9.3333333333333339,"subbituminous","subbituminous",9.9461694592736859E-4,5.2201859151772556E-3,null,null,null,null,null,null,null,null,null,null,1.1276666666666666E-3,1.0524888888888889E-2,null,null,1.1276666666666666E-3,1.0524888888888889E-2,null,null,3.0597600000000001E-4,2.8557760000000004E-3,null,null,3.0597600000000001E-4,2.8557760000000004E-3,null,null,2.0733333333333332E-4,1.9351111111111112E-3,6.3999999999999997E-5,5.973333333333334E-4,6.3999999999999997E-5,5.973333333333334E-4,7.4366666666666664E-2,0.69408888888888887,null,null,null,null,9.9000000000000005E-2,0.92400000000000015,7.4366666666666664E-2,0.69408888888888887,"NOx control","Selective Catalytic Reduction","2006-08-01","SO2 control","Dry FGD - Spray Dryer","2006-08-01","PM control","Fabric Filter, pulse","2006-08-01","","",null,"","",null,"","",null,"","",null,"","",null,"","",null,"","",null,"","",null,"",""]
["3935_3","coal",101,null,3935,"John E. Amos","WV","AM-3","3","Conventional Boiler","Wall firing - opposed firing",1300,11936,9.1815384615384623,"bituminous","bituminous",6.4564626994121618E-2,5.8854563443182838E-3,null,null,null,null,null,null,null,null,null,null,2.3399999999999997E-4,2.1484799999999999E-3,null,null,2.3399999999999997E-4,2.1484799999999999E-3,3.1261917495535905E-4,2.8703249786670507E-3,null,null,null,null,3.1261917495535905E-4,2.8703249786670507E-3,7.7926120420282482E-5,7.154816717973014E-4,null,null,null,null,7.7926120420282482E-5,7.154816717973014E-4,5.2142857142857157E-2,0.47875164835164852,null,null,null,null,null,null,5.2142857142857157E-2,0.47875164835164852,"NOx control","Selective Catalytic Reduction","2001-05-01","PM control","Electrostatic precipitator, cold side, w/o flue gas conditioning","1973-10-01","SO2 control","Wet FGD - Spray Type","2009-02-01","","",null,"","",null,"","",null,"","",null,"","",null,"","",null,"","",null,"","",null,"",""]
["3954_3","coal",102,null,3954,"Mt. Storm","WV","Unit 3","3","Conventional Boiler","Tangential firing",559.79999999999995,5923,10.5805644873169,"bituminous","bituminous",4.4477671451355665E-2,4.664748993696362E-3,null,null,null,null,null,null,null,null,null,null,4.8133333333333334E-4,5.0927783732285349E-3,null,null,4.8133333333333334E-4,5.0927783732285349E-3,2.8487699962828763E-4,3.0141594655204501E-3,null,null,null,null,2.8487699962828763E-4,3.0141594655204501E-3,8.7828169304159152E-4,9.2927160912564255E-3,null,null,null,null,8.7828169304159152E-4,9.2927160912564255E-3,9.8266666666666683E-2,1.039716803620341,null,null,null,null,null,null,9.8266666666666683E-2,1.039716803620341,"NOx control","Selective Catalytic Reduction","2004-05-01","PM control","Electrostatic precipitator, cold side, w/o flue gas conditioning","1973-12-01","SO2 control","Wet FGD - Spray Type","1995-01-01","","",null,"","",null,"","",null,"","",null,"","",null,"","",null,"","",null,"","",null,"",""]
["3118_2","coal",103,null,3118,"Conemaugh","PA","CON-2","2","Conventional Boiler","Tangential firing",936,8985,9.5993589743589745,"bituminous","bituminous",4.991102272267E-2,4.8541547736854927E-3,null,null,null,null,null,null,null,null,null,null,3.0933333333333331E-6,2.9694017094017093E-5,null,null,3.0933333333333331E-6,2.9694017094017093E-5,3.3266086643067225E-4,3.1933310735893059E-3,null,null,4.6666666666666666E-4,4.4797008547008549E-3,3.3266086643067225E-4,3.1933310735893059E-3,8.9130275034669622E-5,8.5559350554113953E-4,null,null,4.6666666666666666E-4,4.4797008547008549E-3,8.9130275034669622E-5,8.5559350554113953E-4,null,null,0.13457753874080378,1.2918581042586772,null,null,null,null,0.13457753874080378,1.2918581042586772,"PM control","Electrostatic precipitator, cold side, w/ flue gas conditioning","1971-05-01","SO2 control","Wet FGD - Spray Type","1995-11-01","","",null,"","",null,"","",null,"","",null,"","",null,"","",null,"","",null,"","",null,"","",null,"",""]
["2535_1","coal",104,null,2535,"AES Cayuga, LLC","NY","Unit_1","1","Conventional Boiler","Tangential firing",164,1462,8.9146341463414629,"bituminous","bituminous",4.5990415475533696E-2,3.4653928151420418E-3,null,null,null,null,null,null,null,null,null,null,null,null,null,null,null,null,3.5900740531135728E-4,3.2004196741780753E-3,null,null,null,null,3.5900740531135728E-4,3.2004196741780753E-3,1.0626512360062801E-4,9.4731469941535451E-4,null,null,null,null,1.0626512360062801E-4,9.4731469941535451E-4,0.45856666666666673,4.087954065040651,null,null,null,null,null,null,0.45856666666666673,4.087954065040651,"NOx control","Selective Catalytic Reduction",null,"PM control","Electrostatic precipitator, cold side, w/o flue gas conditioning",null,"SO2 control","Wet FGD - Spray Type","1995-06-01","","",null,"","",null,"","",null,"","",null,"","",null,"","",null,"","",null,"","",null,"",""]
["3149_2","coal",105,null,3149,"PPL Montour","PA","U2","2","Conventional Boiler","Tangential firing",792,7239,9.1401515151515156,"bituminous","bituminous",8.1400339596262139E-2,null,null,null,null,null,null,null,null,null,null,null,7.64E-5,6.9830757575757585E-4,null,null,7.64E-5,6.9830757575757585E-4,3.5654215755528501E-4,3.2588493415943286E-3,null,null,null,null,3.5654215755528501E-4,3.2588493415943286E-3,3.5654215755528501E-4,3.2588493415943286E-3,null,null,null,null,3.5654215755528501E-4,3.2588493415943286E-3,null,null,0.27721706375550142,2.5338059653107008,null,null,null,null,0.27721706375550142,2.5338059653107008,"PM control","Electrostatic precipitator, cold side, w/o flue gas conditioning","2000-05-01","NOx control","Selective Catalytic Reduction","2000-05-01","SO2 control","Wet FGD - Tray Type","2008-03-01","","",null,"","",null,"","",null,"","",null,"","",null,"","",null,"","",null,"","",null,"",""]
["1382_H2","coal",106,null,1382,"HMP&L Station Two Henderson","KY","2","H2","Conventional Boiler","Wall firing - rear firing",173.1,1866.2,10.781051415366841,"bituminous","bituminous",0.14040625740396465,6.9788499811649215E-3,null,null,null,null,null,null,null,null,null,null,2.0300000000000002E-5,2.1885534373194691E-4,null,null,2.0300000000000002E-5,2.1885534373194691E-4,3.0516085000127532E-4,3.2899548138207975E-3,null,null,null,null,3.0516085000127532E-4,3.2899548138207975E-3,1.9495090688283025E-4,2.1017757505761864E-3,null,null,null,null,1.9495090688283025E-4,2.1017757505761864E-3,0.21489999999999998,2.3168479491623337,null,null,null,null,null,null,0.21489999999999998,2.3168479491623337,"NOx control","Selective Catalytic Reduction","2004-04-01","PM control","Electrostatic precipitator, cold side, w/o flue gas conditioning","1974-04-01","SO2 control","Wet FGD - Tray Type","1995-06-01","","",null,"","",null,"","",null,"","",null,"","",null,"","",null,"","",null,"","",null,"",""]
["2080_2","coal",107,null,2080,"Montrose","MO","2","2","Conventional Boiler","Tangential firing",188,2130,11.329787234042554,"coal - subbituminous","subbituminous",null,null,null,null,null,null,null,null,null,null,null,null,null,null,null,null,null,null,null,null,null,null,2.9999999999999997E-4,3.3989361702127657E-3,2.9999999999999997E-4,3.3989361702127657E-3,null,null,null,null,2.0000000000000001E-4,2.2659574468085111E-3,2.0000000000000001E-4,2.2659574468085111E-3,null,null,null,null,null,null,null,null,null,null,"Other control","Other (specify): SO3 injection for Opacity control.","1993-05-01","PM control","Electrostatic precipitator, cold side, w/o flue gas conditioning","1960-03-01","","",null,"","",null,"","",null,"","",null,"","",null,"","",null,"","",null,"","",null,"","",null,"",""]
["2080_1","coal",108,null,2080,"Montrose","MO","1","1","Conventional Boiler","Tangential firing",188,2140,11.382978723404255,"coal - subbituminous","subbituminous",null,null,null,null,null,null,null,null,null,null,null,null,null,null,null,null,null,null,null,null,null,null,2.9999999999999997E-4,3.4148936170212761E-3,2.9999999999999997E-4,3.4148936170212761E-3,null,null,null,null,4.0000000000000002E-4,4.553191489361702E-3,4.0000000000000002E-4,4.553191489361702E-3,null,null,null,null,null,null,null,null,null,null,"Other control","Other (specify): SO3 injection for Opacity control.","1993-05-01","PM control","Electrostatic precipitator, cold side, w/o flue gas conditioning","1958-06-01","","",null,"","",null,"","",null,"","",null,"","",null,"","",null,"","",null,"","",null,"","",null,"",""]
["465_3","coal",109,null,465,"Arapahoe","CO","Unit 3","3","Conventional Boiler","Vertical firing",48,754.8,15.725,"subbituminous","subbituminous",1.1860930820290214E-3,5.8213906652055739E-3,null,null,null,null,null,null,null,null,null,null,3.5733333333333336E-6,5.6190666666666671E-5,null,null,3.5733333333333336E-6,5.6190666666666671E-5,2.1753161421979439E-4,3.4206846336062666E-3,null,null,null,null,2.1753161421979439E-4,3.4206846336062666E-3,5.4867800513069994E-4,8.6279616306802562E-3,null,null,null,null,5.4867800513069994E-4,8.6279616306802562E-3,0.50068181818181823,7.8732215909090915,null,null,0.41341018914,6.5008752242265002,null,null,0.41341018914,6.5008752242265002,"SO2 control","Dry FGD - Sorbent Injection","2002-12-01","PM control","Fabric Filter, reverse air","1979-06-01","","",null,"","",null,"","",null,"","",null,"","",null,"","",null,"","",null,"","",null,"","",null,"",""]
["3399_1","coal",110,null,3399,"Cumberland","TN","1","1","Conventional Boiler","Wall firing - opposed firing",1300,14130,10.86923076923077,"bituminous","bituminous",0.14679169550493079,6.2029435535869365E-3,null,null,null,null,null,null,null,null,null,null,7.3666666666666677E-5,8.0070000000000011E-4,null,null,7.3666666666666677E-5,8.0070000000000011E-4,3.1666490950349062E-4,3.4419039779110174E-3,null,null,null,null,3.1666490950349062E-4,3.4419039779110174E-3,1.4362288528136868E-4,1.5610702838659534E-3,null,null,null,null,1.4362288528136868E-4,1.5610702838659534E-3,null,null,0.13267855656852576,1.4421138494717454,null,null,null,null,0.13267855656852576,1.4421138494717454,"NOx control","Selective Catalytic Reduction","2003-05-01","Other control","Other (specify): Hydrated Lime for Opacity","2006-11-01","PM control","Electrostatic precipitator, cold side, w/o flue gas conditioning","1982-06-01","SO2 control","Wet FGD - Spray Type","1995-01-01","","",null,"","",null,"","",null,"","",null,"","",null,"","",null,"","",null,"",""]
["469_3","coal",111,null,469,"Cherokee","CO","Unit 3","3","Conventional Boiler","Wall firing - front firing",165,1877,11.375757575757575,"bituminous","bituminous",8.9616261528847625E-4,8.462334167315122E-3,null,null,null,null,null,null,null,null,null,null,1.9066666666666665E-5,2.1689777777777775E-4,null,null,1.9066666666666665E-5,2.1689777777777775E-4,3.0540492014800299E-4,3.4742123340472824E-3,null,null,null,null,3.0540492014800299E-4,3.4742123340472824E-3,1.4826815006240297E-4,1.6866625313159416E-3,null,null,null,null,1.4826815006240297E-4,1.6866625313159416E-3,0.12910000000000002,1.4686103030303033,null,null,0.11096959117000001,1.2623631674308484,null,null,0.11096959117000001,1.2623631674308484,"SO2 control","Dry FGD - Spray Dryer","2002-06-01","PM control","Fabric Filter, reverse air","1988-02-01","","",null,"","",null,"","",null,"","",null,"","",null,"","",null,"","",null,"","",null,"","",null,"",""]
["55076_AA-002","coal",112,null,55076,"Red Hills Generating Facility","MS","002","AA-002","Fluidized bed firing","Fluidized bed firing",250,2382.3000000000002,9.5292000000000012,"lignite","lignite",3.3822904853103707E-2,5.043653384709689E-3,null,null,null,null,null,null,null,null,null,null,1.3142919335666666E-5,1.2524150693343482E-4,null,null,1.3142919335666666E-5,1.2524150693343482E-4,null,null,3.6675435864666662E-4,3.494875634415816E-3,3.8666666666666672E-4,3.6846240000000009E-3,3.6675435864666662E-4,3.494875634415816E-3,null,null,8.7974706620000006E-6,8.3832857432330411E-5,1.4999999999999999E-4,1.4293800000000001E-3,8.7974706620000006E-6,8.3832857432330411E-5,null,null,0.12496423704539082,1.1908092076529384,null,null,null,null,0.12496423704539082,1.1908092076529384,"PM control","Fabric Filter, unspecified","2002-05-01","","",null,"","",null,"","",null,"","",null,"","",null,"","",null,"","",null,"","",null,"","",null,"","",null,"",""]
["55076_AA-001","coal",113,null,55076,"Red Hills Generating Facility","MS","001","AA-001","Fluidized bed firing","Fluidized bed firing",250,2401,9.6039999999999992,"lignite","lignite",3.3822904853103707E-2,5.043653384709689E-3,null,null,null,null,null,null,null,null,null,null,1.3142919335666666E-5,1.2622459729974266E-4,null,null,1.3142919335666666E-5,1.2622459729974266E-4,null,null,3.6675435864666662E-4,3.5223088604425861E-3,3.8666666666666672E-4,3.713546666666667E-3,3.6675435864666662E-4,3.5223088604425861E-3,null,null,8.7974706620000006E-6,8.4490908237847993E-5,1.4999999999999999E-4,1.4405999999999998E-3,8.7974706620000006E-6,8.4490908237847993E-5,null,null,0.12496423704539082,1.2001565325839334,null,null,null,null,0.12496423704539082,1.2001565325839334,"PM control","Fabric Filter, unspecified","2002-05-01","","",null,"","",null,"","",null,"","",null,"","",null,"","",null,"","",null,"","",null,"","",null,"","",null,"",""]
["2080_3","coal",114,null,2080,"Montrose","MO","3","3","Conventional Boiler","Tangential firing",188,2250,11.968085106382979,"coal - subbituminous","subbituminous",null,null,null,null,null,null,null,null,null,null,null,null,null,null,null,null,null,null,null,null,null,null,2.9999999999999997E-4,3.5904255319148936E-3,2.9999999999999997E-4,3.5904255319148936E-3,null,null,null,null,2.0000000000000001E-4,2.3936170212765962E-3,2.0000000000000001E-4,2.3936170212765962E-3,null,null,null,null,null,null,null,null,null,null,"Other control","Other (specify): SO3 injection for opacity control.","1993-05-01","PM control","Electrostatic precipitator, cold side, w/o flue gas conditioning","1964-03-01","","",null,"","",null,"","",null,"","",null,"","",null,"","",null,"","",null,"","",null,"","",null,"",""]
["3399_2","coal",115,null,3399,"Cumberland","TN","2","2","Conventional Boiler","Wall firing - opposed firing",1300,14130,10.86923076923077,"bituminous","bituminous",0.15389517773628802,7.6210478333875358E-3,null,null,null,null,null,null,null,null,null,null,6.8666666666666678E-5,7.4635384615384626E-4,null,null,6.8666666666666678E-5,7.4635384615384626E-4,3.347070960925836E-4,3.6380086675293897E-3,null,null,null,null,3.347070960925836E-4,3.6380086675293897E-3,1.3822999560547607E-4,1.5024537214656745E-3,null,null,null,null,1.3822999560547607E-4,1.5024537214656745E-3,null,null,0.20865998783620629,2.2679735600966113,null,null,null,null,0.20865998783620629,2.2679735600966113,"NOx control","Selective Catalytic Reduction","2004-05-01","Other control","Other (specify): Hydrated Lime for opacity","2006-11-01","PM control","Electrostatic precipitator, cold side, w/o flue gas conditioning","1982-06-01","SO2 control","Wet FGD - Spray Type","1995-01-01","","",null,"","",null,"","",null,"","",null,"","",null,"","",null,"","",null,"",""]
["3122_3","coal",116,null,3122,"Homer City Station","PA","HC3CONFIG","3","Conventional Boiler","Wall firing - opposed firing",680,6175,9.0808823529411757,"bituminous","bituminous",0.11844588028643328,5.7936052541133279E-3,null,null,null,null,null,null,null,null,null,null,5.6633333333333339E-5,5.1428063725490194E-4,null,null,5.6633333333333339E-5,5.1428063725490194E-4,4.0608274589813931E-4,3.6875896410603088E-3,null,null,null,null,4.0608274589813931E-4,3.6875896410603088E-3,3.3332522786395528E-4,3.0268871794998879E-3,null,null,null,null,3.3332522786395528E-4,3.0268871794998879E-3,0.22583333333333339,2.0507659313725495,null,null,null,null,null,null,0.22583333333333339,2.0507659313725495,"NOx control","Selective Catalytic Reduction","2001-06-01","PM control","Electrostatic precipitator, cold side, w/ flue gas conditioning","1977-12-01","SO2 control","Wet FGD - Spray Type","2001-09-01","","",null,"","",null,"","",null,"","",null,"","",null,"","",null,"","",null,"","",null,"",""]
["3140_2","coal",117,null,3140,"PPL Brunner Island","PA","U2","2","Conventional Boiler","Tangential firing",393,3790,9.6437659033078873,"bituminous","bituminous",7.7107639177860191E-2,null,null,null,null,null,null,null,null,null,null,null,6.9166666666666663E-5,6.6702714164546212E-4,null,null,6.9166666666666663E-5,6.6702714164546212E-4,3.9813778149642103E-4,3.8395475620138309E-3,null,null,null,null,3.9813778149642103E-4,3.8395475620138309E-3,4.0753524757924475E-4,3.9301745250008586E-3,null,null,null,null,4.0753524757924475E-4,3.9301745250008586E-3,null,null,0.40277115279491854,3.8842307101596467,null,null,null,null,0.40277115279491854,3.8842307101596467,"PM control","Electrostatic precipitator, cold side, w/o flue gas conditioning","2009-10-01","SO2 control","Wet FGD - Tray Type","2009-11-01","","",null,"","",null,"","",null,"","",null,"","",null,"","",null,"","",null,"","",null,"","",null,"",""]
["1295_1","coal",118,null,1295,"Quindaro","KS","Unit 1","1","Conventional Boiler","Cyclone firing",77,782,10.155844155844155,"coal - subbituminous","subbituminous",null,null,null,null,null,null,8.0000000000000007E-5,8.1246753246753251E-4,8.0000000000000007E-5,8.1246753246753251E-4,null,null,null,null,null,null,null,null,null,null,null,null,3.7999999999999997E-4,3.8592207792207786E-3,3.7999999999999997E-4,3.8592207792207786E-3,null,null,null,null,5.6666666666666671E-4,5.7549783549783549E-3,5.6666666666666671E-4,5.7549783549783549E-3,null,null,null,null,null,null,null,null,null,null,"PM control","Electrostatic precipitator, cold side, w/o flue gas conditioning","1991-11-01","","",null,"","",null,"","",null,"","",null,"","",null,"","",null,"","",null,"","",null,"","",null,"","",null,"",""]
["2378_2","coal",119,null,2378,"BL England","NJ","2 Coal w or w/o TDF","2","Conventional Boiler","Cyclone firing",167.3,1600,9.5636580992229518,"bituminous","bituminous",6.7182495896360425E-2,null,3.5703414619097621E-4,3.4145525039184811E-3,null,null,null,null,3.5703414619097621E-4,3.4145525039184811E-3,null,null,9.5E-4,9.0854751942618037E-3,null,null,9.5E-4,9.0854751942618037E-3,1.0115967475410994E-3,9.6745654277690298E-3,1E-3,9.563658099222952E-3,4.0494900932400938E-4,3.872793872793873E-3,4.0494900932400938E-4,3.872793872793873E-3,5.9505691031829381E-5,5.6909208398641363E-4,1E-4,9.5636580992229528E-4,1.8471663752913753E-4,1.7665667665667665E-3,5.9505691031829381E-5,5.6909208398641363E-4,null,null,null,null,null,null,0.30993224462365587,2.9640860215053757,0.30993224462365587,2.9640860215053757,"NOx control","Selective Noncatalytic Reduction","1998-06-01","Other control","Activated carbon injection","2007-12-01","PM control","Electrostatic precipitator, cold side, w/o flue gas conditioning","1979-01-01","SO2 control","Wet FGD - Spray Type","1994-11-01","","",null,"","",null,"","",null,"","",null,"","",null,"","",null,"","",null,"",""]
["6064_N1","coal",120,null,6064,"Nearman Creek","KS","N1","N1","Conventional Boiler","Wall firing - front firing",257.39999999999998,2433,9.4522144522144522,"","Subbituminous",null,null,null,null,null,null,3.0000000000000001E-5,2.8356643356643358E-4,3.0000000000000001E-5,2.8356643356643358E-4,null,null,null,null,null,null,null,null,null,null,null,null,4.0999999999999999E-4,3.8754079254079252E-3,4.0999999999999999E-4,3.8754079254079252E-3,null,null,null,null,1.4666666666666666E-4,1.3863247863247863E-3,1.4666666666666666E-4,1.3863247863247863E-3,null,null,null,null,null,null,null,null,null,null,"PM control","Electrostatic precipitator, cold side, w/ flue gas conditioning","1988-01-01","","",null,"","",null,"","",null,"","",null,"","",null,"","",null,"","",null,"","",null,"","",null,"","",null,"",""]
["7213_2","coal",121,null,7213,"Clover","VA","Unit 2","2","Conventional Boiler","Tangential firing",434,5041,11.61520737327189,"bituminous","bituminous",7.3712096085230425E-2,4.2885103104008575E-3,null,null,null,null,null,null,null,null,null,null,1.2983377322666667E-3,1.5080462000820891E-2,null,null,1.2983377322666667E-3,1.5080462000820891E-2,3.3765525141401685E-4,3.9219357658480626E-3,null,null,null,null,3.3765525141401685E-4,3.9219357658480626E-3,1.8542292602894791E-4,2.1537257375850842E-3,null,null,null,null,1.8542292602894791E-4,2.1537257375850842E-3,null,null,7.9174518289863619E-2,0.91962844861567394,null,null,null,null,7.9174518289863619E-2,0.91962844861567394,"NOx control","Selective Noncatalytic Reduction","2003-03-01","PM control","Fabric Filter, reverse air","2003-05-01","SO2 control","Wet FGD - Spray Type","2003-05-01","","",null,"","",null,"","",null,"","",null,"","",null,"","",null,"","",null,"","",null,"",""]
["2403_U2","coal",122,null,2403,"PSEG Hudson Generating Station","NJ","HUDU2E2PT2OS1-Coal","U2","Conventional Boiler","Wall firing - opposed firing",659.7,6600,10.004547521600728,"natural gas","subbituminous",null,null,null,null,null,null,null,null,null,null,null,null,null,null,null,null,null,null,null,null,null,null,3.9360825359820368E-4,3.9378724780174991E-3,3.9360825359820368E-4,3.9378724780174991E-3,null,null,null,null,9.2760594423054737E-5,9.2802777503738258E-4,9.2760594423054737E-5,9.2802777503738258E-4,null,null,null,null,null,null,0.18298619730722043,1.8306941067570939,0.18298619730722043,1.8306941067570939,"NOx control","Selective Noncatalytic Reduction","1999-03-01","PM control","Electrostatic precipitator, cold side, w/ flue gas conditioning","1968-12-01","","",null,"","",null,"","",null,"","",null,"","",null,"","",null,"","",null,"","",null,"","",null,"",""]
["2535_2","coal",123,null,2535,"AES Cayuga, LLC","NY","Unit_2","2","Conventional Boiler","Tangential firing",168,1450,8.6309523809523814,"bituminous","bituminous",4.2877170580586162E-2,3.5968792887680055E-3,null,null,null,null,null,null,null,null,null,null,null,null,null,null,null,null,4.6613654531442163E-4,4.0232023256304246E-3,null,null,null,null,4.6613654531442163E-4,4.0232023256304246E-3,8.7624223002553015E-5,7.5628049615298742E-4,null,null,null,null,8.7624223002553015E-5,7.5628049615298742E-4,0.72806666666666664,6.2839087301587302,null,null,null,null,null,null,0.72806666666666664,6.2839087301587302,"PM control","Electrostatic precipitator, cold side, w/o flue gas conditioning",null,"SO2 control","Wet FGD - Spray Type","1995-01-01","","",null,"","",null,"","",null,"","",null,"","",null,"","",null,"","",null,"","",null,"","",null,"",""]
["3140_1","coal",124,null,3140,"PPL Brunner Island","PA","U1","1","Conventional Boiler","Tangential firing",330,3345,10.136363636363637,"bituminous","bituminous",7.7107639177860191E-2,null,null,null,null,null,null,null,null,null,null,null,6.9166666666666663E-5,7.0109848484848486E-4,null,null,6.9166666666666663E-5,7.0109848484848486E-4,3.9813778149642103E-4,4.0356693306228134E-3,null,null,null,null,3.9813778149642103E-4,4.0356693306228134E-3,4.0753524757924475E-4,4.1309254640987079E-3,null,null,null,null,4.0753524757924475E-4,4.1309254640987079E-3,null,null,0.40277115279491854,4.0826348669666741,null,null,null,null,0.40277115279491854,4.0826348669666741,"PM control","Fabric Filter, pulse","1965-01-01","SO2 control","Wet FGD - Tray Type","2009-11-01","","",null,"","",null,"","",null,"","",null,"","",null,"","",null,"","",null,"","",null,"","",null,"",""]
["7213_1","coal",125,null,7213,"Clover","VA","Unit 1","1","Conventional Boiler","Tangential firing",431,4923,11.422273781902552,"bituminous","bituminous",0.12875697271219658,4.3058700253071911E-3,null,null,null,null,null,null,null,null,null,null,3.5766666666666672E-4,4.085366589327147E-3,null,null,3.5766666666666672E-4,4.085366589327147E-3,3.7307076952211804E-4,4.2613164695066985E-3,null,null,null,null,3.7307076952211804E-4,4.2613164695066985E-3,1.7153019985941109E-4,1.9592649046586562E-3,null,null,null,null,1.7153019985941109E-4,1.9592649046586562E-3,null,null,4.3841657779696223E-2,0.5007714182121682,null,null,null,null,4.3841657779696223E-2,0.5007714182121682,"PM control","Fabric Filter, reverse air","2003-05-01","SO2 control","Wet FGD - Spray Type","2003-05-01","","",null,"","",null,"","",null,"","",null,"","",null,"","",null,"","",null,"","",null,"","",null,"",""]
["6017_2","coal",126,null,6017,"Newton","IL","002","2","Conventional Boiler","Tangential firing",620,5500,8.870967741935484,"subbituminous","subbituminous",1.2993822125794041E-3,6.0089891228538896E-3,null,null,null,null,null,null,null,null,null,null,8.0099999999999995E-5,7.1056451612903221E-4,null,null,8.0099999999999995E-5,7.1056451612903221E-4,4.8706228669869502E-4,4.3207138336174558E-3,null,null,null,null,4.8706228669869502E-4,4.3207138336174558E-3,3.3769382608885949E-3,2.9956710378850438E-2,null,null,null,null,3.3769382608885949E-3,2.9956710378850438E-2,null,null,null,null,null,null,null,null,null,null,"Other control","Other (specify): Flue gas conditioning","2001-04-01","Other control","Activated carbon injection",null,"PM control","Electrostatic precipitator, cold side, w/ flue gas conditioning",null,"","",null,"","",null,"","",null,"","",null,"","",null,"","",null,"","",null,"","",null,"",""]
["6204_3","coal",127,null,6204,"Laramie River Station","WY","3","3","Conventional Boiler","Wall firing - opposed firing",610,6600,10.819672131147541,"coal - subbituminous","subbituminous",null,null,null,null,null,null,null,null,null,null,null,null,null,null,null,null,null,null,null,null,null,null,4.1077441077441078E-4,4.4444444444444444E-3,4.1077441077441078E-4,4.4444444444444444E-3,null,null,null,null,1.1326500297088531E-5,1.2254901960784314E-4,1.1326500297088531E-5,1.2254901960784314E-4,null,null,null,null,null,null,null,null,null,null,"SO2 control","Dry FGD - Spray Dryer","1982-11-01","PM control","Electrostatic precipitator, cold side, w/o flue gas conditioning","1982-11-01","","",null,"","",null,"","",null,"","",null,"","",null,"","",null,"","",null,"","",null,"","",null,"",""]
["3954_1","coal",128,null,3954,"Mt. Storm","WV","Unit 1&2","1","Conventional Boiler","Tangential firing",552.79999999999995,6446,11.660636758321274,"bituminous","bituminous",8.4591886779048317E-2,4.8811573327486894E-3,null,null,null,null,null,null,null,null,null,null,2.3800000000000001E-4,2.8348768828357542E-3,null,null,2.3800000000000001E-4,2.8348768828357542E-3,4.2000569098259898E-4,5.0027916975883494E-3,null,null,null,null,4.2000569098259898E-4,5.0027916975883494E-3,3.5342991255623695E-4,4.2097911294467988E-3,null,null,null,null,3.5342991255623695E-4,4.2097911294467988E-3,null,null,0.10113599955326762,1.2046559124203593,null,null,null,null,0.10113599955326762,1.2046559124203593,"NOx control","Selective Catalytic Reduction","2003-05-01","NOx control","Selective Catalytic Reduction","2003-05-01","PM control","Electrostatic precipitator, cold side, w/o flue gas conditioning","1966-07-01","PM control","Electrostatic precipitator, cold side, w/o flue gas conditioning","1965-09-01","SO2 control","Wet FGD - Spray Type","2002-03-01","SO2 control","Wet FGD - Spray Type","2002-03-01","","",null,"","",null,"","",null,"","",null,"","",null,"",""]
[{"$f":"E130&\"_\"&I130","v":"3954_2"},"coal",129,null,3954,"Mt. Storm","WV","Unit 1&2","2","Conventional Boiler","Tangential firing",555.9,6760,12.160460514481022,"bituminous","bituminous",8.4591886779048317E-2,4.8811573327486894E-3,null,null,null,null,null,null,null,null,null,null,2.3800000000000001E-4,2.8348768828357542E-3,null,null,2.3800000000000001E-4,2.8348768828357542E-3,4.2000569098259898E-4,5.0027916975883494E-3,null,null,null,null,4.2000569098259898E-4,5.0027916975883494E-3,3.5342991255623695E-4,4.2097911294467988E-3,null,null,null,null,3.5342991255623695E-4,4.2097911294467988E-3,null,null,0.10113599955326762,1.2046559124203593,null,null,null,null,0.10113599955326762,1.2046559124203593,"NOx control","Selective Catalytic Reduction","2003-05-01","NOx control","Selective Catalytic Reduction","2003-05-01","PM control","Electrostatic precipitator, cold side, w/o flue gas conditioning","1966-07-01","PM control","Electrostatic precipitator, cold side, w/o flue gas conditioning","1965-09-01","SO2 control","Wet FGD - Spray Type","2002-03-01","SO2 control","Wet FGD - Spray Type","2002-03-01","","",null,"","",null,"","",null,"","",null,"","",null,"",""]
["3944_1","coal",130,null,3944,"Harrison Power Station","WV","Boiler1","1","Conventional Boiler","Wall firing - unspecified",693,5779,8.3391053391053394,"bituminous","bituminous",3.8976421361001566E-2,8.5591458145609523E-3,null,null,null,null,0.2,1.6678210678210679,0.2,1.6678210678210679,null,null,2.4919333333333334E-5,2.0780494564694567E-4,null,null,2.4919333333333334E-5,2.0780494564694567E-4,6.0156668500892024E-4,5.0165279547857867E-3,null,null,0.9,7.5051948051948054,6.0156668500892024E-4,5.0165279547857867E-3,6.5820558184296436E-5,5.4888456817756004E-4,null,null,null,null,6.5820558184296436E-5,5.4888456817756004E-4,null,null,0.1782925631469047,1.4868004652611289,null,null,null,null,0.1782925631469047,1.4868004652611289,"NOx control","Selective Catalytic Reduction","2002-05-01","PM control","Electrostatic precipitator, cold side, unspecified","1974-12-01","SO2 control","Wet FGD - Spray Type","1994-11-01","","",null,"","",null,"","",null,"","",null,"","",null,"","",null,"","",null,"","",null,"",""]
["2324_3","coal",131,null,2324,"Reid Gardner","NV","3","3","Conventional Boiler","Wall firing - front firing",111,1237,11.144144144144144,"coal - bituminous, other non-fossil fuel (specify)","bituminous",null,null,null,null,null,null,null,null,null,null,null,null,null,null,null,null,null,null,null,null,null,null,4.5233333333333329E-4,5.0408678678678671E-3,4.5233333333333329E-4,5.0408678678678671E-3,null,null,null,null,null,null,null,null,null,null,null,null,null,null,2.9266666666666673E-2,0.32615195195195201,2.9266666666666673E-2,0.32615195195195201,"PM control","Fabric Filter, pulse","2009-02-01","SO2 control","Wet FGD - Venturi Type","1976-07-01","","",null,"","",null,"","",null,"","",null,"","",null,"","",null,"","",null,"","",null,"","",null,"",""]
["3161_2","coal",132,null,3161,"Eddystone Generating Station","PA","Unit 2","2","Conventional Boiler","Tangential firing",339,2808,8.283185840707965,"bituminous","bituminous",4.8808942165762613E-2,3.6144724399264482E-3,null,null,null,null,null,null,null,null,null,null,1.7492999999999999E-3,1.4489776991150442E-2,null,null,1.7492999999999999E-3,1.4489776991150442E-2,6.0871049466841814E-4,5.042062150527782E-3,null,null,null,null,6.0871049466841814E-4,5.042062150527782E-3,2.0417749091350185E-4,1.6912401017259977E-3,null,null,null,null,2.0417749091350185E-4,1.6912401017259977E-3,0.38019999999999998,3.149267256637168,null,null,null,null,null,null,0.38019999999999998,3.149267256637168,"NOx control","Selective Noncatalytic Reduction","2003-06-01","PM control","Multiple cyclone","1960-11-01","PM control","Electrostatic precipitator, hot side, w/o flue gas conditioning","1960-11-01","PM control","PM scrubber - Venturi","1982-12-01","SO2 control","Wet FGD - Spray Type","1982-12-01","","",null,"","",null,"","",null,"","",null,"","",null,"","",null,"",""]
["6018_2","coal",133,null,6018,"East Bend Station","KY","2","2","Conventional Boiler","Wall firing - front firing",650.72463770000002,6313,9.7014922046188872,"bituminous","bituminous",8.4793313845211424E-2,6.1393150165682505E-3,null,null,1.8000000000000001E-4,1.7462685968313999E-3,null,null,1.8000000000000001E-4,1.7462685968313999E-3,null,null,2.6033333333333334E-5,2.5256218039357834E-4,null,null,2.6033333333333334E-5,2.5256218039357834E-4,5.2845554372447847E-4,5.1268073379306632E-3,null,null,null,null,5.2845554372447847E-4,5.1268073379306632E-3,1.7505440854930377E-4,1.6982889799252404E-3,null,null,null,null,1.7505440854930377E-4,1.6982889799252404E-3,null,null,6.0855869763289959E-2,0.59039274611385983,null,null,null,null,6.0855869763289959E-2,0.59039274611385983,"Other control","Dry sorbent injection","2005-01-01","PM control","Electrostatic precipitator, hot side, w/ flue gas conditioning","1981-01-01","NOx control","Selective Catalytic Reduction","2002-01-01","SO2 control","Wet FGD - Spray Type","1981-01-01","","",null,"","",null,"","",null,"","",null,"","",null,"","",null,"","",null,"",""]
["3944_3","coal",134,null,3944,"Harrison Power Station","WV","Boiler3","3","Conventional Boiler","Wall firing - unspecified",692,5876,8.4913294797687868,"bituminous","bituminous",1.5575107945358642E-2,6.5975681883361573E-3,null,null,null,null,null,null,null,null,null,null,7.4399999999999999E-7,6.3175491329479773E-6,null,null,7.4399999999999999E-7,6.3175491329479773E-6,6.2058304035335322E-4,5.2695750651969705E-3,null,null,null,null,6.2058304035335322E-4,5.2695750651969705E-3,1.2656888013636304E-4,1.0747380631232215E-3,null,null,null,null,1.2656888013636304E-4,1.0747380631232215E-3,null,null,0.20523489335526338,1.742717100224751,null,null,null,null,0.20523489335526338,1.742717100224751,"NOx control","Selective Catalytic Reduction","2003-05-01","PM control","Electrostatic precipitator, cold side, unspecified","1972-12-01","SO2 control","Wet FGD - Spray Type","1994-11-01","","",null,"","",null,"","",null,"","",null,"","",null,"","",null,"","",null,"","",null,"",""]
["56319_0001","coal",135,null,56319,"Wygen 2","WY","WYG2Cfg","0001","Conventional Boiler","Wall firing - front firing",96,1300,13.541666666666666,"subbituminous","subbituminous",8.4990651028386875E-4,1.8187999320074791E-3,null,null,null,null,null,null,null,null,null,null,8.7200000000000005E-5,1.1808333333333334E-3,null,null,8.7200000000000005E-5,1.1808333333333334E-3,4.0000065083638128E-4,5.4166754800759965E-3,3.9233333333333335E-4,5.3128472222222223E-3,null,null,3.9233333333333335E-4,5.3128472222222223E-3,4.0000065083638128E-4,5.4166754800759965E-3,4.0866666666666661E-4,5.5340277777777766E-3,null,null,4.0000065083638128E-4,5.4166754800759965E-3,4.8000000000000022E-2,0.65000000000000024,null,null,null,null,null,null,4.8000000000000022E-2,0.65000000000000024,"NOx control","Selective Catalytic Reduction","2008-01-01","SO2 control","Dry FGD - Spray Dryer","2008-01-01","PM control","Fabric Filter, pulse","2008-01-01","","",null,"","",null,"","",null,"","",null,"","",null,"","",null,"","",null,"","",null,"",""]
["995_7","coal",136,null,995,"Bailly","IN","7","7","Conventional Boiler","Cyclone firing",176,1638,9.3068181818181817,"bituminous","bituminous",0.1319141629397681,4.9139925810498947E-3,null,null,null,null,null,null,null,null,null,null,3.7366666666666662E-5,3.4776477272727266E-4,null,null,3.7366666666666662E-5,3.4776477272727266E-4,5.7519726985606734E-4,5.3532564092286265E-3,null,null,null,null,5.7519726985606734E-4,5.3532564092286265E-3,1.1798824487483782E-4,1.0980951426419565E-3,null,null,null,null,1.1798824487483782E-4,1.0980951426419565E-3,null,null,0.11432504656908832,1.0640024220464015,null,null,null,null,0.11432504656908832,1.0640024220464015,"NOx control","Selective Catalytic Reduction","2008-03-01","PM control","Electrostatic precipitator, cold side, w/o flue gas conditioning","1980-06-01","SO2 control","Wet FGD - Packed Type","1992-06-01","","",null,"","",null,"","",null,"","",null,"","",null,"","",null,"","",null,"","",null,"",""]
["8219_1","coal",137,null,8219,"Ray D Nixon","CO","Unit 1","1","Conventional Boiler","Wall firing - front firing",225,2095,9.3111111111111118,"subbituminous","subbituminous",null,null,null,null,null,null,null,null,null,null,null,null,null,null,null,null,null,null,null,null,null,null,5.8450000000000006E-4,5.4423444444444457E-3,5.8450000000000006E-4,5.4423444444444457E-3,null,null,null,null,3.6333333333333335E-4,3.3830370370370373E-3,3.6333333333333335E-4,3.3830370370370373E-3,null,null,null,null,null,null,0.39066666666666672,3.6375407407407416,0.39066666666666672,3.6375407407407416,"PM control","Fabric Filter, reverse air","1980-04-01","","",null,"","",null,"","",null,"","",null,"","",null,"","",null,"","",null,"","",null,"","",null,"","",null,"",""]
["995_8","coal",138,null,995,"Bailly","IN","8","8","Conventional Boiler","Cyclone firing",352,3374,9.5852272727272734,"bituminous","bituminous",0.1319141629397681,4.9139925810498947E-3,null,null,null,null,null,null,null,null,null,null,3.7366666666666662E-5,3.581679924242424E-4,null,null,3.7366666666666662E-5,3.581679924242424E-4,5.7519726985606734E-4,5.5133965582226455E-3,null,null,null,null,5.7519726985606734E-4,5.5133965582226455E-3,1.1798824487483782E-4,1.1309441426355195E-3,null,null,null,null,1.1798824487483782E-4,1.1309441426355195E-3,null,null,0.11432504656908832,1.0958315543298409,null,null,null,null,0.11432504656908832,1.0958315543298409,"NOx control","Selective Catalytic Reduction","2006-06-01","PM control","Electrostatic precipitator, cold side, w/o flue gas conditioning","1981-02-01","SO2 control","Wet FGD - Packed Type","1992-06-01","","",null,"","",null,"","",null,"","",null,"","",null,"","",null,"","",null,"","",null,"",""]
["6016_1","coal",139,null,6016,"Duck Creek","IL","001","1","Conventional Boiler","Wall firing - unspecified",400,4500,11.25,"subbituminous","subbituminous",2.1977246819569946E-2,4.7007146983889829E-3,null,null,null,null,null,null,null,null,null,null,7.6333333333333337E-5,8.5875000000000003E-4,null,null,7.6333333333333337E-5,8.5875000000000003E-4,5.0140548643396083E-4,5.6408117223820595E-3,null,null,1.14E-3,1.2825E-2,5.0140548643396083E-4,5.6408117223820595E-3,4.5196691793849474E-4,5.084627826808066E-3,null,null,9.7399999999999999E-6,1.0957499999999999E-4,9.7399999999999999E-6,1.0957499999999999E-4,null,null,null,null,null,null,1.3299999999999999E-2,0.14962499999999998,1.3299999999999999E-2,0.14962499999999998,"NOx control","Selective Catalytic Reduction","2003-06-01","PM control","Electrostatic precipitator, cold side, unspecified","2009-03-01","SO2 control","Wet FGD - Venturi Type","2009-03-01","","",null,"","",null,"","",null,"","",null,"","",null,"","",null,"","",null,"","",null,"",""]
["1893_3","coal",140,null,1893,"Boswell Energy Center","MN","BEC3","3","Conventional Boiler","Tangential firing",371.3,4115,11.08268246700781,"subbituminous","subbituminous",3.9193729003359464E-3,3.2474804031354981E-3,null,null,null,null,null,null,null,null,null,null,null,null,null,null,null,null,5.1266744943926886E-4,5.681730553306198E-3,null,null,null,null,5.1266744943926886E-4,5.681730553306198E-3,3.7944557771443836E-2,0.42052748513194554,null,null,null,null,3.7944557771443836E-2,0.42052748513194554,1.1666666666666669E-2,0.12929796211509115,null,null,null,null,null,null,1.1666666666666669E-2,0.12929796211509115,"NOx control","Selective Catalytic Reduction",null,"SO2 control","Wet FGD - Spray Type","2009-01-01","Other control","Activated carbon injection",null,"PM control","Fabric Filter, unspecified","2009-01-01","","",null,"","",null,"","",null,"","",null,"","",null,"","",null,"","",null,"",""]
["3944_2","coal",141,null,3944,"Harrison Power Station","WV","Boiler2","2","Conventional Boiler","Wall firing - unspecified",692,6042,8.7312138728323703,"bituminous","bituminous",3.4283820998244403E-2,9.7609850321835005E-3,null,null,null,null,null,null,null,null,null,null,1.1833333333333334E-4,1.0331936416184972E-3,null,null,1.1833333333333334E-4,1.0331936416184972E-3,6.5681230169897797E-4,5.7347686804410771E-3,null,null,null,null,6.5681230169897797E-4,5.7347686804410771E-3,1.2983387512386239E-4,1.1336073316450528E-3,null,null,null,null,1.2983387512386239E-4,1.1336073316450528E-3,null,null,7.0078157316521394E-2,0.61186737934454083,null,null,null,null,7.0078157316521394E-2,0.61186737934454083,"NOx control","Selective Catalytic Reduction","2003-05-01","PM control","Electrostatic precipitator, cold side, unspecified","1973-12-01","SO2 control","Wet FGD - Spray Type","1994-11-01","","",null,"","",null,"","",null,"","",null,"","",null,"","",null,"","",null,"","",null,"",""]
["3098_4","coal",142,null,3098,"Elrama Power Plant","PA","ELR4-2","4","Conventional Boiler","Wall firing - front firing",185,1921,10.383783783783784,"bituminous","bituminous",3.4677668107413205E-2,1.2869256993774192E-3,null,null,null,null,null,null,null,null,null,null,2.6433333333333333E-4,2.7447801801801803E-3,null,null,2.6433333333333333E-4,2.7447801801801803E-3,5.53039270030101E-4,5.742640203934184E-3,null,null,null,null,5.53039270030101E-4,5.742640203934184E-3,9.9974010452454307E-5,1.0381085085360256E-3,null,null,null,null,9.9974010452454307E-5,1.0381085085360256E-3,null,null,null,null,null,null,null,null,null,null,"NOx control","Selective Noncatalytic Reduction","2001-07-01","PM control","Multiple cyclone","1960-11-01","PM control","Electrostatic precipitator, cold side, w/o flue gas conditioning","1960-11-01","SO2 control","Wet FGD - Venturi Type","1975-06-01","","",null,"","",null,"","",null,"","",null,"","",null,"","",null,"","",null,"",""]
["3098_3","coal",143,null,3098,"Elrama Power Plant","PA","ELR3-2","3","Conventional Boiler","Vertical firing",125,1303,10.423999999999999,"bituminous","bituminous",3.4677668107413205E-2,1.2869256993774192E-3,null,null,null,null,null,null,null,null,null,null,2.6433333333333333E-4,2.7554106666666666E-3,null,null,2.6433333333333333E-4,2.7554106666666666E-3,5.53039270030101E-4,5.7648813507937728E-3,null,null,null,null,5.53039270030101E-4,5.7648813507937728E-3,9.9974010452454307E-5,1.0421290849563837E-3,null,null,null,null,9.9974010452454307E-5,1.0421290849563837E-3,null,null,null,null,null,null,null,null,null,null,"NOx control","Selective Noncatalytic Reduction","2001-07-01","PM control","Multiple cyclone","1954-11-01","PM control","Electrostatic precipitator, cold side, w/o flue gas conditioning","1954-11-01","SO2 control","Wet FGD - Venturi Type","1975-06-01","","",null,"","",null,"","",null,"","",null,"","",null,"","",null,"","",null,"",""]
["8042_Unit 1","coal",144,null,8042,"Belews Creek Steam Station","NC","1-2008","Unit 1","Conventional Boiler","Wall firing - opposed firing",1185.8,10800,9.1077753415415756,"bituminous","bituminous",8.6410160348497481E-2,5.1332494008376472E-3,null,null,null,null,null,null,null,null,null,null,2.5666666666666669E-6,2.337662337662338E-5,null,null,2.5666666666666669E-6,2.337662337662338E-5,6.3354197760071181E-4,5.7701580014232479E-3,null,null,null,null,6.3354197760071181E-4,5.7701580014232479E-3,8.0668343007335355E-4,7.347091452852267E-3,null,null,null,null,8.0668343007335355E-4,7.347091452852267E-3,null,null,4.8359830471376652E-2,0.44045047148833522,null,null,null,null,4.8359830471376652E-2,0.44045047148833522,"NOx control","Selective Catalytic Reduction","2003-06-01","PM control","Electrostatic precipitator, cold side, w/ flue gas conditioning","1973-01-01","SO2 control","Wet FGD - Spray Type","2008-01-01","","",null,"","",null,"","",null,"","",null,"","",null,"","",null,"","",null,"","",null,"",""]
["52007_BLR1","coal",145,null,52007,"Mecklenburg Power Station","VA","Unit 1 & 2","BLR1","Conventional Boiler","Wall firing - front firing",76,916,12.052631578947368,"bituminous","bituminous",0.14714807622869575,8.1241211164370473E-3,null,null,null,null,null,null,null,null,null,null,1.9873333333333336E-4,2.3978745614035091E-3,null,null,1.9873333333333336E-4,2.3978745614035091E-3,4.858859468511503E-4,5.8625975429276948E-3,null,null,null,null,4.858859468511503E-4,5.8625975429276948E-3,6.009849933114326E-5,7.2513584061392592E-4,1.2246666666666667E-4,1.4776570175438597E-3,null,null,6.009849933114326E-5,7.2513584061392592E-4,null,null,8.3128224638290851E-2,1.0030076578067462,null,null,null,null,8.3128224638290851E-2,1.0030076578067462,"SO2 control","Dry FGD - Spray Dryer","1992-11-01","SO2 control","Dry FGD - Spray Dryer","1992-11-01","PM control","Fabric Filter, pulse","1992-11-01","PM control","Fabric Filter, pulse","1992-11-01","","",null,"","",null,"","",null,"","",null,"","",null,"","",null,"","",null,"",""]
["52007_BLR2","coal",146,null,52007,"Mecklenburg Power Station","VA","Unit 1 & 2","BLR2","Conventional Boiler","Wall firing - front firing",76,918,12.078947368421053,"bituminous","bituminous",0.14714807622869575,8.1241211164370473E-3,null,null,null,null,null,null,null,null,null,null,1.9873333333333336E-4,2.3978745614035091E-3,null,null,1.9873333333333336E-4,2.3978745614035091E-3,4.858859468511503E-4,5.8625975429276948E-3,null,null,null,null,4.858859468511503E-4,5.8625975429276948E-3,6.009849933114326E-5,7.2513584061392592E-4,1.2246666666666667E-4,1.4776570175438597E-3,null,null,6.009849933114326E-5,7.2513584061392592E-4,null,null,8.3128224638290851E-2,1.0030076578067462,null,null,null,null,8.3128224638290851E-2,1.0030076578067462,"SO2 control","Dry FGD - Spray Dryer","1992-11-01","SO2 control","Dry FGD - Spray Dryer","1992-11-01","PM control","Fabric Filter, pulse","1992-11-01","PM control","Fabric Filter, pulse","1992-11-01","","",null,"","",null,"","",null,"","",null,"","",null,"","",null,"","",null,"",""]
["1356_3","coal",147,null,1356,"Ghent","KY","GH3","3","Conventional Boiler","Wall firing - opposed firing",525,5868,11.177142857142858,"bituminous","bituminous",9.6774405101058558E-2,6.9280591758790547E-3,5.659605015881766E-4,6.325821377751277E-3,5.9299999999999999E-4,6.6280457142857147E-3,null,null,5.659605015881766E-4,6.325821377751277E-3,null,null,9.0000000000000008E-4,1.0059428571428573E-2,null,null,9.0000000000000008E-4,1.0059428571428573E-2,5.2655471938923583E-4,5.8853773207162589E-3,null,null,null,null,5.2655471938923583E-4,5.8853773207162589E-3,1.4620648859912675E-4,1.6341708097136682E-3,null,null,null,null,1.4620648859912675E-4,1.6341708097136682E-3,0.21783333333333335,2.4347542857142859,null,null,null,null,null,null,0.21783333333333335,2.4347542857142859,"Other control","Other (specify): Sorbent injection for SO3 reduction","2008-06-01","PM control","Electrostatic precipitator, hot side, w/o flue gas conditioning","1981-05-01","NOx control","Selective Catalytic Reduction","2004-05-01","Other control","Other (specify): Sorbent injection for SO3 reduction","2008-06-01","SO2 control","Wet FGD - Spray Type","2007-05-01","","",null,"","",null,"","",null,"","",null,"","",null,"","",null,"",""]
["874_5","coal",148,null,874,"Joliet 9","IL","JOL5 CONFIG","5","Conventional Boiler","Cyclone firing",326,3572.3780000000002,10.95821472392638,"subbituminous","subbituminous",1.196088113643839E-3,5.8130084555333738E-3,null,null,null,null,null,null,null,null,null,null,2.1666666666666666E-4,2.3742798568507158E-3,null,null,2.1666666666666666E-4,2.3742798568507158E-3,5.4129457770278535E-4,5.9316222113641745E-3,null,null,null,null,5.4129457770278535E-4,5.9316222113641745E-3,4.7382967547725664E-4,5.1923273264481325E-3,null,null,null,null,4.7382967547725664E-4,5.1923273264481325E-3,0.43349999999999994,4.750386082822085,null,null,null,null,null,null,0.43349999999999994,4.750386082822085,"Other control","Activated carbon injection","2009-07-01","PM control","Electrostatic precipitator, cold side, w/o flue gas conditioning","1966-03-01","","",null,"","",null,"","",null,"","",null,"","",null,"","",null,"","",null,"","",null,"","",null,"",""]
["887_1","coal",149,null,887,"Joppa Steam","IL","1","1","Conventional Boiler","Tangential firing",183.3,1800,9.8199672667757767,"subbituminous","subbituminous",1.7312869364181256E-3,5.0548856912142285E-3,null,null,null,null,null,null,null,null,null,null,7.4666666666666661E-5,7.3322422258592461E-4,null,null,7.4666666666666661E-5,7.3322422258592461E-4,6.4118121105163678E-4,6.296378504598724E-3,null,null,null,null,6.4118121105163678E-4,6.296378504598724E-3,5.756697485734039E-4,5.6530580874638676E-3,null,null,null,null,5.756697485734039E-4,5.6530580874638676E-3,0.58319999999999994,5.7270049099836324,null,null,null,null,null,null,0.58319999999999994,5.7270049099836324,"Other control","Activated carbon injection","2009-07-01","PM control","Electrostatic precipitator, cold side, w/ flue gas conditioning","1971-01-01","","",null,"","",null,"","",null,"","",null,"","",null,"","",null,"","",null,"","",null,"","",null,"",""]
["3295_URQ3","coal",150,null,3295,"Urquhart","SC","URQ003","URQ3","Conventional Boiler","Tangential firing",103,1048,10.174757281553399,"bituminous","bituminous",1.4292320405046655E-2,1.1767563083050089E-2,null,null,null,null,null,null,null,null,null,null,7.79E-6,7.9261359223300979E-5,null,null,7.79E-6,7.9261359223300979E-5,null,null,6.3899999999999992E-4,6.5016699029126213E-3,null,null,6.3899999999999992E-4,6.5016699029126213E-3,null,null,1.7833333333333332E-4,1.8144983818770227E-3,null,null,1.7833333333333332E-4,1.8144983818770227E-3,null,null,null,null,null,null,null,null,null,null,"PM control","Electrostatic precipitator, cold side, unspecified","1969-11-01","","",null,"","",null,"","",null,"","",null,"","",null,"","",null,"","",null,"","",null,"","",null,"","",null,"",""]
["3098_1","coal",151,null,3098,"Elrama Power Plant","PA","ELR1-2","1","Conventional Boiler","Vertical firing",100,1254,12.54,"bituminous","bituminous",3.4677668107413205E-2,1.2869256993774192E-3,null,null,null,null,null,null,null,null,null,null,2.6433333333333333E-4,3.3147399999999996E-3,null,null,2.6433333333333333E-4,3.3147399999999996E-3,5.53039270030101E-4,6.9351124461774659E-3,null,null,null,null,5.53039270030101E-4,6.9351124461774659E-3,9.9974010452454307E-5,1.253674091073777E-3,null,null,null,null,9.9974010452454307E-5,1.253674091073777E-3,null,null,null,null,null,null,null,null,null,null,"NOx control","Selective Noncatalytic Reduction","2001-07-01","PM control","Multiple cyclone","1952-06-01","PM control","Electrostatic precipitator, cold side, w/o flue gas conditioning","1952-06-01","SO2 control","Wet FGD - Venturi Type","1975-06-01","","",null,"","",null,"","",null,"","",null,"","",null,"","",null,"","",null,"",""]
["3098_2","coal",152,null,3098,"Elrama Power Plant","PA","ELR2-2","2","Conventional Boiler","Vertical firing",100,1254,12.54,"bituminous","bituminous",3.4677668107413205E-2,1.2869256993774192E-3,null,null,null,null,null,null,null,null,null,null,2.6433333333333333E-4,3.3147399999999996E-3,null,null,2.6433333333333333E-4,3.3147399999999996E-3,5.53039270030101E-4,6.9351124461774659E-3,null,null,null,null,5.53039270030101E-4,6.9351124461774659E-3,9.9974010452454307E-5,1.253674091073777E-3,null,null,null,null,9.9974010452454307E-5,1.253674091073777E-3,null,null,null,null,null,null,null,null,null,null,"NOx control","Selective Noncatalytic Reduction","2001-07-01","PM control","Multiple cyclone","1953-03-01","PM control","Electrostatic precipitator, cold side, w/o flue gas conditioning","1953-03-01","SO2 control","Wet FGD - Venturi Type","1975-06-01","","",null,"","",null,"","",null,"","",null,"","",null,"","",null,"","",null,"",""]
["6019_1","coal",153,null,6019,"W H Zimmer","OH","1","1","Conventional Boiler","Wall firing - opposed firing",1408,12656,8.9886363636363633,"bituminous,  bituminous,  bituminous","bituminous,  bituminous,  bituminous",8.7771146159762073E-2,6.6768851789737417E-3,null,null,null,null,null,null,null,null,null,null,2.1799999999999998E-5,1.959522727272727E-4,null,null,2.1799999999999998E-5,1.959522727272727E-4,8.7784160862531017E-4,7.8905990048025038E-3,null,null,null,null,8.7784160862531017E-4,7.8905990048025038E-3,1.5864009008761907E-4,1.4259580824921214E-3,null,null,null,null,1.5864009008761907E-4,1.4259580824921214E-3,null,null,0.40490067388679246,3.6395049209596912,null,null,null,null,0.40490067388679246,3.6395049209596912,"Other control","Other (specify): Magnesium Hydroxide Injection",null,"NOx control","Selective Catalytic Reduction","2004-01-01","Other control","Dry sorbent injection","2004-05-01","PM control","Electrostatic precipitator, cold side, w/o flue gas conditioning","1991-03-01","SO2 control","Wet FGD - Spray Type","2004-06-01","","",null,"","",null,"","",null,"","",null,"","",null,"","",null,"",""]
["1356_4","coal",154,null,1356,"Ghent","KY","GH4","4","Conventional Boiler","Wall firing - opposed firing",525,5967,11.365714285714287,"bituminous","bituminous",0.12563966671244306,6.1153685240685762E-3,5.9133750232757097E-4,6.7209730978830783E-3,6.0033333333333336E-4,6.823217142857144E-3,null,null,5.9133750232757097E-4,6.7209730978830783E-3,null,null,9.3333333333333332E-4,1.0608000000000001E-2,null,null,9.3333333333333332E-4,1.0608000000000001E-2,6.966455205662473E-4,7.9178739451786634E-3,null,null,null,null,6.966455205662473E-4,7.9178739451786634E-3,1.688964829395815E-4,1.9196291689533007E-3,null,null,null,null,1.688964829395815E-4,1.9196291689533007E-3,9.9100000000000008E-2,1.126342285714286,null,null,null,null,null,null,9.9100000000000008E-2,1.126342285714286,"Other control","Other (specify): Sorbent injection for SO3 reduction","2008-06-01","PM control","Electrostatic precipitator, hot side, w/o flue gas conditioning","1984-06-01","NOx control","Selective Catalytic Reduction","2004-05-01","Other control","Other (specify): Sorbent injection for SO3 reduction","2008-06-01","SO2 control","Wet FGD - Spray Type","2008-06-01","","",null,"","",null,"","",null,"","",null,"","",null,"","",null,"",""]
["1241_2","coal",155,null,1241,"La Cygne","KS","2","2","Conventional Boiler","Wall firing - opposed firing",685,7700,11.240875912408759,"subbituminous","subbituminous",1.4739627694631198E-3,5.3120454686091554E-3,null,null,null,null,null,null,null,null,null,null,4.1066666666666671E-5,4.6162530413625309E-4,null,null,4.1066666666666671E-5,4.6162530413625309E-4,7.3104455206542487E-4,8.2175810962098854E-3,null,null,8.9999999999999998E-4,1.0116788321167884E-2,7.3104455206542487E-4,8.2175810962098854E-3,7.9746724134112119E-4,8.9642303041264724E-3,null,null,4.0244279529993814E-4,4.5238095238095237E-3,4.0244279529993814E-4,4.5238095238095237E-3,null,null,0.68767539826049229,7.7300738198624677,null,null,null,null,0.68767539826049229,7.7300738198624677,"PM control","Electrostatic precipitator, cold side, w/o flue gas conditioning","1977-03-01","","",null,"","",null,"","",null,"","",null,"","",null,"","",null,"","",null,"","",null,"","",null,"","",null,"",""]
["2161_4","coal",156,null,2161,"James River Power Station","MO","Unit_4_JRPS","4","Conventional Boiler","Wall firing - front firing",60,600,10,"subbituminous","subbituminous",8.6053602887698995E-4,3.986617536449682E-3,null,null,null,null,null,null,null,null,null,null,9.3333333333333332E-4,9.3333333333333324E-3,null,null,9.3333333333333332E-4,9.3333333333333324E-3,null,null,8.3333333333333339E-4,8.3333333333333332E-3,null,null,8.3333333333333339E-4,8.3333333333333332E-3,null,null,1.9E-3,1.9E-2,null,null,1.9E-3,1.9E-2,0.59609999999999996,5.9609999999999994,null,null,null,null,null,null,0.59609999999999996,5.9609999999999994,"NOx control","Selective Noncatalytic Reduction","2007-05-01","PM control","Electrostatic precipitator, cold side, w/o flue gas conditioning","1976-08-01","","",null,"","",null,"","",null,"","",null,"","",null,"","",null,"","",null,"","",null,"","",null,"",""]
["2718_ES-3","coal",157,null,2718,"G G Allen","NC","3-2009","ES-3","Conventional Boiler","Tangential firing",281.5,2228,7.9147424511545292,"bituminous","bituminous",8.1889762186862294E-2,5.5940311957708893E-3,null,null,null,null,null,null,null,null,null,null,3.8916666666666666E-5,3.0801539372409708E-4,null,null,3.8916666666666666E-5,3.0801539372409708E-4,1.0590926888460891E-3,8.3824458641175367E-3,null,null,null,null,1.0590926888460891E-3,8.3824458641175367E-3,4.8488430496151431E-4,3.8377343923774558E-3,null,null,null,null,4.8488430496151431E-4,3.8377343923774558E-3,null,null,9.7061529410868777E-2,0.768217007202187,null,null,null,null,9.7061529410868777E-2,0.768217007202187,"NOx control","Selective Noncatalytic Reduction","2005-05-01","PM control","Electrostatic precipitator, cold side, w/ flue gas conditioning","2002-06-01","SO2 control","Wet FGD - Spray Type","2009-05-01","","",null,"","",null,"","",null,"","",null,"","",null,"","",null,"","",null,"","",null,"",""]
["1943_002","coal",158,null,1943,"Hoot Lake","MN","2","002","Conventional Boiler","Tangential firing",60.7,747.2,12.309719934102143,"subbituminous","subbituminous",2.2412006222239755E-3,3.7561516712212189E-3,null,null,null,null,null,null,null,null,null,null,6.6676318276333334E-4,8.2076680421871943E-3,null,null,6.6676318276333334E-4,8.2076680421871943E-3,6.8829413712907285E-4,8.472708060343382E-3,null,null,null,null,6.8829413712907285E-4,8.472708060343382E-3,3.6715275881546959E-4,4.5195476340513822E-3,null,null,null,null,3.6715275881546959E-4,4.5195476340513822E-3,0.57276666666666665,7.0505972542559032,null,null,null,null,null,null,0.57276666666666665,7.0505972542559032,"PM control","Electrostatic precipitator, cold side, w/o flue gas conditioning","1972-06-01","","",null,"","",null,"","",null,"","",null,"","",null,"","",null,"","",null,"","",null,"","",null,"","",null,"",""]
["2718_ES-4","coal",159,null,2718,"G G Allen","NC","4-2009","ES-4","Conventional Boiler","Tangential firing",297.3,2380,8.0053817692566422,"bituminous","bituminous",8.1889762186862294E-2,5.5940311957708893E-3,null,null,null,null,null,null,null,null,null,null,3.8916666666666666E-5,3.1154277385357101E-4,null,null,3.8916666666666666E-5,3.1154277385357101E-4,1.0590926888460891E-3,8.4784413032414786E-3,null,null,null,null,1.0590926888460891E-3,8.4784413032414786E-3,4.8488430496151431E-4,3.8816839751375848E-3,null,null,null,null,4.8488430496151431E-4,3.8816839751375848E-3,null,null,9.7061529410868777E-2,0.77701459804193629,null,null,null,null,9.7061529410868777E-2,0.77701459804193629,"NOx control","Selective Noncatalytic Reduction","2006-06-01","PM control","Electrostatic precipitator, cold side, w/ flue gas conditioning","1999-02-01","SO2 control","Wet FGD - Spray Type","2009-04-01","","",null,"","",null,"","",null,"","",null,"","",null,"","",null,"","",null,"","",null,"",""]
["3181_33","coal",160,null,3181,"Mitchell Power Station","PA","033","33","Conventional Boiler","Tangential firing",289,2563,8.8685121107266429,"coal - bituminous","bituminous",null,null,null,null,null,null,1.0485988687217376E-4,9.2995117665529872E-4,1.0485988687217376E-4,9.2995117665529872E-4,null,null,null,null,null,null,null,null,null,null,null,null,9.7203039498182375E-4,8.6204633298907068E-3,9.7203039498182375E-4,8.6204633298907068E-3,null,null,null,null,7.3552964087129279E-5,6.5230535278654786E-4,7.3552964087129279E-5,6.5230535278654786E-4,null,null,null,null,null,null,null,null,null,null,"PM control","Electrostatic precipitator, cold side, unspecified","1971-01-01","SO2 control","Wet FGD - Spray Type","1983-01-01","","",null,"","",null,"","",null,"","",null,"","",null,"","",null,"","",null,"","",null,"","",null,"",""]
["1295_2","coal",161,null,1295,"Quindaro","KS","Unit 2","2","Conventional Boiler","Wall firing - front firing",119.8,1394,11.636060100166945,"bituminous","bituminous",null,null,null,null,null,null,1.0333333333333333E-4,1.202392877017251E-3,1.0333333333333333E-4,1.202392877017251E-3,null,null,null,null,null,null,null,null,null,null,null,null,7.6333333333333331E-4,8.8821925431274342E-3,7.6333333333333331E-4,8.8821925431274342E-3,null,null,null,null,1.8705970143135936E-3,2.1766379281745823E-2,1.8705970143135936E-3,2.1766379281745823E-2,null,null,null,null,null,null,null,null,null,null,"PM control","Electrostatic precipitator, cold side, w/o flue gas conditioning","1986-05-01","","",null,"","",null,"","",null,"","",null,"","",null,"","",null,"","",null,"","",null,"","",null,"","",null,"",""]
["54304_1A","coal",162,null,54304,"Birchwood Power Facility","VA","1A","1A","Conventional Boiler","Tangential firing",222,2300,10.36036036036036,"bituminous","bituminous",3.008252543845007E-2,1.6572957778633705E-3,null,null,null,null,null,null,null,null,null,null,1.0000000000000001E-5,1.0360360360360361E-4,null,null,1.0000000000000001E-5,1.0360360360360361E-4,null,null,8.6666666666666663E-4,8.9789789789789781E-3,null,null,8.6666666666666663E-4,8.9789789789789781E-3,null,null,6.3333333333333332E-5,6.5615615615615612E-4,null,null,6.3333333333333332E-5,6.5615615615615612E-4,null,null,null,null,null,null,null,null,null,null,"NOx control","Selective Catalytic Reduction","1996-10-01","SO2 control","Dry FGD - Spray Dryer","1996-10-01","PM control","Fabric Filter, reverse air","1996-10-01","","",null,"","",null,"","",null,"","",null,"","",null,"","",null,"","",null,"","",null,"",""]
["6147_2","coal",163,null,6147,"Monticello","TX","2","2","Conventional Boiler","Tangential firing",583,7000,12.006861063464838,"lignite","lignite",null,null,null,null,null,null,null,null,null,null,null,null,2.0066666666666665E-5,2.4093767867352774E-4,null,null,2.0066666666666665E-5,2.4093767867352774E-4,7.4885695641079518E-4,8.9914214320335611E-3,null,null,null,null,7.4885695641079518E-4,8.9914214320335611E-3,2.62945266753326E-3,3.1571472852028853E-2,null,null,null,null,2.62945266753326E-3,3.1571472852028853E-2,null,null,0.81611045859422093,9.798924888781384,null,null,null,null,0.81611045859422093,9.798924888781384,"NOx control","Selective Noncatalytic Reduction","2008-11-01","Other control","Activated carbon injection","2009-02-01","PM control","Fabric Filter, shake and deflate","1975-12-01","PM control","Electrostatic precipitator, cold side, w/ flue gas conditioning","1975-12-01","","",null,"","",null,"","",null,"","",null,"","",null,"","",null,"","",null,"",""]
["2554_4","coal",164,null,2554,"Dunkirk Generating Plant","NY","4","4","Conventional Boiler","Tangential firing",195,1836,9.4153846153846157,"subbituminous","subbituminous",null,null,null,null,null,null,null,null,null,null,null,null,1.0000000000000001E-5,9.4153846153846159E-5,null,null,1.0000000000000001E-5,9.4153846153846159E-5,9.6695665512505798E-4,9.1042688144082392E-3,null,null,null,null,9.6695665512505798E-4,9.1042688144082392E-3,7.6075091174513233E-4,7.1627624305849388E-3,null,null,null,null,7.6075091174513233E-4,7.1627624305849388E-3,null,null,0.40713586621785885,3.8333407711589174,null,null,null,null,0.40713586621785885,3.8333407711589174,"NOx control","Selective Noncatalytic Reduction",null,"Other control","Dry sorbent injection",null,"PM control","Fabric Filter, unspecified","2009-05-01","","",null,"","",null,"","",null,"","",null,"","",null,"","",null,"","",null,"","",null,"",""]
["564_2","coal",165,null,564,"Stanton Energy Center","FL","2 coal","2","Conventional Boiler","Wall firing - opposed firing",468,4286,9.1581196581196576,"coal - bituminous","bituminous",null,null,null,null,null,null,null,null,null,null,null,null,3.2299999999999999E-4,2.9580726495726491E-3,null,null,3.2299999999999999E-4,2.9580726495726491E-3,1.0494830346784402E-3,9.6112912107516966E-3,null,null,null,null,1.0494830346784402E-3,9.6112912107516966E-3,8.4724155504772576E-5,7.7591395404584453E-4,null,null,null,null,8.4724155504772576E-5,7.7591395404584453E-4,null,null,null,null,null,null,null,null,null,null,"NOx control","Selective Catalytic Reduction","1996-06-01","PM control","Electrostatic precipitator, cold side, w/o flue gas conditioning","1996-06-01","SO2 control","Wet FGD - Spray Type","1996-06-01","","",null,"","",null,"","",null,"","",null,"","",null,"","",null,"","",null,"","",null,"",""]
["883_8","coal",166,null,883,"Waukegan","IL","WK8CONFIG","8","Conventional Boiler","Tangential firing",383,3960.8919999999998,10.3417545691906,"subbituminous","subbituminous",8.3516515662814938E-4,3.8683845805789676E-3,null,null,null,null,null,null,null,null,null,null,1.8000000000000001E-4,1.8615158224543082E-3,null,null,1.8000000000000001E-4,1.8615158224543082E-3,9.4096590435598451E-4,9.7312384408260681E-3,null,null,null,null,9.4096590435598451E-4,9.7312384408260681E-3,4.1367415447754523E-4,4.2781165772242113E-3,null,null,null,null,4.1367415447754523E-4,4.2781165772242113E-3,0.56689999999999996,5.8627406652741509,null,null,null,null,null,null,0.56689999999999996,5.8627406652741509,"Other control","Activated carbon injection","2008-07-01","PM control","Electrostatic precipitator, cold side, w/o flue gas conditioning","1962-07-01","","",null,"","",null,"","",null,"","",null,"","",null,"","",null,"","",null,"","",null,"","",null,"",""]
["2718_ES-2","coal",167,null,2718,"G G Allen","NC","2-2009","ES-2","Conventional Boiler","Tangential firing",177,1509,8.5254237288135588,"bituminous","bituminous",8.0202288795340249E-2,7.0921644444932258E-3,null,null,null,null,null,null,null,null,null,null,6.3760000000000004E-6,5.4358101694915256E-5,null,null,6.3760000000000004E-6,5.4358101694915256E-5,1.1427290670382338E-3,9.7422495037327375E-3,null,null,null,null,1.1427290670382338E-3,9.7422495037327375E-3,4.1785089478686954E-4,3.5623559335219552E-3,null,null,null,null,4.1785089478686954E-4,3.5623559335219552E-3,null,null,0.11924514949161609,1.0166154270217438,null,null,null,null,0.11924514949161609,1.0166154270217438,"NOx control","Selective Noncatalytic Reduction","2007-04-01","PM control","Electrostatic precipitator, cold side, w/o flue gas conditioning","1988-10-01","SO2 control","Wet FGD - Spray Type","2009-02-01","","",null,"","",null,"","",null,"","",null,"","",null,"","",null,"","",null,"","",null,"",""]
["2554_1","coal",168,null,2554,"Dunkirk Generating Plant","NY","1","1","Conventional Boiler","Tangential firing",85,922.2,10.849411764705883,"subbituminous","subbituminous",null,null,null,null,null,null,null,null,null,null,null,null,1.0000000000000001E-5,1.0849411764705884E-4,null,null,1.0000000000000001E-5,1.0849411764705884E-4,9.1344548107051419E-4,9.9103461487438614E-3,null,null,null,null,9.1344548107051419E-4,9.9103461487438614E-3,1.2551246539340615E-3,1.3617364186564606E-2,null,null,null,null,1.2551246539340615E-3,1.3617364186564606E-2,null,null,0.40825745061659663,4.4293531877485339,null,null,null,null,0.40825745061659663,4.4293531877485339,"NOx control","Selective Noncatalytic Reduction",null,"Other control","Dry sorbent injection",null,"PM control","Fabric Filter, unspecified","2009-12-01","","",null,"","",null,"","",null,"","",null,"","",null,"","",null,"","",null,"","",null,"",""]
["3788_4","coal",169,null,3788,"Potomac River","VA","4","4","Conventional Boiler","Tangential firing",108,961,8.8981481481481488,"coal - bituminous","bituminous",null,null,null,null,null,null,null,null,null,null,null,null,null,null,null,null,null,null,null,null,null,null,1.1299999999999999E-3,1.0054907407407408E-2,1.1299999999999999E-3,1.0054907407407408E-2,null,null,null,null,9.810000000000001E-4,8.7290833333333352E-3,9.810000000000001E-4,8.7290833333333352E-3,null,null,null,null,null,null,0.27,2.4025000000000003,0.27,2.4025000000000003,"SO2 control","Dry FGD - Sorbent Injection","2006-05-01","PM control","Electrostatic precipitator, hot side, w/o flue gas conditioning","1978-10-01","PM control","Electrostatic precipitator, cold side, w/o flue gas conditioning","1956-02-01","","",null,"","",null,"","",null,"","",null,"","",null,"","",null,"","",null,"","",null,"",""]
["2718_ES-5","coal",170,null,2718,"G G Allen","NC","5-2009","ES-5","Conventional Boiler","Tangential firing",285.3,2705,9.4812478093235182,"bituminous","bituminous",8.0202288795340249E-2,7.0921644444932258E-3,null,null,null,null,null,null,null,null,null,null,6.3760000000000004E-6,6.0452436032246757E-5,null,null,6.3760000000000004E-6,6.0452436032246757E-5,1.1427290670382338E-3,1.0834497463506561E-2,null,null,null,null,1.1427290670382338E-3,1.0834497463506561E-2,4.1785089478686954E-4,3.9617478808218788E-3,null,null,null,null,4.1785089478686954E-4,3.9617478808218788E-3,null,null,0.11924514949161609,1.1305928123898406,null,null,null,null,0.11924514949161609,1.1305928123898406,"NOx control","Selective Noncatalytic Reduction","2008-05-01","PM control","Electrostatic precipitator, cold side, w/ flue gas conditioning","2000-06-01","SO2 control","Wet FGD - Spray Type","2009-03-01","","",null,"","",null,"","",null,"","",null,"","",null,"","",null,"","",null,"","",null,"",""]
["1374_1374","coal",171,null,1374,"Elmer Smith Station","KY","Unit001","1374","Conventional Boiler","Cyclone firing",153,1370,8.9542483660130721,"bituminous,  petroleum coke","bituminous,  petroleum coke",8.3227433340493009E-3,6.9574481089140147E-3,null,null,1.2799999999999999E-3,1.0617232845894263E-2,null,null,1.2799999999999999E-3,1.0617232845894263E-2,null,null,2.0999999999999999E-5,1.7418897637795275E-4,null,null,2.0999999999999999E-5,1.7418897637795275E-4,1.3368658253731819E-3,1.1088918556020072E-2,null,null,null,null,1.3368658253731819E-3,1.1088918556020072E-2,2.2122399806891031E-4,1.834989608279128E-3,null,null,null,null,2.2122399806891031E-4,1.834989608279128E-3,0.67907279778766672,5.6327140729879126,null,null,null,null,null,null,0.67907279778766672,5.6327140729879126,"NOx control","Selective Catalytic Reduction","2004-05-01","PM control","Electrostatic precipitator, cold side, w/o flue gas conditioning","1993-12-01","SO2 control","Wet FGD - Spray Type","1995-01-01","","",null,"","",null,"","",null,"","",null,"","",null,"","",null,"","",null,"","",null,"",""]
["1374_1374-2","coal",172,null,1374,"Elmer Smith Station","KY","Unit001","1374-2","Conventional Boiler","Tangential firing",291.5,2317,7.9485420240137223,"bituminous,  petroleum coke","bituminous,  petroleum coke",8.3227433340493009E-3,6.9574481089140147E-3,null,null,1.2799999999999999E-3,1.0617232845894263E-2,null,null,1.2799999999999999E-3,1.0617232845894263E-2,null,null,2.0999999999999999E-5,1.7418897637795275E-4,null,null,2.0999999999999999E-5,1.7418897637795275E-4,1.3368658253731819E-3,1.1088918556020072E-2,null,null,null,null,1.3368658253731819E-3,1.1088918556020072E-2,2.2122399806891031E-4,1.834989608279128E-3,null,null,null,null,2.2122399806891031E-4,1.834989608279128E-3,0.67907279778766672,5.6327140729879126,null,null,null,null,null,null,0.67907279778766672,5.6327140729879126,"NOx control","Selective Catalytic Reduction","2004-05-01","PM control","Electrostatic precipitator, cold side, w/o flue gas conditioning","1993-12-01","SO2 control","Wet FGD - Spray Type","1995-01-01","","",null,"","",null,"","",null,"","",null,"","",null,"","",null,"","",null,"","",null,"",""]
["2718_ES-1","coal",173,null,2718,"G G Allen","NC","1-2009","ES-1","Conventional Boiler","Tangential firing",176.2,1738,9.8637911464245178,"bituminous","bituminous",8.0202288795340249E-2,7.0921644444932258E-3,null,null,null,null,null,null,null,null,null,null,6.3760000000000004E-6,6.2891532349602732E-5,null,null,6.3760000000000004E-6,6.2891532349602732E-5,1.1427290670382338E-3,1.127164085421368E-2,null,null,null,null,1.1427290670382338E-3,1.127164085421368E-2,4.1785089478686954E-4,4.1215939565242866E-3,null,null,null,null,4.1785089478686954E-4,4.1215939565242866E-3,null,null,0.11924514949161609,1.1762092498094709,null,null,null,null,0.11924514949161609,1.1762092498094709,"NOx control","Selective Noncatalytic Reduction","2004-05-01","PM control","Electrostatic precipitator, cold side, w/o flue gas conditioning","1988-10-01","SO2 control","Wet FGD - Spray Type","2009-02-01","","",null,"","",null,"","",null,"","",null,"","",null,"","",null,"","",null,"","",null,"",""]
["4072_8","coal",174,null,4072,"Pulliam","WI","8","8","Conventional Boiler","Wall firing - rear firing",137.9,1510,10.949963741841914,"subbituminous","subbituminous",2.0726198863365952E-3,5.9691198205517092E-3,null,null,null,null,null,null,null,null,null,null,2.3133333333333331E-4,2.5330916122794293E-3,null,null,2.3133333333333331E-4,2.5330916122794293E-3,null,null,1.1820000000000001E-3,1.2942857142857145E-2,null,null,1.1820000000000001E-3,1.2942857142857145E-2,null,null,1.97E-3,2.1571428571428571E-2,null,null,1.97E-3,2.1571428571428571E-2,0.60706666666666675,6.6473579888808327,null,null,null,null,null,null,0.60706666666666675,6.6473579888808327,"Other control","Activated carbon injection",null,"PM control","Electrostatic precipitator, cold side, w/ flue gas conditioning","1964-12-01","","",null,"","",null,"","",null,"","",null,"","",null,"","",null,"","",null,"","",null,"","",null,"",""]
["10849_BLR1","coal",175,null,10849,"Silver Bay Power","MN","GEN1","BLR1","Conventional Boiler","Wall firing - front firing",45,371.91187187999998,8.2647082639999994,"subbituminous","subbituminous",9.2307692307692316E-3,4.2735042735042739E-3,null,null,null,null,null,null,null,null,null,null,2.8518798194666667E-5,2.3569954711880986E-4,null,null,2.8518798194666667E-5,2.3569954711880986E-4,null,null,1.6633023435666666E-3,1.3746708624405996E-2,null,null,1.6633023435666666E-3,1.3746708624405996E-2,null,null,7.5068237667666666E-4,6.2041708421588073E-3,null,null,7.5068237667666666E-4,6.2041708421588073E-3,0.44133333333333324,3.6474912471786656,null,null,null,null,0.33666666666666667,2.7824517822133332,0.33666666666666667,2.7824517822133332,"PM control","Fabric Filter, reverse air","1980-01-01","","",null,"","",null,"","",null,"","",null,"","",null,"","",null,"","",null,"","",null,"","",null,"","",null,"",""]
["861_1","coal",176,null,861,"Coffeen","IL","001","1","Conventional Boiler","Cyclone firing",360,3282,9.1166666666666671,"subbituminous","subbituminous",2.1605656912063332E-2,null,null,null,null,null,null,null,null,null,null,null,1.1233333333333333E-4,1.0241055555555555E-3,null,null,1.1233333333333333E-4,1.0241055555555555E-3,1.5179042339366552E-3,1.3838226932722507E-2,null,null,null,null,1.5179042339366552E-3,1.3838226932722507E-2,6.7535701803322652E-4,6.1570048144029155E-3,null,null,null,null,6.7535701803322652E-4,6.1570048144029155E-3,8.4666666666666692E-3,7.71877777777778E-2,null,null,null,null,null,null,8.4666666666666692E-3,7.71877777777778E-2,"NOx control","Selective Catalytic Reduction","2003-04-01","PM control","Electrostatic precipitator, cold side, w/ flue gas conditioning","1973-01-01","SO2 control","Wet FGD - Unspecified","2009-11-01","","",null,"","",null,"","",null,"","",null,"","",null,"","",null,"","",null,"","",null,"",""]
["3403_2","coal",177,null,3403,"Gallatin","TN","2","2","Conventional Boiler","Tangential firing",300,2750,9.1666666666666661,"subbituminous","subbituminous",9.1259639355096411E-3,7.7944785314426569E-3,null,null,null,null,null,null,null,null,null,null,2.8333333333333335E-6,2.5972222222222223E-5,null,null,2.8333333333333335E-6,2.5972222222222223E-5,1.5582137466406503E-3,1.4283626010872626E-2,null,null,null,null,1.5582137466406503E-3,1.4283626010872626E-2,9.0896453149256866E-4,8.332174872015213E-3,null,null,null,null,9.0896453149256866E-4,8.332174872015213E-3,null,null,0.59524106261296883,5.4563764072855472,null,null,null,null,0.59524106261296883,5.4563764072855472,"PM control","Electrostatic precipitator, cold side, w/o flue gas conditioning","1978-09-01","","",null,"","",null,"","",null,"","",null,"","",null,"","",null,"","",null,"","",null,"","",null,"","",null,"",""]
["492_7","coal",178,null,492,"Martin Drake","CO","Unit 7 - Coal","7","Conventional Boiler","Wall firing - front firing",141,1475,10.460992907801419,"subbituminous,  bituminous","subbituminous,  bituminous",null,null,null,null,null,null,null,null,null,null,null,null,null,null,null,null,null,null,null,null,null,null,1.4666666666666667E-3,1.5342789598108747E-2,1.4666666666666667E-3,1.5342789598108747E-2,null,null,null,null,8.7500000000000008E-3,9.1533687943262429E-2,8.7500000000000008E-3,9.1533687943262429E-2,null,null,null,null,null,null,null,null,null,null,"PM control","Fabric Filter, reverse air","1993-11-01","","",null,"","",null,"","",null,"","",null,"","",null,"","",null,"","",null,"","",null,"","",null,"","",null,"",""]
["10673_BLR B","coal",179,null,10673,"AES Hawaii","HI","002","BLR B","Fluidized bed firing","Fluidized bed firing",101.5,944.2,9.3024630541871929,"bituminous","bituminous",4.6501525922694152E-3,4.2779893927249908E-3,null,null,null,null,null,null,null,null,null,null,2.1592461289666669E-3,2.0086307339609134E-2,null,null,2.1592461289666669E-3,2.0086307339609134E-2,1.8274842302704016E-3,1.7000104534200131E-2,null,null,null,null,1.8274842302704016E-3,1.7000104534200131E-2,7.8953968300237194E-5,7.3446637309442333E-4,null,null,null,null,7.8953968300237194E-5,7.3446637309442333E-4,0.22503333333333334,2.0933642692939247,null,null,null,null,null,null,0.22503333333333334,2.0933642692939247,"NOx control","Selective Noncatalytic Reduction",null,"PM control","Fabric Filter, unspecified",null,"","",null,"","",null,"","",null,"","",null,"","",null,"","",null,"","",null,"","",null,"","",null,"",""]
["3788_1","coal",180,null,3788,"Potomac River","VA","1","1","Conventional Boiler","Tangential firing",93,970,10.43010752688172,"coal - bituminous","bituminous",null,null,null,null,null,null,null,null,null,null,null,null,null,null,null,null,null,null,null,null,null,null,1.81E-3,1.8878494623655914E-2,1.81E-3,1.8878494623655914E-2,null,null,null,null,4.3600000000000003E-4,4.5475268817204298E-3,4.3600000000000003E-4,4.5475268817204298E-3,null,null,null,null,null,null,null,null,null,null,"SO2 control","Dry FGD - Sorbent Injection","2006-05-01","PM control","Electrostatic precipitator, hot side, w/o flue gas conditioning","1978-10-01","PM control","Electrostatic precipitator, cold side, w/o flue gas conditioning","1949-10-01","","",null,"","",null,"","",null,"","",null,"","",null,"","",null,"","",null,"","",null,"",""]
["568_BHB3","coal",181,null,568,"Bridgeport Station","CT","BHSEMU3OS2-Coal","BHB3","Conventional Boiler","Tangential firing",403,4100,10.173697270471465,"subbituminous","subbituminous",8.1435141079192128E-3,8.1435141079192136E-4,null,null,null,null,null,null,null,null,null,null,3.9033333333333331E-5,3.9711331679073616E-4,null,null,3.9033333333333331E-5,3.9711331679073616E-4,1.8993322903989014E-3,1.9323231738549617E-2,null,null,null,null,1.8993322903989014E-3,1.9323231738549617E-2,2.1086374685983325E-4,2.1452639258692716E-3,null,null,null,null,2.1086374685983325E-4,2.1452639258692716E-3,null,null,0.18065583697492216,1.8379377955265035,null,null,null,null,0.18065583697492216,1.8379377955265035,"PM control","Electrostatic precipitator, cold side, w/o flue gas conditioning","1968-08-01","Other control","Activated carbon injection","2008-07-01","PM control","Fabric Filter, pulse","2008-01-01","","",null,"","",null,"","",null,"","",null,"","",null,"","",null,"","",null,"","",null,"",""]
["6098_001","coal",182,null,6098,"Big Stone","SD","001","001","Conventional Boiler","Cyclone firing",495,5309,10.725252525252525,"subbituminous","subbituminous",null,null,null,null,null,null,null,null,null,null,null,null,null,null,null,null,null,null,null,null,null,null,1.8333333333333333E-3,1.9662962962962962E-2,1.8333333333333333E-3,1.9662962962962962E-2,null,null,null,null,5.6999999999999998E-4,6.1133939393939393E-3,5.6999999999999998E-4,6.1133939393939393E-3,null,null,null,null,null,null,null,null,null,null,"PM control","Fabric Filter, pulse","2007-12-01","","",null,"","",null,"","",null,"","",null,"","",null,"","",null,"","",null,"","",null,"","",null,"","",null,"",""]
["492_5","coal",183,null,492,"Martin Drake","CO","Unit 5 - Coal","5","Conventional Boiler","Wall firing - front firing",55,570,10.363636363636363,"subbituminous","subbituminous",null,null,null,null,null,null,null,null,null,null,null,null,null,null,null,null,null,null,null,null,null,null,2.0300000000000001E-3,2.103818181818182E-2,2.0300000000000001E-3,2.103818181818182E-2,null,null,null,null,3.14E-3,3.2541818181818179E-2,3.14E-3,3.2541818181818179E-2,null,null,null,null,null,null,null,null,null,null,"PM control","Fabric Filter, reverse air","1998-05-01","","",null,"","",null,"","",null,"","",null,"","",null,"","",null,"","",null,"","",null,"","",null,"","",null,"",""]
["54081_1A","coal",184,null,54081,"Spruance Genco, LLC","VA","GEN1","1A","Conventional Boiler","Stoker - underfeed",28.7,375,13.066202090592334,"bituminous","bituminous",9.6443636607524738E-2,4.4129975399763424E-3,null,null,null,null,null,null,null,null,null,null,3.0435377060300002E-5,3.9767478737325784E-4,null,null,3.0435377060300002E-5,3.9767478737325784E-4,1.7743382064989756E-3,2.3183861583174765E-2,null,null,null,null,1.7743382064989756E-3,2.3183861583174765E-2,4.6584198450334053E-5,6.0867855118032293E-4,null,null,null,null,4.6584198450334053E-5,6.0867855118032293E-4,null,null,5.1563358287846174E-2,0.67373725985861721,null,null,null,null,5.1563358287846174E-2,0.67373725985861721,"SO2 control","Dry FGD - Spray Dryer","1992-05-01","SO2 control","Dry FGD - Spray Dryer","1992-05-01","PM control","Fabric Filter, pulse","1992-05-01","PM control","Fabric Filter, pulse","1992-05-01","","",null,"","",null,"","",null,"","",null,"","",null,"","",null,"","",null,"",""]
["54081_1B","coal",185,null,54081,"Spruance Genco, LLC","VA","GEN1","1B","Conventional Boiler","Stoker - underfeed",28.7,375,13.066202090592334,"bituminous","bituminous",9.6443636607524738E-2,4.4129975399763424E-3,null,null,null,null,null,null,null,null,null,null,3.0435377060300002E-5,3.9767478737325784E-4,null,null,3.0435377060300002E-5,3.9767478737325784E-4,1.7743382064989756E-3,2.3183861583174765E-2,null,null,null,null,1.7743382064989756E-3,2.3183861583174765E-2,4.6584198450334053E-5,6.0867855118032293E-4,null,null,null,null,4.6584198450334053E-5,6.0867855118032293E-4,null,null,5.1563358287846174E-2,0.67373725985861721,null,null,null,null,5.1563358287846174E-2,0.67373725985861721,"SO2 control","Dry FGD - Spray Dryer","1992-05-01","SO2 control","Dry FGD - Spray Dryer","1992-05-01","PM control","Fabric Filter, pulse","1992-05-01","PM control","Fabric Filter, pulse","1992-05-01","","",null,"","",null,"","",null,"","",null,"","",null,"","",null,"","",null,"",""]
["1626_1","coal",186,null,1626,"Salem Harbor","MA","Unit 1","1","Conventional Boiler","Wall firing - front firing",81.418999999999997,981,12.0487846817082,"bituminous","bituminous",1.6769230769230769E-3,2.9538461538461537E-3,null,null,null,null,null,null,null,null,null,null,5.5928681466000003E-3,6.7387264051567822E-2,null,null,5.5928681466000003E-3,6.7387264051567822E-2,2.0395907008995099E-3,2.4574589193952508E-2,null,null,null,null,2.0395907008995099E-3,2.4574589193952508E-2,1.9641167913845184E-3,2.3665220309119647E-2,null,null,null,null,1.9641167913845184E-3,2.3665220309119647E-2,null,null,0.76237860451432604,9.1857356517342854,null,null,null,null,0.76237860451432604,9.1857356517342854,"NOx control","Selective Noncatalytic Reduction","1993-08-01","PM control","Electrostatic precipitator, cold side, w/o flue gas conditioning","1984-07-01","","",null,"","",null,"","",null,"","",null,"","",null,"","",null,"","",null,"","",null,"","",null,"",""]
["1393_6","coal",187,null,1393,"RS Nelson","LA","001","6","Conventional Boiler","Tangential firing",580,5761,9.9327586206896559,"bituminous","bituminous",1.0387055731348679E-3,5.079751795651382E-3,null,null,null,null,null,null,null,null,null,null,1.2866666666666666E-4,1.2780149425287357E-3,null,null,1.2866666666666666E-4,1.2780149425287357E-3,null,null,2.5800000000000003E-3,2.5626517241379314E-2,null,null,2.5800000000000003E-3,2.5626517241379314E-2,null,null,1.0496666666666666E-3,1.0426085632183909E-2,null,null,1.0496666666666666E-3,1.0426085632183909E-2,null,null,0.64056246334668954,6.3625523298970323,null,null,null,null,0.64056246334668954,6.3625523298970323,"PM control","Electrostatic precipitator, unspecified","1982-05-01","","",null,"","",null,"","",null,"","",null,"","",null,"","",null,"","",null,"","",null,"","",null,"","",null,"",""]
["3845_BD21","coal",188,null,3845,"TransAlta Centralia Generation","WA","BW21CONFIG","BD21","Conventional Boiler","Tangential firing",603,7743,12.840796019900498,"subbituminous","subbituminous",4.9169372400276251E-3,8.5167258054706495E-3,null,null,null,null,null,null,null,null,null,null,2.0099999999999997E-5,2.5809999999999999E-4,null,null,2.0099999999999997E-5,2.5809999999999999E-4,2.1217898335917397E-3,2.724547045025015E-2,null,null,null,null,2.1217898335917397E-3,2.724547045025015E-2,2.1765888861523348E-3,2.7949133906264561E-2,null,null,null,null,2.1765888861523348E-3,2.7949133906264561E-2,5.7066666666666675E-2,0.73278142620232189,null,null,null,null,2.1299999999999999E-2,0.27350895522388058,2.1299999999999999E-2,0.27350895522388058,"PM control","Electrostatic precipitator, hot side, w/o flue gas conditioning","1972-01-01","SO2 control","Wet FGD - Spray Type","2002-06-01","","",null,"","",null,"","",null,"","",null,"","",null,"","",null,"","",null,"","",null,"","",null,"",""]
["10673_BLR A","coal",189,null,10673,"AES Hawaii","HI","001","BLR A","Fluidized bed firing","Fluidized bed firing",101.5,1021.4,10.063054187192119,"bituminous","bituminous",5.5140465067110627E-3,5.1881468016616236E-3,null,null,null,null,null,null,null,null,null,null,1.9472161452333333E-3,1.959494158365839E-2,null,null,1.9472161452333333E-3,1.959494158365839E-2,2.8947442146795023E-3,2.9129967890380727E-2,null,null,null,null,2.8947442146795023E-3,2.9129967890380727E-2,6.2111264427120569E-5,6.2502901956513254E-4,null,null,null,null,6.2111264427120569E-5,6.2502901956513254E-4,0.22333333333333338,2.2474154351395739,null,null,null,null,null,null,0.22333333333333338,2.2474154351395739,"NOx control","Selective Noncatalytic Reduction",null,"PM control","Fabric Filter, unspecified",null,"","",null,"","",null,"","",null,"","",null,"","",null,"","",null,"","",null,"","",null,"","",null,"",""]
["3845_BD22","coal",190,null,3845,"TransAlta Centralia Generation","WA","BW22CONFIG","BD22","Conventional Boiler","Tangential firing",567,7743,13.656084656084657,"subbituminous","subbituminous",3.76957002520527E-3,5.3979297552297217E-3,null,null,null,null,null,null,null,null,null,null,2.1833333333333337E-5,2.9815784832451503E-4,null,null,2.1833333333333337E-5,2.9815784832451503E-4,2.2945784847301968E-3,3.1334958037506022E-2,null,null,null,null,2.2945784847301968E-3,3.1334958037506022E-2,2.2945784847301968E-3,3.1334958037506022E-2,null,null,null,null,2.2945784847301968E-3,3.1334958037506022E-2,5.2499999999999984E-2,0.71694444444444427,null,null,null,null,2.3333333333333334E-2,0.31864197530864202,2.3333333333333334E-2,0.31864197530864202,"PM control","Electrostatic precipitator, hot side, w/o flue gas conditioning","1971-12-01","SO2 control","Wet FGD - Spray Type","2001-10-01","","",null,"","",null,"","",null,"","",null,"","",null,"","",null,"","",null,"","",null,"","",null,"",""]
["645_1","coal",191,null,645,"Big Bend","FL","BB01_pre-SCR","1","Conventional Boiler","Wall firing - opposed firing",410,4037,9.8463414634146336,"bituminous","bituminous",0.14548238897396631,5.206738131699847E-3,null,null,null,null,null,null,null,null,null,null,3.0061854789999998E-2,0.29599928728592678,null,null,3.0061854789999998E-2,0.29599928728592678,3.7890135828660605E-3,3.730792154641533E-2,null,null,null,null,3.7890135828660605E-3,3.730792154641533E-2,8.980537012222654E-5,8.8425433947177687E-4,null,null,null,null,8.980537012222654E-5,8.8425433947177687E-4,null,null,null,null,null,null,8.2901143425934784E-2,0.81627296587926512,8.2901143425934784E-2,0.81627296587926512,"PM control","Electrostatic precipitator, hot side, w/o flue gas conditioning","1970-10-01","SO2 control","Wet FGD - Packed Type","1999-12-01","","",null,"","",null,"","",null,"","",null,"","",null,"","",null,"","",null,"","",null,"","",null,"",""]
["8223_4","coal",192,null,8223,"Springerville","AZ","4","4","Conventional Boiler","Wall firing - opposed firing",450,4200,9.3333333333333339,"bituminous","bituminous",8.9645789729171903E-4,4.9465236836650382E-3,null,null,null,null,null,null,null,null,null,null,5.9566666666666665E-4,5.5595555555555554E-3,null,null,5.9566666666666665E-4,5.5595555555555554E-3,null,null,4.6461666666666665E-3,4.3364222222222221E-2,null,null,4.6461666666666665E-3,4.3364222222222221E-2,null,null,2.52E-4,2.3520000000000004E-3,1E-4,9.3333333333333343E-4,1E-4,9.3333333333333343E-4,6.9233333333333327E-2,0.64617777777777774,null,null,null,null,null,null,6.9233333333333327E-2,0.64617777777777774,"NOx control","Selective Catalytic Reduction","2009-12-01","SO2 control","Dry FGD - Spray Dryer","2009-12-01","PM control","Fabric Filter, pulse","2009-12-01","","",null,"","",null,"","",null,"","",null,"","",null,"","",null,"","",null,"","",null,"",""]
[{"$f":"E194&\"_\"&I194","v":"10671_1A"},"coal",193,null,10671,"AES Shady Point,LLC","OK","Unit 1","1A","Fluidized bed firing","Fluidized bed firing",80,1110.4350359049981,13.880437948812476,"bituminous,  subbituminous","bituminous,  subbituminous",8.4538013382373656E-3,6.0327836282351825E-3,null,null,null,null,null,null,null,null,null,null,1.9035298568666665E-3,2.6421828061949659E-2,null,null,1.9035298568666665E-3,2.6421828061949659E-2,3.2649929640079199E-3,4.5319532240221262E-2,null,null,null,null,3.2649929640079199E-3,4.5319532240221262E-2,2.0346332740433411E-4,2.8241600908947766E-3,null,null,null,null,2.0346332740433411E-4,2.8241600908947766E-3,0.34833333333333338,4.8350192188363463,null,null,null,null,null,null,0.34833333333333338,4.8350192188363463,"PM control","Fabric Filter, pulse","1991-01-01","","",null,"","",null,"","",null,"","",null,"","",null,"","",null,"","",null,"","",null,"","",null,"","",null,"",""]
["10671_1b","coal",194,null,10671,"AES Shady Point,LLC","OK","Unit 1","1b","Fluidized bed firing","Fluidized bed firing",80,1110.4350359049981,13.880437948812476,"bituminous,  subbituminous","bituminous,  subbituminous",8.4538013382373656E-3,6.0327836282351825E-3,null,null,null,null,null,null,null,null,null,null,1.9035298568666665E-3,2.6421828061949659E-2,null,null,1.9035298568666665E-3,2.6421828061949659E-2,3.2649929640079199E-3,4.5319532240221262E-2,null,null,null,null,3.2649929640079199E-3,4.5319532240221262E-2,2.0346332740433411E-4,2.8241600908947766E-3,null,null,null,null,2.0346332740433411E-4,2.8241600908947766E-3,0.34833333333333338,4.8350192188363463,null,null,null,null,null,null,0.34833333333333338,4.8350192188363463,"PM control","Fabric Filter, pulse","1991-01-01","","",null,"","",null,"","",null,"","",null,"","",null,"","",null,"","",null,"","",null,"","",null,"","",null,"",""]
["10671_2a","coal",195,null,10671,"AES Shady Point,LLC","OK","Unit 2","2a","Fluidized bed firing","Fluidized bed firing",80,1110.4350359049981,13.880437948812476,"bituminous,  subbituminous","bituminous,  subbituminous",8.4538013382373656E-3,6.0327836282351825E-3,null,null,null,null,null,null,null,null,null,null,1.9035298568666665E-3,2.6421828061949659E-2,null,null,1.9035298568666665E-3,2.6421828061949659E-2,3.2649929640079199E-3,4.5319532240221262E-2,null,null,null,null,3.2649929640079199E-3,4.5319532240221262E-2,2.0346332740433411E-4,2.8241600908947766E-3,null,null,null,null,2.0346332740433411E-4,2.8241600908947766E-3,0.34833333333333338,4.8350192188363463,null,null,null,null,null,null,0.34833333333333338,4.8350192188363463,"PM control","Fabric Filter, pulse","1991-01-01","","",null,"","",null,"","",null,"","",null,"","",null,"","",null,"","",null,"","",null,"","",null,"","",null,"",""]
["10671_2b","coal",196,null,10671,"AES Shady Point,LLC","OK","Unit 2","2b","Fluidized bed firing","Fluidized bed firing",80,1110.4350359049981,13.880437948812476,"bituminous,  subbituminous","bituminous,  subbituminous",8.4538013382373656E-3,6.0327836282351825E-3,null,null,null,null,null,null,null,null,null,null,1.9035298568666665E-3,2.6421828061949659E-2,null,null,1.9035298568666665E-3,2.6421828061949659E-2,3.2649929640079199E-3,4.5319532240221262E-2,null,null,null,null,3.2649929640079199E-3,4.5319532240221262E-2,2.0346332740433411E-4,2.8241600908947766E-3,null,null,null,null,2.0346332740433411E-4,2.8241600908947766E-3,0.34833333333333338,4.8350192188363463,null,null,null,null,null,null,0.34833333333333338,4.8350192188363463,"PM control","Fabric Filter, pulse","1991-01-01","","",null,"","",null,"","",null,"","",null,"","",null,"","",null,"","",null,"","",null,"","",null,"","",null,"",""]
["645_2","coal",197,null,645,"Big Bend","FL","BB02_SCR","2","Conventional Boiler","Wall firing - opposed firing",410,3996,9.7463414634146339,"bituminous","bituminous",0.13792117190023434,5.5617392382493486E-3,null,null,null,null,null,null,null,null,3.5805768665622994E-5,3.4897524777519387E-4,null,null,null,null,3.5805768665622994E-5,3.4897524777519387E-4,6.3387839815559005E-3,6.1779953147066774E-2,null,null,null,null,6.3387839815559005E-3,6.1779953147066774E-2,9.1701943319339439E-5,8.9375845244897654E-4,null,null,null,null,9.1701943319339439E-5,8.9375845244897654E-4,null,null,null,null,null,null,null,null,null,null,"NOx control","Selective Catalytic Reduction","2009-05-01","PM control","Electrostatic precipitator, hot side, w/o flue gas conditioning","1973-04-01","SO2 control","Wet FGD - Packed Type","1999-12-01","","",null,"","",null,"","",null,"","",null,"","",null,"","",null,"","",null,"","",null,"",""]
["2324_1","coal",198,null,2324,"Reid Gardner","NV","1","1","Conventional Boiler","Wall firing - front firing",111,1215,10.945945945945946,"bituminous","bituminous",2.3897108930116574E-2,8.1768639459506888E-3,null,null,null,null,null,null,null,null,null,null,7.1299999999999998E-4,7.8044594594594589E-3,null,null,7.1299999999999998E-4,7.8044594594594589E-3,5.7130599223756658E-3,6.2534845096274175E-2,null,null,null,null,5.7130599223756658E-3,6.2534845096274175E-2,5.278492540079625E-4,5.7778094019790491E-3,null,null,null,null,5.278492540079625E-4,5.7778094019790491E-3,null,null,6.2147118518731483E-2,0.68025900000233108,null,null,5.5E-2,0.60202702702702704,5.5E-2,0.60202702702702704,"PM control","Fabric Filter, pulse","2008-12-01","SO2 control","Wet FGD - Venturi Type","1976-07-01","","",null,"","",null,"","",null,"","",null,"","",null,"","",null,"","",null,"","",null,"","",null,"",""]
["1040_2","coal",199,null,1040,"Whitewater Valley","IN","002","2","Conventional Boiler","Tangential firing",69,730,10.579710144927537,"bituminous","bituminous",1.6841251314387084E-2,4.2451739069129376E-3,null,null,null,null,null,null,null,null,null,null,2.6233333333333328E-5,2.7754106280193235E-4,null,null,2.6233333333333328E-5,2.7754106280193235E-4,7.2621967220610996E-3,7.6831936334849318E-2,null,null,null,null,7.2621967220610996E-3,7.6831936334849318E-2,4.6958706567151263E-3,4.968095042611656E-2,null,null,null,null,4.6958706567151263E-3,4.968095042611656E-2,null,null,3.5480306058049607,37.537135394748134,null,null,null,null,3.5480306058049607,37.537135394748134,"NOx control","Selective Noncatalytic Reduction","2003-09-01","PM control","Electrostatic precipitator, unspecified","1973-05-16","PM control","Fabric Filter, unspecified","2009-01-06","","",null,"","",null,"","",null,"","",null,"","",null,"","",null,"","",null,"","",null,"",""]
["6085_14","coal",200,null,6085,"R.M. Schahfer","IN","R.M.0014","14","Conventional Boiler","Cyclone firing",468,4650,9.9358974358974361,"subbituminous","subbituminous",2.1805427177586895E-2,null,null,null,null,null,null,null,null,null,null,null,1.022E-4,1.015448717948718E-3,null,null,1.022E-4,1.015448717948718E-3,7.8754083590615084E-3,7.824924972144448E-2,null,null,null,null,7.8754083590615084E-3,7.824924972144448E-2,1.8983695350321135E-3,1.8862004995511383E-2,null,null,null,null,1.8983695350321135E-3,1.8862004995511383E-2,null,null,0.81867597602959463,8.1342805310632809,null,null,null,null,0.81867597602959463,8.1342805310632809,"NOx control","Selective Catalytic Reduction","2004-05-01","PM control","Electrostatic precipitator, cold side, w/o flue gas conditioning","1990-06-01","","",null,"","",null,"","",null,"","",null,"","",null,"","",null,"","",null,"","",null,"","",null,"",""]
["7253_3","coal",201,null,7253,"Richard Gorsuch","OH","UNIT3","3","Conventional Boiler","Radiant",53.3,553,10.375234521575985,"bituminous","bituminous",5.9422939778196494E-2,5.9241664892163287E-3,null,null,null,null,null,null,null,null,null,null,9.3333333333333343E-5,9.6835522201375868E-4,null,null,9.3333333333333343E-5,9.6835522201375868E-4,7.7709889049627249E-3,8.0625832353553223E-2,null,null,null,null,7.7709889049627249E-3,8.0625832353553223E-2,4.3407734481139465E-2,0.45036542529212242,null,null,null,null,4.3407734481139465E-2,0.45036542529212242,null,null,2.6829163240311966,27.835886063588212,null,null,null,null,2.6829163240311966,27.835886063588212,"PM control","Electrostatic precipitator, hot side, w/o flue gas conditioning","1972-06-01","","",null,"","",null,"","",null,"","",null,"","",null,"","",null,"","",null,"","",null,"","",null,"","",null,"",""]
["465_4","coal",202,null,465,"Arapahoe","CO","Unit 4","4","Conventional Boiler","Vertical firing",118,1709.4,14.486440677966103,"subbituminous","subbituminous",2.7021289079159306E-3,5.6381894117581467E-3,null,null,null,null,null,null,null,null,null,null,3.7732500000000007E-6,5.4660962288135604E-5,null,null,3.7732500000000007E-6,5.4660962288135604E-5,6.150235576976238E-3,8.9095022841382904E-2,null,null,null,null,6.150235576976238E-3,8.9095022841382904E-2,6.2002099687003594E-4,8.9818973902511829E-3,null,null,null,null,6.2002099687003594E-4,8.9818973902511829E-3,0.38799999999999996,5.6207389830508472,null,null,0.3697593387425,5.3564967258171992,null,null,0.3697593387425,5.3564967258171992,"SO2 control","Dry FGD - Sorbent Injection","1993-06-01","PM control","Fabric Filter, reverse air","1985-04-01","","",null,"","",null,"","",null,"","",null,"","",null,"","",null,"","",null,"","",null,"","",null,"",""]
["2848_H-5","coal",203,null,2848,"O H Hutchings","OH","H-5","H-5","Conventional Boiler","Tangential firing",63,641,10.174603174603174,"coal - bituminous","bituminous",null,null,null,null,null,null,null,null,null,null,null,null,null,null,null,null,null,null,null,null,null,null,9.0000000000000011E-3,9.1571428571428581E-2,9.0000000000000011E-3,9.1571428571428581E-2,null,null,null,null,null,null,null,null,null,null,null,null,null,null,1.0933333333333333,11.124232804232802,1.0933333333333333,11.124232804232802,"PM control","Electrostatic precipitator, hot side, w/o flue gas conditioning","1973-01-01","","",null,"","",null,"","",null,"","",null,"","",null,"","",null,"","",null,"","",null,"","",null,"","",null,"",""]
["8102_2","coal",204,null,8102,"General James M. Gavin","OH","GA-2","2","Conventional Boiler","Wall firing - opposed firing",1320,11936,9.0424242424242429,"bituminous","bituminous",3.6173875939497564E-2,6.6350579250705781E-3,null,null,null,null,null,null,null,null,null,null,2.0000000000000001E-4,1.8084848484848487E-3,null,null,2.0000000000000001E-4,1.8084848484848487E-3,1.1176762718697377E-2,0.10106503015937265,null,null,null,null,1.1176762718697377E-2,0.10106503015937265,7.4511751457982514E-2,0.67376686772915106,null,null,null,null,7.4511751457982514E-2,0.67376686772915106,0.26869230769230767,2.4296298368298368,null,null,null,null,null,null,0.26869230769230767,2.4296298368298368,"NOx control","Selective Catalytic Reduction","2000-01-01","Other control","Dry sorbent injection","2001-01-01","PM control","Electrostatic precipitator, cold side, w/o flue gas conditioning","1975-03-01","SO2 control","Wet FGD - Spray Type","1995-03-01","","",null,"","",null,"","",null,"","",null,"","",null,"","",null,"","",null,"",""]
["8102_1","coal",205,null,8102,"General James M. Gavin","OH","GA-1","1","Conventional Boiler","Wall firing - opposed firing",1320,11936,9.0424242424242429,"bituminous","bituminous",3.1068366431028348E-2,6.654266700247896E-3,null,null,null,null,null,null,null,null,null,null,2.0000000000000001E-4,1.8084848484848487E-3,null,null,2.0000000000000001E-4,1.8084848484848487E-3,1.1537044229893059E-2,0.10432284843030573,null,null,null,null,1.1537044229893059E-2,0.10432284843030573,7.6913628199287057E-2,0.69548565620203817,null,null,null,null,7.6913628199287057E-2,0.69548565620203817,0.29073333333333334,2.6289341414141418,null,null,null,null,null,null,0.29073333333333334,2.6289341414141418,"NOx control","Selective Catalytic Reduction","2000-01-01","Other control","Dry sorbent injection","2001-01-01","PM control","Electrostatic precipitator, cold side, w/o flue gas conditioning","1974-04-01","SO2 control","Wet FGD - Spray Type","1994-12-01","","",null,"","",null,"","",null,"","",null,"","",null,"","",null,"","",null,"",""]
["3948_2","coal",206,null,3948,"Mitchell","WV","MI-2","2","Conventional Boiler","Wall firing - opposed firing",816.3,7020,8.5997794928335178,"bituminous","bituminous",7.5256738528541423E-2,6.5234467221858281E-3,null,null,null,null,null,null,null,null,null,null,2.0399999999999997E-4,1.7543550165380374E-3,null,null,2.0399999999999997E-4,1.7543550165380374E-3,1.2260418741654259E-2,0.10543689766803002,null,null,null,null,1.2260418741654259E-2,0.10543689766803002,8.1736124944361711E-3,7.0291265112019996E-2,null,null,null,null,8.1736124944361711E-3,7.0291265112019996E-2,7.506666666666667E-2,0.64555678059536947,null,null,null,null,null,null,7.506666666666667E-2,0.64555678059536947,"NOx control","Selective Catalytic Reduction","2007-01-01","PM control","Electrostatic precipitator, cold side, w/o flue gas conditioning","1978-08-01","SO2 control","Wet FGD - Tray Type","2007-01-01","","",null,"","",null,"","",null,"","",null,"","",null,"","",null,"","",null,"","",null,"",""]
["7210_COP1","coal",207,null,7210,"Cope","SC","COP001","COP1","Conventional Boiler","Tangential firing",441,4059.1,9.2043083900226748,"bituminous","bituminous",6.6539030582968214E-2,5.6809255645088944E-3,null,null,null,null,null,null,null,null,null,null,9.0521355936999985E-4,8.3318647592715775E-3,null,null,9.0521355936999985E-4,8.3318647592715775E-3,null,null,1.1766666666666667E-2,0.10830402872260014,null,null,1.1766666666666667E-2,0.10830402872260014,null,null,6.1966666666666663E-3,5.703603099017384E-2,null,null,6.1966666666666663E-3,5.703603099017384E-2,null,null,null,null,null,null,null,null,null,null,"NOx control","Selective Catalytic Reduction","2009-01-01","SO2 control","Dry FGD - Spray Dryer","1993-04-01","PM control","Fabric Filter, unspecified","1993-04-01","","",null,"","",null,"","",null,"","",null,"","",null,"","",null,"","",null,"","",null,"",""]
["3948_1","coal",208,null,3948,"Mitchell","WV","MI-1","1","Conventional Boiler","Wall firing - opposed firing",816.3,7020,8.5997794928335178,"bituminous","bituminous",7.772759232722716E-2,6.6511968786655109E-3,null,null,null,null,null,null,null,null,null,null,2.1933333333333332E-4,1.8862183020948182E-3,null,null,2.1933333333333332E-4,1.8862183020948182E-3,1.311690448170604E-2,0.11280248617123166,null,null,null,null,1.311690448170604E-2,0.11280248617123166,1.9869749961286751E-2,0.17087546824480337,null,null,null,null,1.9869749961286751E-2,0.17087546824480337,6.1299999999999993E-2,0.52716648291069457,null,null,null,null,null,null,6.1299999999999993E-2,0.52716648291069457,"NOx control","Selective Catalytic Reduction","2007-01-01","PM control","Electrostatic precipitator, cold side, w/o flue gas conditioning","1977-02-01","SO2 control","Wet FGD - Tray Type","2007-01-01","","",null,"","",null,"","",null,"","",null,"","",null,"","",null,"","",null,"","",null,"",""]
["1010_6","coal",209,null,1010,"Wabash River","IN","6","6","Conventional Boiler","Tangential firing",342,3059.0605,8.9446213450292404,"bituminous","bituminous",4.3129195892927914E-2,3.7290537154030454E-3,null,null,null,null,null,null,null,null,null,null,2.2400000000000002E-5,2.0035951812865499E-4,null,null,2.2400000000000002E-5,2.0035951812865499E-4,1.2675252967989869E-2,0.11337533825112742,null,null,null,null,1.2675252967989869E-2,0.11337533825112742,4.6267308972868836E-3,4.1384355941578549E-2,null,null,null,null,4.6267308972868836E-3,4.1384355941578549E-2,null,null,3.6619959569548564,32.755167201989188,null,null,null,null,3.6619959569548564,32.755167201989188,"PM control","Electrostatic precipitator, cold side, w/o flue gas conditioning","1993-05-01","","",null,"","",null,"","",null,"","",null,"","",null,"","",null,"","",null,"","",null,"","",null,"","",null,"",""]
["10743_CFB1","coal",210,null,10743,"Morgantown Energy Facility","WV","Unit 1&2","CFB1","Fluidized bed firing","Fluidized bed firing",29,457,15.758620689655173,"bituminous","bituminous",1.2125649730118319E-2,1.6005895955373783E-2,null,null,null,null,null,null,null,null,null,null,1.5299999999999999E-3,2.4005172413793102E-2,null,null,1.5299999999999999E-3,2.4005172413793102E-2,7.274912830340108E-3,0.11414087371740515,7.3000000000000001E-3,0.1145344827586207,null,null,7.274912830340108E-3,0.11414087371740515,5.2412156487076199E-5,8.2232866212481623E-4,5.2633333333333336E-5,8.2579885057471275E-4,null,null,5.2412156487076199E-5,8.2232866212481623E-4,null,null,0.29464176906827866,4.6228277560712687,null,null,null,null,0.29464176906827866,4.6228277560712687,"PM control","Fabric Filter, pulse","1992-01-01","PM control","Fabric Filter, pulse","1992-01-01","","",null,"","",null,"","",null,"","",null,"","",null,"","",null,"","",null,"","",null,"","",null,"",""]
["10743_CFB2","coal",211,null,10743,"Morgantown Energy Facility","WV","Unit 1&2","CFB2","Fluidized bed firing","Fluidized bed firing",29,453,15.620689655172415,"bituminous","bituminous",1.2125649730118319E-2,1.6005895955373783E-2,null,null,null,null,null,null,null,null,null,null,1.5299999999999999E-3,2.4005172413793102E-2,null,null,1.5299999999999999E-3,2.4005172413793102E-2,7.274912830340108E-3,0.11414087371740515,7.3000000000000001E-3,0.1145344827586207,null,null,7.274912830340108E-3,0.11414087371740515,5.2412156487076199E-5,8.2232866212481623E-4,5.2633333333333336E-5,8.2579885057471275E-4,null,null,5.2412156487076199E-5,8.2232866212481623E-4,null,null,0.29464176906827866,4.6228277560712687,null,null,null,null,0.29464176906827866,4.6228277560712687,"PM control","Fabric Filter, pulse","1992-01-01","PM control","Fabric Filter, pulse","1992-01-01","","",null,"","",null,"","",null,"","",null,"","",null,"","",null,"","",null,"","",null,"","",null,"",""]
["1010_4","coal",212,null,1010,"Wabash River","IN","4","4","Conventional Boiler","Wall firing - front firing",90,923.69500000000005,10.263277777777779,"bituminous","bituminous",4.3129195892927914E-2,3.7290537154030454E-3,null,null,null,null,null,null,null,null,null,null,2.2400000000000002E-5,2.2989742222222226E-4,null,null,2.2400000000000002E-5,2.2989742222222226E-4,1.2675252967989869E-2,0.13008964211408225,null,null,null,null,1.2675252967989869E-2,0.13008964211408225,4.6267308972868836E-3,4.7485424401882317E-2,null,null,null,null,4.6267308972868836E-3,4.7485424401882317E-2,null,null,3.6619959569548564,37.584081727326847,null,null,null,null,3.6619959569548564,37.584081727326847,"PM control","Electrostatic precipitator, cold side, w/o flue gas conditioning","1993-10-01","","",null,"","",null,"","",null,"","",null,"","",null,"","",null,"","",null,"","",null,"","",null,"","",null,"",""]
["963_31","coal",213,null,963,"Dallman","IL","31","31","Conventional Boiler","Cyclone firing",90,962.12,10.690222222222221,"bituminous","bituminous",0.12999407762594586,4.3065842440843062E-3,null,null,null,null,null,null,null,null,null,null,2.0966666666666668E-4,2.241383259259259E-3,null,null,2.0966666666666668E-4,2.241383259259259E-3,null,null,1.2589666666666666E-2,0.13458633437037035,null,null,1.2589666666666666E-2,0.13458633437037035,null,null,5.6088666666666669E-2,0.5996003108148148,null,null,5.6088666666666669E-2,0.5996003108148148,0.1821666666666667,1.9474021481481483,null,null,null,null,null,null,0.1821666666666667,1.9474021481481483,"NOx control","Selective Catalytic Reduction","2003-05-01","PM control","Electrostatic precipitator, cold side, w/o flue gas conditioning","1968-06-01","SO2 control","Wet FGD - Packed Type","2001-08-01","","",null,"","",null,"","",null,"","",null,"","",null,"","",null,"","",null,"","",null,"",""]
["963_32","coal",214,null,963,"Dallman","IL","32","32","Conventional Boiler","Cyclone firing",84,905.94,10.785,"bituminous","bituminous",0.12999407762594586,4.3065842440843062E-3,null,null,null,null,null,null,null,null,null,null,2.0966666666666668E-4,2.2612550000000002E-3,null,null,2.0966666666666668E-4,2.2612550000000002E-3,null,null,1.2589666666666666E-2,0.135779555,null,null,1.2589666666666666E-2,0.135779555,null,null,5.6088666666666669E-2,0.60491627000000003,null,null,5.6088666666666669E-2,0.60491627000000003,0.1821666666666667,1.9646675000000005,null,null,null,null,null,null,0.1821666666666667,1.9646675000000005,"NOx control","Selective Catalytic Reduction","2003-05-01","PM control","Electrostatic precipitator, cold side, w/o flue gas conditioning","1972-06-01","SO2 control","Wet FGD - Packed Type","2001-08-01","","",null,"","",null,"","",null,"","",null,"","",null,"","",null,"","",null,"","",null,"",""]
["47_3","coal",215,null,47,"Colbert","AL","3","3","Conventional Boiler","Wall firing - front firing",200,2121,10.605,"other--subbituminous/bituminous blend","other--subbituminous/bituminous blend",2.6408795325943191E-2,7.2357790956393796E-3,null,null,null,null,null,null,null,null,null,null,4.8000000000000001E-4,5.0904000000000001E-3,null,null,4.8000000000000001E-4,5.0904000000000001E-3,1.3641159247738151E-2,0.1446644938222631,null,null,null,null,1.3641159247738151E-2,0.1446644938222631,5.8475415303741894E-3,6.2013177929618281E-2,null,null,null,null,5.8475415303741894E-3,6.2013177929618281E-2,null,null,0.60787809417848948,6.4465471887628816,null,null,null,null,0.60787809417848948,6.4465471887628816,"PM control","Electrostatic precipitator, cold side, w/o flue gas conditioning","1990-05-01","","",null,"","",null,"","",null,"","",null,"","",null,"","",null,"","",null,"","",null,"","",null,"","",null,"",""]
["2107_2","coal",216,null,2107,"Sioux","MO","002","2","Conventional Boiler","Cyclone firing",524,4920,9.3893129770992374,"subbituminous,  bituminous","subbituminous,  bituminous",1.5747437525201798E-2,8.8813495844248785E-3,null,null,null,null,null,null,null,null,null,null,1.1103333333333334E-4,1.0425267175572521E-3,null,null,1.1103333333333334E-4,1.0425267175572521E-3,1.6034472023995241E-2,0.15055267625583318,null,null,null,null,1.6034472023995241E-2,0.15055267625583318,1.6224411020594788E-3,1.5233607294146252E-2,null,null,null,null,1.6224411020594788E-3,1.5233607294146252E-2,1.6986333333333334,15.949000000000002,null,null,null,null,null,null,1.6986333333333334,15.949000000000002,"NOx control","Selective Noncatalytic Reduction","2007-05-01","PM control","Electrostatic precipitator, cold side, w/ flue gas conditioning","1997-12-01","SO2 control","Wet FGD - Unspecified",null,"","",null,"","",null,"","",null,"","",null,"","",null,"","",null,"","",null,"","",null,"",""]
["50776_BLR1","coal",217,null,50776,"PANTHER CREEK ENERGY FACILITY","PA","BG1","BLR1","Fluidized bed firing","Fluidized bed firing",46.5,600,12.903225806451612,"coal refuse (culm or gob)","coal refuse (culm or gob)",1.9015104052929086E-2,5.8435009205147249E-3,null,null,null,null,null,null,null,null,null,null,1.4300000000000001E-3,1.8451612903225806E-2,null,null,1.4300000000000001E-3,1.8451612903225806E-2,1.1810489489606335E-2,0.152393412769114,null,null,1.8500000000000003E-2,0.23870967741935487,1.1810489489606335E-2,0.152393412769114,1.8814566633075392E-3,2.4276860171710182E-2,null,null,1.4999999999999998E-3,1.9354838709677417E-2,1.4999999999999998E-3,1.9354838709677417E-2,null,null,9.3700605318000021E-2,1.209040068619355,null,null,null,null,9.3700605318000021E-2,1.209040068619355,"NOx control","Selective Noncatalytic Reduction","1992-10-01","PM control","Fabric Filter, pulse","1992-10-01","","",null,"","",null,"","",null,"","",null,"","",null,"","",null,"","",null,"","",null,"","",null,"",""]
["50776_BLR2","coal",218,null,50776,"PANTHER CREEK ENERGY FACILITY","PA","BG2","BLR2","Fluidized bed firing","Fluidized bed firing",46.5,600,12.903225806451612,"coal refuse (culm or gob)","coal refuse (culm or gob)",1.9015104052929086E-2,5.8435009205147249E-3,null,null,null,null,null,null,null,null,null,null,1.4300000000000001E-3,1.8451612903225806E-2,null,null,1.4300000000000001E-3,1.8451612903225806E-2,1.1810489489606335E-2,0.152393412769114,null,null,1.9466666666666663E-2,0.25118279569892465,1.1810489489606335E-2,0.152393412769114,1.8814566633075392E-3,2.4276860171710182E-2,null,null,1.5333333333333334E-3,1.9784946236559138E-2,1.5333333333333334E-3,1.9784946236559138E-2,null,null,9.3700605318000021E-2,1.209040068619355,null,null,null,null,9.3700605318000021E-2,1.209040068619355,"NOx control","Selective Noncatalytic Reduction","1992-10-01","PM control","Fabric Filter, pulse","1992-10-01","","",null,"","",null,"","",null,"","",null,"","",null,"","",null,"","",null,"","",null,"","",null,"",""]
["988_4","coal",219,null,988,"Tanners Creek","IN","TC-4","4","Conventional Boiler","Cyclone firing",579.70000000000005,4990,8.6079006382611691,"subbituminous,  bituminous","subbituminous,  bituminous",2.6962052473080044E-2,4.4752204801632488E-3,null,null,null,null,null,null,null,null,null,null,1.9333333333333333E-4,1.6641941233971594E-3,null,null,1.9333333333333333E-4,1.6641941233971594E-3,1.7864752361641676E-2,0.15377801325615312,null,null,null,null,1.7864752361641676E-2,0.15377801325615312,3.8115520658894338E-3,3.2809461460735337E-2,null,null,null,null,3.8115520658894338E-3,3.2809461460735337E-2,1.3718965517241377,11.809149203214503,null,null,null,null,null,null,1.3718965517241377,11.809149203214503,"PM control","Electrostatic precipitator, cold side, w/o flue gas conditioning","1977-11-01","","",null,"","",null,"","",null,"","",null,"","",null,"","",null,"","",null,"","",null,"","",null,"","",null,"",""]
["10678_BLR1","coal",220,null,10678,"AES Warrior Run Cogeneration Facility","MD","BLR1","BLR1","Fluidized bed firing","Fluidized bed firing",202,2047,10.133663366336634,"bituminous","bituminous",2.1175879876905754E-2,6.5769740155676463E-3,null,null,null,null,null,null,null,null,null,null,4.1058702075333336E-3,4.1607506509013535E-2,null,null,4.1058702075333336E-3,4.1607506509013535E-2,1.5625814098616898E-2,0.15834673990034054,null,null,null,null,1.5625814098616898E-2,0.15834673990034054,5.6230362407487695E-5,5.6981956360459068E-4,null,null,null,null,5.6230362407487695E-5,5.6981956360459068E-4,0.15393333333333331,1.5599085808580857,null,null,null,null,null,null,0.15393333333333331,1.5599085808580857,"NOx control","Selective Noncatalytic Reduction","2000-02-01","PM control","Fabric Filter, pulse","2000-02-01","","",null,"","",null,"","",null,"","",null,"","",null,"","",null,"","",null,"","",null,"","",null,"",""]
["50951_1","coal",221,null,50951,"Sunnyside Cogen Associates","UT","Config 1","1","Fluidized bed firing","Fluidized bed firing",60,700,11.666666666666666,"bituminous","bituminous",1.9262349490215314E-2,2.7726764468720886E-2,1.559034065343671E-2,0.18188730762342828,null,null,null,null,1.559034065343671E-2,0.18188730762342828,null,null,3.7233333333333334E-6,4.3438888888888886E-5,null,null,3.7233333333333334E-6,4.3438888888888886E-5,1.6025989556035593E-2,0.18696987815374858,null,null,null,null,1.6025989556035593E-2,0.18696987815374858,1.1315636196331144E-4,1.3201575562386335E-3,null,null,null,null,1.1315636196331144E-4,1.3201575562386335E-3,null,null,0.18148502722607515,2.1173253176375435,null,null,0.18385714285714286,2.145,0.18148502722607515,2.1173253176375435,"NOx control","Other (specify): Anhydrous ammonia injection","1993-01-01","SO2 control","Dry FGD - Sorbent Injection","1993-01-01","PM control","Fabric Filter, pulse","1993-01-01","","",null,"","",null,"","",null,"","",null,"","",null,"","",null,"","",null,"","",null,"",""]
["3942_1","coal",222,null,3942,"Albright Power Station","WV","Unit_1","1","Conventional Boiler","Wall firing - unspecified",81,786,9.7037037037037042,"bituminous","bituminous",1.2890796803889876E-2,3.4365036968914409E-3,null,null,null,null,null,null,null,null,null,null,7.7233333333333331E-4,7.4944938271604943E-3,null,null,7.7233333333333331E-4,7.4944938271604943E-3,2.030669069261706E-2,0.1970501096839137,null,null,null,null,2.030669069261706E-2,0.1970501096839137,5.4918345731868939E-3,5.3291135487961716E-2,null,null,null,null,5.4918345731868939E-3,5.3291135487961716E-2,null,null,2.3667717521383196,22.966451817045918,null,null,null,null,2.3667717521383196,22.966451817045918,"PM control","Electrostatic precipitator, cold side, w/o flue gas conditioning",null,"","",null,"","",null,"","",null,"","",null,"","",null,"","",null,"","",null,"","",null,"","",null,"","",null,"",""]
["10343_SG-101","coal",223,null,10343,"Foster Wheeler Mt Carmel Cogen","PA","SG-101","SG-101","Fluidized bed firing","Fluidized bed firing",43,505,11.744186046511627,"coal refuse (culm or gob)","coal refuse (culm or gob)",null,null,null,null,null,null,null,null,null,null,null,null,null,null,null,null,null,null,null,null,null,null,1.7333333333333336E-2,0.20356589147286824,1.7333333333333336E-2,0.20356589147286824,null,null,null,null,null,null,null,null,null,null,0.10864386280863732,1.275933737636322,null,null,null,null,0.10864386280863732,1.275933737636322,"PM control","Fabric Filter, reverse air","1990-01-01","","",null,"","",null,"","",null,"","",null,"","",null,"","",null,"","",null,"","",null,"","",null,"","",null,"",""]
["976_123","coal",224,null,976,"Marion Generating Station","IL","123","123","Fluidized bed firing","Fluidized bed firing",120,1250,10.416666666666666,"bituminous","bituminous",0.15790091903981307,1.2083643037473233E-2,2.0218394899289008E-2,0.21060828020092717,null,null,null,null,2.0218394899289008E-2,0.21060828020092717,null,null,1.3800000000000002E-5,1.4375E-4,null,null,1.3800000000000002E-5,1.4375E-4,2.0798249596441193E-2,0.2166484332962624,null,null,null,null,2.0798249596441193E-2,0.2166484332962624,9.7766255381281767E-5,1.0183984935550183E-3,null,null,null,null,9.7766255381281767E-5,1.0183984935550183E-3,null,null,0.47881682015825494,4.9876752099818225,null,null,null,null,0.47881682015825494,4.9876752099818225,"NOx control","Selective Noncatalytic Reduction",null,"PM control","Fabric Filter, unspecified",null,"","",null,"","",null,"","",null,"","",null,"","",null,"","",null,"","",null,"","",null,"","",null,"",""]
["50888_BLR1","coal",225,null,50888,"Northampton Generating Company, L.P.","PA","GEN1","BLR1","Fluidized bed firing","Fluidized bed firing",121,1146,9.4710743801652892,"coal refuse (culm or gob)","coal refuse (culm or gob)",2.158890395623192E-2,9.5487082552287803E-3,null,null,null,null,null,null,null,null,null,null,5.8133333333333333E-6,5.5058512396694214E-5,null,null,5.8133333333333333E-6,5.5058512396694214E-5,2.6313191992352616E-2,0.24921419853914131,null,null,null,null,2.6313191992352616E-2,0.24921419853914131,5.8281833672884406E-4,5.5199158172831017E-3,null,null,null,null,5.8281833672884406E-4,5.5199158172831017E-3,null,null,0.1235357720062057,1.1700164852819153,null,null,null,null,0.1235357720062057,1.1700164852819153,"NOx control","Selective Noncatalytic Reduction","1995-08-01","PM control","Fabric Filter, pulse","1995-08-01","","",null,"","",null,"","",null,"","",null,"","",null,"","",null,"","",null,"","",null,"","",null,"",""]
["3942_2","coal",226,null,3942,"Albright Power Station","WV","Unit_2","2","Conventional Boiler","Wall firing - unspecified",81,643,7.9382716049382713,"bituminous","bituminous",2.0284274950726031E-2,9.034441109992717E-3,null,null,null,null,null,null,null,null,null,null,1.6033333333333335E-4,1.272769547325103E-3,null,null,1.6033333333333335E-4,1.272769547325103E-3,3.3133320173514856E-2,0.26302129471074137,null,null,null,null,3.3133320173514856E-2,0.26302129471074137,7.6194615086635532E-3,6.0485354939144004E-2,null,null,null,null,7.6194615086635532E-3,6.0485354939144004E-2,null,null,2.0144003566422413,15.99085715211063,null,null,null,null,2.0144003566422413,15.99085715211063,"PM control","Electrostatic precipitator, cold side, w/o flue gas conditioning",null,"","",null,"","",null,"","",null,"","",null,"","",null,"","",null,"","",null,"","",null,"","",null,"","",null,"",""]
["3775_1","coal",227,null,3775,"Clinch River","VA","CR-1","1","Conventional Boiler","Vertical firing",230,2100.9,9.1343478260869571,"bituminous","bituminous",7.7039100552785636E-2,7.1691546069977685E-3,null,null,null,null,null,null,null,null,null,null,2.9E-4,2.6489608695652177E-3,null,null,2.9E-4,2.6489608695652177E-3,2.909199357078331E-2,0.26573638822982026,null,null,null,null,2.909199357078331E-2,0.26573638822982026,2.2046050107712607E-3,2.0137628987518877E-2,null,null,null,null,2.2046050107712607E-3,2.0137628987518877E-2,0.86496666666666655,7.9009063913043471,null,null,null,null,null,null,0.86496666666666655,7.9009063913043471,"NOx control","Selective Noncatalytic Reduction","2009-01-01","PM control","Electrostatic precipitator, cold side, w/ flue gas conditioning","1975-02-01","","",null,"","",null,"","",null,"","",null,"","",null,"","",null,"","",null,"","",null,"","",null,"",""]
["2828_3","coal",228,null,2828,"Cardinal","OH","CD-U3","3","Conventional Boiler","Wall firing - opposed firing",650,5275,8.115384615384615,"bituminous","bituminous",5.8236347522032404E-2,5.6418716214614653E-3,null,null,null,null,null,null,null,null,null,null,1.8633333333333335E-4,1.5121666666666667E-3,null,null,1.8633333333333335E-4,1.5121666666666667E-3,3.4471603630206758E-2,0.27975032176821635,null,null,null,null,3.4471603630206758E-2,0.27975032176821635,3.1369469952520477E-3,2.5457531384545463E-2,null,null,null,null,3.1369469952520477E-3,2.5457531384545463E-2,1.4083913043478258,11.429637123745817,null,null,null,null,null,null,1.4083913043478258,11.429637123745817,"PM control","Electrostatic precipitator, hot side, w/o flue gas conditioning","1977-09-01","NOx control","Selective Catalytic Reduction","2003-01-01","","",null,"","",null,"","",null,"","",null,"","",null,"","",null,"","",null,"","",null,"","",null,"",""]
["10143_AAB01","coal",229,null,10143,"Colver Power Project","PA","AAB01","AAB01","Fluidized bed firing","Fluidized bed firing",131,1204,9.1908396946564892,"coal refuse (culm or gob)","coal refuse (culm or gob)",5.9321286897322661E-2,1.304656436974528E-2,null,null,null,null,null,null,null,null,null,null,2.9366666666666669E-4,2.6990432569974558E-3,null,null,2.9366666666666669E-4,2.6990432569974558E-3,3.2026721913269246E-2,0.2943524670501998,3.203333333333333E-2,0.29441323155216287,null,null,3.2026721913269246E-2,0.2943524670501998,2.2607295201527641E-4,2.0778002612701742E-3,2.2599999999999999E-4,2.0771297709923663E-3,null,null,2.2599999999999999E-4,2.0771297709923663E-3,null,null,0.5969738757427816,5.4866911938496878,null,null,null,null,0.5969738757427816,5.4866911938496878,"NOx control","Selective Noncatalytic Reduction","1995-05-01","PM control","Fabric Filter, pulse","1995-05-01","","",null,"","",null,"","",null,"","",null,"","",null,"","",null,"","",null,"","",null,"","",null,"",""]
["54144_BRBR1","coal",230,null,54144,"Piney Creek Project","PA","BRBRI","BRBR1","Fluidized bed firing","Fluidized bed firing",36,450,12.5,"bituminous,  synfuel","bituminous,  synfuel",5.7012762748879897E-2,1.9093746344123582E-2,null,null,null,null,null,null,null,null,null,null,2.5333333333333333E-4,3.1666666666666666E-3,null,null,2.5333333333333333E-4,3.1666666666666666E-3,2.6880262790104855E-2,0.3360032848763107,null,null,null,null,2.6880262790104855E-2,0.3360032848763107,1.1997931935878925E-2,0.14997414919848656,null,null,null,null,1.1997931935878925E-2,0.14997414919848656,null,null,0.57840271237535623,7.2300339046919531,null,null,0.66,8.25,0.57840271237535623,7.2300339046919531,"NOx control","Selective Noncatalytic Reduction","2002-08-01","PM control","Fabric Filter, pulse","1992-11-01","","",null,"","",null,"","",null,"","",null,"","",null,"","",null,"","",null,"","",null,"","",null,"",""]
["10151_BLR1A","coal",231,null,10151,"Grant Town Power Plant","WV","GEN1","BLR1A","Fluidized bed firing","Fluidized bed firing",47.5,675,14.210526315789474,"coal refuse (culm or gob)","coal refuse (culm or gob)",4.4245329249039643E-2,1.3110603663059136E-2,null,null,null,null,null,null,null,null,null,null,1.3386666666666668E-4,1.9023157894736845E-3,null,null,1.3386666666666668E-4,1.9023157894736845E-3,2.4184274921024481E-2,0.34367127519350582,null,null,null,null,2.4184274921024481E-2,0.34367127519350582,4.0798571929318608E-4,5.7976918004821179E-3,null,null,null,null,4.0798571929318608E-4,5.7976918004821179E-3,0.64453333333333329,9.1591578947368415,null,null,null,null,null,null,0.64453333333333329,9.1591578947368415,"NOx control","Selective Noncatalytic Reduction","2005-05-01","NOx control","Selective Noncatalytic Reduction","2005-05-01","SO2 control","Dry FGD - Circulating Dry Scrubber","1992-07-01","SO2 control","Dry FGD - Circulating Dry Scrubber","1992-07-01","PM control","Fabric Filter, pulse","1992-07-01","PM control","Fabric Filter, pulse","2005-05-01","","",null,"","",null,"","",null,"","",null,"","",null,"",""]
["10151_BLR1B","coal",232,null,10151,"Grant Town Power Plant","WV","GEN1","BLR1B","Fluidized bed firing","Fluidized bed firing",47.5,675,14.210526315789474,"coal refuse (culm or gob)","coal refuse (culm or gob)",4.4245329249039643E-2,1.3110603663059136E-2,null,null,null,null,null,null,null,null,null,null,1.3386666666666668E-4,1.9023157894736845E-3,null,null,1.3386666666666668E-4,1.9023157894736845E-3,2.4184274921024481E-2,0.34367127519350582,null,null,null,null,2.4184274921024481E-2,0.34367127519350582,4.0798571929318608E-4,5.7976918004821179E-3,null,null,null,null,4.0798571929318608E-4,5.7976918004821179E-3,0.64453333333333329,9.1591578947368415,null,null,null,null,null,null,0.64453333333333329,9.1591578947368415,"NOx control","Selective Noncatalytic Reduction","2005-05-01","NOx control","Selective Noncatalytic Reduction","2005-05-01","SO2 control","Dry FGD - Circulating Dry Scrubber","1992-07-01","SO2 control","Dry FGD - Circulating Dry Scrubber","1992-07-01","PM control","Fabric Filter, pulse","1992-07-01","PM control","Fabric Filter, pulse","2005-05-01","","",null,"","",null,"","",null,"","",null,"","",null,"",""]
["10603_031","coal",233,null,10603,"Ebensburg Power Company","PA","EPC01","031","Fluidized bed firing","Fluidized bed firing",58,830,14.310344827586206,"coal refuse (culm or gob)","coal refuse (culm or gob)",null,null,null,null,null,null,null,null,null,null,null,null,null,null,null,null,null,null,null,null,null,null,2.4333333333333335E-2,0.34821839080459771,2.4333333333333335E-2,0.34821839080459771,null,null,null,null,1E-4,1.4310344827586207E-3,1E-4,1.4310344827586207E-3,null,null,0.83702771609454862,11.97815524755992,null,null,null,null,0.83702771609454862,11.97815524755992,"PM control","Fabric Filter, pulse","1990-11-01","","",null,"","",null,"","",null,"","",null,"","",null,"","",null,"","",null,"","",null,"","",null,"","",null,"",""]
["3152_2B","coal",234,null,3152,"Sunbury Generation LP","PA","Boiler 2B","2B","Conventional Boiler","Arch firing",40,525,13.125,"coal - bituminous","anthracite, bituminous",null,null,null,null,null,null,null,null,null,null,null,null,null,null,null,null,null,null,null,null,null,null,2.7666858638658545E-2,0.36312751963239343,2.7666858638658545E-2,0.36312751963239343,null,null,null,null,1.5004934417145793E-2,0.19693976422503853,1.5004934417145793E-2,0.19693976422503853,null,null,null,null,null,null,null,null,null,null,"PM control","Fabric Filter, reverse air","1970-06-01","","",null,"","",null,"","",null,"","",null,"","",null,"","",null,"","",null,"","",null,"","",null,"","",null,"",""]
["2840_3","coal",235,null,2840,"Conesville","OH","CV-3","3","Conventional Boiler","Wall firing - front firing",165,1862,11.284848484848485,"bituminous","bituminous",4.1144921775083505E-2,4.5128212902115607E-3,null,null,null,null,null,null,null,null,null,null,7.6200000000000009E-4,8.5990545454545462E-3,null,null,7.6200000000000009E-4,8.5990545454545462E-3,3.5774037070178726E-2,0.40370458802831993,null,null,null,null,3.5774037070178726E-2,0.40370458802831993,5.8129353098823567E-3,6.5598094224248171E-2,null,null,null,null,5.8129353098823567E-3,6.5598094224248171E-2,4.1252499999999994,46.552821212121209,null,null,null,null,null,null,4.1252499999999994,46.552821212121209,"PM control","Electrostatic precipitator, cold side, w/o flue gas conditioning","1977-01-01","","",null,"","",null,"","",null,"","",null,"","",null,"","",null,"","",null,"","",null,"","",null,"","",null,"",""]
["2837_1","coal",236,null,2837,"Eastlake","OH","Unit 1","1","Conventional Boiler","Tangential firing",144,1205,8.3680555555555554,"subbituminous,  bituminous","subbituminous,  bituminous",2.3936598362994992E-2,4.4063893001272392E-3,null,null,null,null,null,null,null,null,null,null,9.7361975828666664E-4,8.1473042273293977E-3,null,null,9.7361975828666664E-4,8.1473042273293977E-3,4.8399057448207335E-2,0.40500600156312389,null,null,null,null,4.8399057448207335E-2,0.40500600156312389,3.9485484891898532E-3,3.3041673121345642E-2,null,null,null,null,3.9485484891898532E-3,3.3041673121345642E-2,null,null,1.8618807220013907,15.580321319525526,null,null,null,null,1.8618807220013907,15.580321319525526,"PM control","Electrostatic precipitator, cold side, w/o flue gas conditioning","1979-01-01","","",null,"","",null,"","",null,"","",null,"","",null,"","",null,"","",null,"","",null,"","",null,"","",null,"",""]
["3788_3","coal",237,null,3788,"Potomac River","VA","3","3","Conventional Boiler","Tangential firing",108,961,8.8981481481481488,"coal - bituminous","bituminous",null,null,null,null,null,null,null,null,null,null,null,null,null,null,null,null,null,null,null,null,null,null,4.5559999999999996E-2,0.40539962962962961,4.5559999999999996E-2,0.40539962962962961,null,null,null,null,2.2230000000000001E-3,1.9780583333333338E-2,2.2230000000000001E-3,1.9780583333333338E-2,null,null,null,null,null,null,null,null,null,null,"SO2 control","Dry FGD - Sorbent Injection","2006-05-01","PM control","Electrostatic precipitator, hot side, w/o flue gas conditioning","1978-10-01","PM control","Electrostatic precipitator, cold side, w/o flue gas conditioning","1954-06-01","","",null,"","",null,"","",null,"","",null,"","",null,"","",null,"","",null,"","",null,"",""]
["1218_1","coal",238,null,1218,"Fair Station","IA","U1","1","Conventional Boiler","Wall firing - front firing",24.5,330,13.469387755102041,"coal - bituminous","bituminous",null,null,null,null,null,null,null,null,null,null,null,null,null,null,null,null,null,null,null,null,null,null,3.3000000000000002E-2,0.44448979591836735,3.3000000000000002E-2,0.44448979591836735,null,null,null,null,null,null,null,null,null,null,null,null,null,null,3.93,52.93469387755102,3.93,52.93469387755102,"PM control","Electrostatic precipitator, cold side, w/o flue gas conditioning","1974-11-01","","",null,"","",null,"","",null,"","",null,"","",null,"","",null,"","",null,"","",null,"","",null,"","",null,"",""]
["2408_E2","coal",239,null,2408,"PSEG Mercer Generating Station","NJ","MERU2E2PT2OS1-Coal","E2","Conventional Boiler","Wall firing - unspecified",343,3100,9.037900874635568,"bituminous","bituminous",null,null,null,null,null,null,null,null,null,null,null,null,null,null,null,null,null,null,null,null,null,null,4.9983721238474776E-2,0.45174791789875157,4.9983721238474776E-2,0.45174791789875157,null,null,null,null,1.2820511746439902E-3,1.1587051432642477E-2,1.2820511746439902E-3,1.1587051432642477E-2,null,null,null,null,null,null,null,null,null,null,"PM control","Electrostatic precipitator, cold side, w/ flue gas conditioning","1991-08-01","NOx control","Selective Catalytic Reduction","2004-06-01","Other control","Activated carbon injection","2007-01-01","PM control","Fabric Filter, pulse","2008-12-01","","",null,"","",null,"","",null,"","",null,"","",null,"","",null,"","",null,"",""]
["10672_CBA","coal",240,null,10672,"Cedar Bay Generating Company L.P.","FL","CBA1","CBA","Fluidized bed firing","Fluidized bed firing",92,1063,11.554347826086957,"bituminous","bituminous",5.8348708487084872E-2,null,null,null,null,null,null,null,null,null,null,null,9.1000000000000003E-5,1.0514456521739132E-3,null,null,9.1000000000000003E-5,1.0514456521739132E-3,4.2542538854693217E-2,0.49155129133194447,4.0228333333333331E-2,0.46481215579710145,null,null,4.0228333333333331E-2,0.46481215579710145,5.4741624903958268E-5,6.3250377470551781E-4,5.1999999999999997E-5,6.0082608695652168E-4,5.9999999999999995E-5,6.9326086956521737E-4,5.1999999999999997E-5,6.0082608695652168E-4,null,null,null,null,null,null,null,null,null,null,"SO2 control","Dry FGD - Circulating Dry Scrubber","1994-01-01","NOx control","Selective Noncatalytic Reduction","1994-01-01","PM control","Fabric Filter, pulse","1994-01-01","","",null,"","",null,"","",null,"","",null,"","",null,"","",null,"","",null,"","",null,"",""]
["3297_WAT1","coal",241,null,3297,"Wateree","SC","WAT001","WAT1","Conventional Boiler","Wall firing - unspecified",383,3329.7,8.69373368146214,"","Bituminous",null,null,null,null,null,null,null,null,null,null,null,null,null,null,null,null,null,null,null,null,null,null,5.6000000000000001E-2,0.48684908616187983,5.6000000000000001E-2,0.48684908616187983,null,null,null,null,8.0700000000000008E-3,7.0158430809399472E-2,8.0700000000000008E-3,7.0158430809399472E-2,null,null,null,null,null,null,null,null,null,null,"NOx control","Selective Catalytic Reduction","2003-06-01","PM control","Fabric Filter, unspecified","2001-05-01","SO2 control","Wet FGD - Unspecified",null,"","",null,"","",null,"","",null,"","",null,"","",null,"","",null,"","",null,"","",null,"",""]
["3297_WAT2","coal",242,null,3297,"Wateree","SC","WAT002","WAT2","Conventional Boiler","Wall firing - unspecified",380,3305.1,8.6976315789473677,"","Bituminous",null,null,null,null,null,null,null,null,null,null,null,null,null,null,null,null,null,null,null,null,null,null,5.96E-2,0.51837884210526308,5.96E-2,0.51837884210526308,null,null,null,null,6.6400000000000001E-3,5.7752273684210521E-2,6.6400000000000001E-3,5.7752273684210521E-2,null,null,null,null,null,null,null,null,null,null,"NOx control","Selective Catalytic Reduction","2004-04-01","PM control","Fabric Filter, unspecified","2001-07-01","SO2 control","Wet FGD - Unspecified",null,"","",null,"","",null,"","",null,"","",null,"","",null,"","",null,"","",null,"","",null,"",""]
["2837_3","coal",243,null,2837,"Eastlake","OH","Unit 3","3","Conventional Boiler","Tangential firing",144,1205,8.3680555555555554,"subbituminous,  bituminous","subbituminous,  bituminous",5.1323806492139676E-2,4.6979297519662514E-3,null,null,null,null,null,null,null,null,null,null,1.1797440855333332E-3,9.8721640490810163E-3,null,null,1.1797440855333332E-3,9.8721640490810163E-3,6.3697552661671486E-2,0.53302465942579258,null,null,null,null,6.3697552661671486E-2,0.53302465942579258,4.4591817929167978E-3,3.7314680975449592E-2,null,null,null,null,4.4591817929167978E-3,3.7314680975449592E-2,null,null,2.1208759289031192,17.747607599501794,null,null,null,null,2.1208759289031192,17.747607599501794,"NOx control","Selective Noncatalytic Reduction","1999-10-01","PM control","Electrostatic precipitator, cold side, w/o flue gas conditioning","1980-01-01","","",null,"","",null,"","",null,"","",null,"","",null,"","",null,"","",null,"","",null,"","",null,"",""]
["3152_4","coal",244,null,3152,"Sunbury Generation LP","PA","Boiler 4","4","Conventional Boiler","Wall firing - front firing",128,1360,10.625,"bituminous","bituminous",5.5138158768089592E-2,5.3129853813138435E-3,null,null,null,null,null,null,null,null,null,null,9.3333333333333332E-4,9.9166666666666674E-3,null,null,9.3333333333333332E-4,9.9166666666666674E-3,null,null,5.1666666666666666E-2,0.54895833333333333,null,null,5.1666666666666666E-2,0.54895833333333333,null,null,1.4E-2,0.14874999999999999,null,null,1.4E-2,0.14874999999999999,3.0538666666666665,32.447333333333333,null,null,null,null,null,null,3.0538666666666665,32.447333333333333,"Other control","Other (specify): SO3 injection","1980-06-01","PM control","Electrostatic precipitator, cold side, w/ flue gas conditioning","1970-06-01","","",null,"","",null,"","",null,"","",null,"","",null,"","",null,"","",null,"","",null,"","",null,"",""]
["10672_CBB","coal",245,null,10672,"Cedar Bay Generating Company L.P.","FL","CBB1","CBB","Fluidized bed firing","Fluidized bed firing",92,1063,11.554347826086957,"bituminous","bituminous",4.6998823067869754E-2,null,null,null,null,null,null,null,null,null,null,null,9.0000000000000002E-6,1.0398913043478261E-4,null,null,9.0000000000000002E-6,1.0398913043478261E-4,4.9879164880000194E-2,0.57632122029826316,4.9246666666666661E-2,0.56901311594202897,null,null,4.9246666666666661E-2,0.56901311594202897,5.5154271140326284E-5,6.3727163284963957E-4,5.4333333333333337E-5,6.2778623188405804E-4,5.933333333333333E-5,6.8555797101449271E-4,5.4333333333333337E-5,6.2778623188405804E-4,null,null,null,null,null,null,null,null,null,null,"SO2 control","Dry FGD - Circulating Dry Scrubber","1994-01-01","NOx control","Selective Noncatalytic Reduction","1994-01-01","PM control","Fabric Filter, pulse","1994-01-01","","",null,"","",null,"","",null,"","",null,"","",null,"","",null,"","",null,"","",null,"",""]
["10672_CBC","coal",246,null,10672,"Cedar Bay Generating Company L.P.","FL","CBC1","CBC","Fluidized bed firing","Fluidized bed firing",92,1063,11.554347826086957,"bituminous","bituminous",5.4794520547945202E-2,null,null,null,null,null,null,null,null,null,null,null,8.6666666666666678E-6,1.0013768115942031E-4,null,null,8.6666666666666678E-6,1.0013768115942031E-4,4.9705537402576307E-2,0.57431506803194143,4.998466666666667E-2,0.57754022463768118,null,null,4.9705537402576307E-2,0.57431506803194143,5.0205825056512413E-5,5.8009556559861632E-4,5.0333333333333335E-5,5.8156884057971019E-4,7.0000000000000007E-5,8.0880434782608704E-4,5.0205825056512413E-5,5.8009556559861632E-4,0.13556666666666667,1.5663844202898551,null,null,null,null,null,null,0.13556666666666667,1.5663844202898551,"SO2 control","Dry FGD - Circulating Dry Scrubber","1994-01-01","NOx control","Selective Noncatalytic Reduction","1994-01-01","PM control","Fabric Filter, pulse","1994-01-01","","",null,"","",null,"","",null,"","",null,"","",null,"","",null,"","",null,"","",null,"",""]
["3935_1","coal",247,null,3935,"John E. Amos","WV","AM-1","1","Conventional Boiler","Wall firing - opposed firing",816.3,7020,8.5997794928335178,"bituminous","bituminous",null,null,null,null,null,null,null,null,null,null,null,null,2.0833333333333329E-4,1.7916207276736493E-3,null,null,2.0833333333333329E-4,1.7916207276736493E-3,7.5845293187809096E-2,0.65225279698446637,null,null,null,null,7.5845293187809096E-2,0.65225279698446637,7.5039977225927236E-3,6.4532725729022328E-2,null,null,null,null,7.5039977225927236E-3,6.4532725729022328E-2,1.2656999999999996,10.884740904079381,null,null,null,null,null,null,1.2656999999999996,10.884740904079381,"NOx control","Selective Catalytic Reduction",null,"PM control","Electrostatic precipitator, cold side, w/o flue gas conditioning","1978-04-01","","",null,"","",null,"","",null,"","",null,"","",null,"","",null,"","",null,"","",null,"","",null,"",""]
["628_1","coal",248,null,628,"Crystal River Power Plant","FL","CryR_Cfg_1","1","Conventional Boiler","Tangential firing",400,3837,9.5924999999999994,"bituminous","bituminous",0.11387061520371848,5.601246408311048E-3,null,null,null,null,null,null,null,null,null,null,2.9133333333333338E-5,2.7946150000000001E-4,null,null,2.9133333333333338E-5,2.7946150000000001E-4,7.4352427286473941E-2,0.71322565874550126,null,null,null,null,7.4352427286473941E-2,0.71322565874550126,7.4710145959025346E-3,7.1665707511195054E-2,null,null,null,null,7.4710145959025346E-3,7.1665707511195054E-2,null,null,1.3670117968378968,13.113060661167523,null,null,null,null,1.3670117968378968,13.113060661167523,"PM control","Electrostatic precipitator, cold side, w/o flue gas conditioning","1979-01-01","","",null,"","",null,"","",null,"","",null,"","",null,"","",null,"","",null,"","",null,"","",null,"","",null,"",""]
["2408_E1","coal",249,null,2408,"PSEG Mercer Generating Station","NJ","MERU1E1PT1OS1-Coal","E1","Conventional Boiler","Wall firing - unspecified",343,3100,9.037900874635568,"bituminous","bituminous",null,null,null,null,null,null,null,null,null,null,null,null,null,null,null,null,null,null,null,null,null,null,8.1854206295234058E-2,0.73979020266829609,8.1854206295234058E-2,0.73979020266829609,null,null,null,null,5.5215530127567024E-4,4.9903248803340452E-3,5.5215530127567024E-4,4.9903248803340452E-3,null,null,null,null,null,null,null,null,null,null,"PM control","Electrostatic precipitator, cold side, w/ flue gas conditioning","1994-05-01","NOx control","Selective Catalytic Reduction","2004-06-01","Other control","Activated carbon injection","2007-01-01","PM control","Fabric Filter, pulse","2008-12-01","","",null,"","",null,"","",null,"","",null,"","",null,"","",null,"","",null,"",""]
["3152_3","coal",250,null,3152,"Sunbury Generation LP","PA","Boiler 3","3","Conventional Boiler","Wall firing - front firing",94,1100,11.702127659574469,"coal - bituminous","bituminous",null,null,null,null,null,null,null,null,null,null,null,null,null,null,null,null,null,null,null,null,null,null,6.7657276503554159E-2,0.79173408674371892,6.7657276503554159E-2,0.79173408674371892,null,null,null,null,7.7597030747552538E-3,9.0805035981178506E-2,7.7597030747552538E-3,9.0805035981178506E-2,null,null,null,null,null,null,null,null,null,null,"Other control","Other (specify): SO3 injection","1980-06-01","PM control","Electrostatic precipitator, cold side, w/ flue gas conditioning","1970-06-01","","",null,"","",null,"","",null,"","",null,"","",null,"","",null,"","",null,"","",null,"","",null,"",""]
["3131_3","coal",251,null,3131,"Shawville","PA","SHAW3-2","3","Conventional Boiler","Tangential firing",188,1794,9.5425531914893611,"bituminous","bituminous",5.6410497095544888E-2,2.9125438235412526E-3,null,null,null,null,null,null,null,null,null,null,8.2800000000000007E-5,7.9012340425531921E-4,null,null,8.2800000000000007E-5,7.9012340425531921E-4,8.9305681714558174E-2,0.8522042180633902,null,null,null,null,8.9305681714558174E-2,0.8522042180633902,7.8140524468381187E-3,7.456601111504034E-2,null,null,null,null,7.8140524468381187E-3,7.456601111504034E-2,3.1492999999999989,30.052362765957433,null,null,null,null,null,null,3.1492999999999989,30.052362765957433,"NOx control","Selective Noncatalytic Reduction","2005-05-01","PM control","Electrostatic precipitator, cold side, w/o flue gas conditioning","1959-06-01","PM control","Electrostatic precipitator, cold side, w/o flue gas conditioning","1977-03-01","","",null,"","",null,"","",null,"","",null,"","",null,"","",null,"","",null,"","",null,"",""]
["3131_4","coal",252,null,3131,"Shawville","PA","SHAW4-2","4","Conventional Boiler","Tangential firing",188,1794,9.5425531914893611,"bituminous","bituminous",5.6410497095544888E-2,2.9125438235412526E-3,null,null,null,null,null,null,null,null,null,null,8.2800000000000007E-5,7.9012340425531921E-4,null,null,8.2800000000000007E-5,7.9012340425531921E-4,8.9305681714558174E-2,0.8522042180633902,null,null,null,null,8.9305681714558174E-2,0.8522042180633902,7.8140524468381187E-3,7.456601111504034E-2,null,null,null,null,7.8140524468381187E-3,7.456601111504034E-2,3.1492999999999989,30.052362765957433,null,null,null,null,null,null,3.1492999999999989,30.052362765957433,"NOx control","Selective Noncatalytic Reduction","2005-05-01","PM control","Electrostatic precipitator, cold side, w/o flue gas conditioning","1960-06-01","PM control","Electrostatic precipitator, cold side, w/o flue gas conditioning","1977-03-01","","",null,"","",null,"","",null,"","",null,"","",null,"","",null,"","",null,"","",null,"",""]
["2716_1","coal",253,null,2716,"W.H. Weatherspoon Plant","NC","Wea_Cfg_1","1","Conventional Boiler","Wall firing - front firing",53,472,8.9056603773584904,"bituminous","bituminous",8.6032376747234754E-2,4.0960233511031568E-3,null,null,null,null,null,null,null,null,null,null,4.1933333333333334E-5,3.734440251572327E-4,null,null,4.1933333333333334E-5,3.734440251572327E-4,9.6485183704092689E-2,0.85926427751569334,null,null,null,null,9.6485183704092689E-2,0.85926427751569334,7.6149497922485604E-3,6.7816156640402275E-2,null,null,null,null,7.6149497922485604E-3,6.7816156640402275E-2,null,null,1.6064603724188229,14.306590486446876,null,null,null,null,1.6064603724188229,14.306590486446876,"PM control","Electrostatic precipitator, cold side, w/o flue gas conditioning","1975-06-01","PM control","Electrostatic precipitator, cold side, w/o flue gas conditioning","1975-04-01","","",null,"","",null,"","",null,"","",null,"","",null,"","",null,"","",null,"","",null,"","",null,"",""]
["2716_2","coal",254,null,2716,"W.H. Weatherspoon Plant","NC","Wea_Cfg_1","2","Conventional Boiler","Wall firing - front firing",53,472,8.9056603773584904,"bituminous","bituminous",8.6032376747234754E-2,4.0960233511031568E-3,null,null,null,null,null,null,null,null,null,null,4.1933333333333334E-5,3.734440251572327E-4,null,null,4.1933333333333334E-5,3.734440251572327E-4,9.6485183704092689E-2,0.85926427751569334,null,null,null,null,9.6485183704092689E-2,0.85926427751569334,7.6149497922485604E-3,6.7816156640402275E-2,null,null,null,null,7.6149497922485604E-3,6.7816156640402275E-2,null,null,1.6064603724188229,14.306590486446876,null,null,null,null,1.6064603724188229,14.306590486446876,"PM control","Electrostatic precipitator, cold side, w/o flue gas conditioning","1975-06-01","PM control","Electrostatic precipitator, cold side, w/o flue gas conditioning","1975-04-01","","",null,"","",null,"","",null,"","",null,"","",null,"","",null,"","",null,"","",null,"","",null,"",""]
["1012_3","coal",255,null,1012,"F. B. Culley","IN","Config3","3","Conventional Boiler","Wall firing - opposed firing",287,2689,9.3693379790940767,"subbituminous","subbituminous",8.3332643706231405E-2,6.5666765669082682E-3,null,null,null,null,null,null,null,null,null,null,2.6133333333333336E-4,2.4485203252032524E-3,null,null,2.6133333333333336E-4,2.4485203252032524E-3,0.10233113943204951,0.95877503112467288,null,null,null,null,0.10233113943204951,0.95877503112467288,6.8220759621366325E-2,0.63918335408311511,null,null,null,null,6.8220759621366325E-2,0.63918335408311511,8.0045454545454545E-2,0.74997291732657589,null,null,null,null,null,null,8.0045454545454545E-2,0.74997291732657589,"NOx control","Selective Catalytic Reduction","2004-01-01","PM control","Fabric Filter, pulse","2006-11-01","SO2 control","Wet FGD - Spray Type","1995-01-01","","",null,"","",null,"","",null,"","",null,"","",null,"","",null,"","",null,"","",null,"",""]
["50974_#1 CFB boiler","coal",256,null,50974,"Scrubgrass Generating Company L.P.","PA","Gen 1","#1 CFB boiler","Fluidized bed firing","Fluidized bed firing",48.5,650,13.402061855670103,"coal refuse (culm or gob)","coal refuse (culm or gob)",0.15666324746085439,2.4961099871779312E-2,null,null,null,null,null,null,null,null,null,null,1.4333333333333333E-3,1.8470790378006873E-2,null,null,1.4333333333333333E-3,1.8470790378006873E-2,7.6715503346688516E-2,0.98860184725114064,null,null,null,null,7.6715503346688516E-2,0.98860184725114064,5.1747274202586464E-2,0.66684631704364006,null,null,5.9999999999999995E-4,7.7319587628865974E-3,5.9999999999999995E-4,7.7319587628865974E-3,null,null,0.36757015513489266,4.7367288032846995,null,null,null,null,0.36757015513489266,4.7367288032846995,"NOx control","Selective Noncatalytic Reduction","1999-06-01","NOx control","Selective Noncatalytic Reduction","1999-06-01","PM control","Fabric Filter, pulse","1993-06-01","PM control","Fabric Filter, pulse","1993-06-01","SO2 control","Dry FGD - Circulating Dry Scrubber","1993-06-01","SO2 control","Dry FGD - Circulating Dry Scrubber","1993-06-01","","",null,"","",null,"","",null,"","",null,"","",null,"",""]
[{"$f":"E258&\"_\"&I258","v":"50974_#2 CFB Boiler"},"coal",257,null,50974,"Scrubgrass Generating Company L.P.","PA","Gen 1","#2 CFB Boiler","Fluidized bed firing","Fluidized bed firing",48.5,600,12.371134020618557,"coal refuse (culm or gob)","coal refuse (culm or gob)",0.15666324746085439,2.4961099871779312E-2,null,null,null,null,null,null,null,null,null,null,1.4333333333333333E-3,1.8470790378006873E-2,null,null,1.4333333333333333E-3,1.8470790378006873E-2,7.6715503346688516E-2,0.98860184725114064,null,null,null,null,7.6715503346688516E-2,0.98860184725114064,5.1747274202586464E-2,0.66684631704364006,null,null,5.9999999999999995E-4,7.7319587628865974E-3,5.9999999999999995E-4,7.7319587628865974E-3,null,null,0.36757015513489266,4.7367288032846995,null,null,null,null,0.36757015513489266,4.7367288032846995,"NOx control","Selective Noncatalytic Reduction","1999-06-01","NOx control","Selective Noncatalytic Reduction","1999-06-01","PM control","Fabric Filter, pulse","1993-06-01","PM control","Fabric Filter, pulse","1993-06-01","SO2 control","Dry FGD - Circulating Dry Scrubber","1993-06-01","SO2 control","Dry FGD - Circulating Dry Scrubber","1993-06-01","","",null,"","",null,"","",null,"","",null,"","",null,"",""]
["3115_2","coal",258,null,3115,"Titus","PA","TI-2","2","Conventional Boiler","Tangential firing",86.2,900,10.440835266821345,"coal - bituminous","bituminous",null,null,null,null,null,null,null,null,null,null,null,null,null,null,null,null,null,null,null,null,null,null,9.5666666666666678E-2,0.99883990719257554,9.5666666666666678E-2,0.99883990719257554,null,null,null,null,4.333333333333334E-3,4.524361948955917E-2,4.333333333333334E-3,4.524361948955917E-2,null,null,null,null,null,null,null,null,null,null,"PM control","Electrostatic precipitator, cold side, w/o flue gas conditioning","1975-02-01","","",null,"","",null,"","",null,"","",null,"","",null,"","",null,"","",null,"","",null,"","",null,"","",null,"",""]
["2384_8","coal",259,null,2384,"Deepwater","NJ","Coal-firing","8","Conventional Boiler","Wall firing - front firing",87,820,9.4252873563218387,"","bituminous",null,null,null,null,null,null,null,null,null,null,null,null,null,null,null,null,null,null,null,null,null,null,0.10657381742616871,1.00448885390182,0.10657381742616871,1.00448885390182,null,null,null,null,null,null,null,null,null,null,null,null,null,null,null,null,null,null,"Other control","Other (specify): Hydrated lime injection to control HCl","2008-09-01","NOx control","Selective Noncatalytic Reduction","2008-09-01","PM control","Fabric Filter, reverse air","1981-01-01","","",null,"","",null,"","",null,"","",null,"","",null,"","",null,"","",null,"","",null,"",""]
["1012_2","coal",260,null,1012,"F. B. Culley","IN","Config2","2","Conventional Boiler","Wall firing - opposed firing",100,1031,10.31,"subbituminous","subbituminous",8.3332643706231405E-2,6.5666765669082682E-3,null,null,null,null,null,null,null,null,null,null,2.6133333333333336E-4,2.694346666666667E-3,null,null,2.6133333333333336E-4,2.694346666666667E-3,0.10233113943204951,1.0550340475444304,null,null,null,null,0.10233113943204951,1.0550340475444304,6.8220759621366325E-2,0.7033560316962868,null,null,null,null,6.8220759621366325E-2,0.7033560316962868,8.0045454545454545E-2,0.82526863636363634,null,null,null,null,null,null,8.0045454545454545E-2,0.82526863636363634,"PM control","Fabric Filter, pulse","2006-11-01","SO2 control","Wet FGD - Spray Type","1995-01-01","","",null,"","",null,"","",null,"","",null,"","",null,"","",null,"","",null,"","",null,"","",null,"",""]
["642_1","coal",261,null,642,"Scholz","FL","Unit 1","1","Conventional Boiler","Wall firing - front firing",49,581.09100000000001,11.859,"bituminous","bituminous",9.2469740723464658E-2,5.1877697075879067E-3,null,null,null,null,null,null,null,null,null,null,4.2666666666666662E-5,5.059839999999999E-4,null,null,4.2666666666666662E-5,5.059839999999999E-4,0.10834601350981614,1.2848753742129095,null,null,null,null,0.10834601350981614,1.2848753742129095,5.950438529826573E-3,7.0566250525213328E-2,null,null,null,null,5.950438529826573E-3,7.0566250525213328E-2,1.4127142857142856,16.753378714285713,null,null,null,null,1.3666666666666669,16.207300000000004,1.3666666666666669,16.207300000000004,"PM control","Electrostatic precipitator, cold side, w/o flue gas conditioning","1974-01-01","","",null,"","",null,"","",null,"","",null,"","",null,"","",null,"","",null,"","",null,"","",null,"","",null,"",""]
["642_2","coal",262,null,642,"Scholz","FL","Unit 2","2","Conventional Boiler","Wall firing - front firing",49,644.74199999999996,13.157999999999999,"bituminous","bituminous",9.2469740723464658E-2,5.1877697075879067E-3,null,null,null,null,null,null,null,null,null,null,4.2666666666666662E-5,5.6140799999999989E-4,null,null,4.2666666666666662E-5,5.6140799999999989E-4,0.10834601350981614,1.4256168457621607,null,null,null,null,0.10834601350981614,1.4256168457621607,5.950438529826573E-3,7.8295870175458041E-2,null,null,null,null,5.950438529826573E-3,7.8295870175458041E-2,1.4127142857142856,18.588494571428569,null,null,null,null,1.3666666666666669,17.982600000000001,1.3666666666666669,17.982600000000001,"PM control","Electrostatic precipitator, cold side, w/o flue gas conditioning","2007-12-01","","",null,"","",null,"","",null,"","",null,"","",null,"","",null,"","",null,"","",null,"","",null,"","",null,"",""]
["2732_7","coal",263,null,2732,"Riverbend","NC","7","7","Conventional Boiler","Tangential firing",99.5,1059,10.643216080402009,"bituminous","bituminous",6.7396165672277034E-2,6.144574251540069E-3,null,null,null,null,null,null,null,null,null,null,5.549919614247056E-6,5.9068993683292785E-5,null,null,5.549919614247056E-6,5.9068993683292785E-5,0.1438505690399815,1.5310326895813104,null,null,null,null,0.1438505690399815,1.5310326895813104,1.4787438034722619E-2,0.15738589827910807,null,null,null,null,1.4787438034722619E-2,0.15738589827910807,null,null,2.8632800542083552,30.474508315644702,null,null,null,null,2.8632800542083552,30.474508315644702,"NOx control","Selective Noncatalytic Reduction","2007-02-01","PM control","Electrostatic precipitator, hot side, w/o flue gas conditioning","1995-01-01","","",null,"","",null,"","",null,"","",null,"","",null,"","",null,"","",null,"","",null,"","",null,"",""]
["1385_3","coal",264,null,1385,"Dale Station","KY","03","3","Conventional Boiler","Wall firing - front firing",80,944,11.8,"bituminous","bituminous",null,2.9344902268796402E-3,null,null,null,null,null,null,null,null,null,null,5.3333333333333325E-4,6.2933333333333331E-3,null,null,5.3333333333333325E-4,6.2933333333333331E-3,0.14398901602472744,1.699070389091784,0.14403333333333332,1.6995933333333333,null,null,0.14398901602472744,1.699070389091784,4.5267766006176656E-3,5.3415963887288455E-2,4.5333333333333337E-3,5.3493333333333337E-2,null,null,4.5267766006176656E-3,5.3415963887288455E-2,1.4327666666666667,16.906646666666667,null,null,null,null,null,null,1.4327666666666667,16.906646666666667,"PM control","Electrostatic precipitator, cold side, w/ flue gas conditioning",null,"","",null,"","",null,"","",null,"","",null,"","",null,"","",null,"","",null,"","",null,"","",null,"","",null,"",""]
["1218_2","coal",265,null,1218,"Fair Station","IA","U2","2","Conventional Boiler","Wall firing - front firing",44,465,10.568181818181818,"bituminous","bituminous",0.16426856034697257,4.1938303238596404E-3,null,null,null,null,null,null,null,null,null,null,1.8266666666666667E-4,1.9304545454545455E-3,null,null,1.8266666666666667E-4,1.9304545454545455E-3,0.17784597101603083,1.8795085573285077,null,null,null,null,0.17784597101603083,1.8795085573285077,4.7331982158338665E-3,5.0021299326426093E-2,null,null,null,null,4.7331982158338665E-3,5.0021299326426093E-2,2.0313666666666665,21.467852272727271,null,null,null,null,null,null,2.0313666666666665,21.467852272727271,"Other control","Other (specify): Flue gas conditioning for opacity control","2006-04-01","PM control","Electrostatic precipitator, cold side, w/ flue gas conditioning","1974-10-01","","",null,"","",null,"","",null,"","",null,"","",null,"","",null,"","",null,"","",null,"","",null,"",""]
["1008_2","coal",266,null,1008,"R. Gallagher","IN","2-2007","2","Conventional Boiler","Wall firing - front firing",150,1460,9.7333333333333325,"coal - bituminous","bituminous",null,null,null,null,null,null,null,null,null,null,null,null,null,null,null,null,null,null,null,null,null,null,0.25699780151390705,2.5014452680686952,0.25699780151390705,2.5014452680686952,null,null,null,null,4.6060878388617605E-3,4.4832588298254462E-2,4.6060878388617605E-3,4.4832588298254462E-2,null,null,null,null,null,null,3.2359930321660475E-3,3.1496998846416192E-2,3.2359930321660475E-3,3.1496998846416192E-2,"PM control","Fabric Filter, shake and deflate","2007-12-01","","",null,"","",null,"","",null,"","",null,"","",null,"","",null,"","",null,"","",null,"","",null,"","",null,"",""]
["8_10","coal",null,null,8,"Gorgas","AL","Unit 10","10","Conventional Boiler","Tangential firing",720,6523.7939999700002,9.0608249999583332,"coal - bituminous","bituminous",null,null,null,null,null,null,null,null,null,null,null,null,null,null,null,null,null,null,null,null,null,null,null,null,null,null,null,null,null,null,null,null,null,null,null,null,null,null,null,null,6.5176224871357616E-2,0.59055036771730318,6.5176224871357616E-2,0.59055036771730318,"NOx control","Selective Catalytic Reduction","2002-05-01","PM control","Electrostatic precipitator, cold side, w/ flue gas conditioning","1972-10-01","SO2 control","Wet FGD - Spray Type","2007-12-01","","",null,"","",null,"","",null,"","",null,"","",null,"","",null,"","",null,"","",null,"",""]
["8_8","coal",null,null,8,"Gorgas","AL","Unit 8","8","Conventional Boiler","Tangential firing",175,1600.8972500399998,9.1479842859428562,"coal - bituminous","bituminous",null,null,null,null,null,null,null,null,null,null,null,null,null,null,null,null,null,null,null,null,null,null,null,null,null,null,null,null,null,null,null,null,null,null,null,null,null,null,null,null,6.5176224871357616E-2,0.59623108094025745,6.5176224871357616E-2,0.59623108094025745,"PM control","Electrostatic precipitator, hot side, w/ flue gas conditioning","1972-06-01","SO2 control","Wet FGD - Spray Type","2007-12-01","","",null,"","",null,"","",null,"","",null,"","",null,"","",null,"","",null,"","",null,"","",null,"",""]
["8_9","coal",null,null,8,"Gorgas","AL","Unit 9","9","Conventional Boiler","Tangential firing",185,1738.6247499249998,9.3979716212162145,"coal - bituminous","bituminous",null,null,null,null,null,null,null,null,null,null,null,null,null,null,null,null,null,null,null,null,null,null,null,null,null,null,null,null,null,null,null,null,null,null,null,null,null,null,null,null,6.5176224871357616E-2,0.61252431171902533,6.5176224871357616E-2,0.61252431171902533,"PM control","Electrostatic precipitator, hot side, w/ flue gas conditioning","1972-06-01","SO2 control","Wet FGD - Spray Type","2007-12-01","","",null,"","",null,"","",null,"","",null,"","",null,"","",null,"","",null,"","",null,"","",null,"",""]
["113_1","coal",null,null,113,"Cholla","AZ","001","1","Conventional Boiler","Tangential firing",131,1270,9.6946564885496187,"","Bituminous, Subbituminous",null,null,null,null,null,null,null,null,null,null,null,null,null,null,null,null,null,null,null,null,null,null,null,null,null,null,null,null,null,null,null,null,null,null,null,null,null,null,null,null,0.05,0.48473282442748095,0.05,0.48473282442748095,"PM control","Fabric Filter, unspecified","2007-01-01","SO2 control","Wet FGD - Venturi Type","1972-01-01","","",null,"","",null,"","",null,"","",null,"","",null,"","",null,"","",null,"","",null,"","",null,"",""]
["113_2","coal",null,null,113,"Cholla","AZ","002","2","Conventional Boiler","Tangential firing",305,2938,9.6327868852459009,"","Bituminous, Subbituminous",null,null,null,null,null,null,null,null,null,null,null,null,null,null,null,null,null,null,null,null,null,null,null,null,null,null,null,null,null,null,null,null,null,null,null,null,null,null,null,null,6.0999999999999999E-2,0.5875999999999999,6.0999999999999999E-2,0.5875999999999999,"PM control","PM scrubber - Venturi","1978-01-01","SO2 control","Wet FGD - Venturi Type","1978-01-01","","",null,"","",null,"","",null,"","",null,"","",null,"","",null,"","",null,"","",null,"","",null,"",""]
["127_1","coal",null,null,127,"Oklaunion","TX","OKL-1","1","Conventional Boiler","Wall firing - opposed firing",670,6800,10.149253731343284,"subbituminous","subbituminous",null,null,null,null,null,null,null,null,null,null,null,null,null,null,null,null,null,null,null,null,null,null,null,null,null,null,null,null,null,null,null,null,null,null,0.18450000000000003,1.8725373134328362,0.13561733020971514,1.3764146946657658,null,null,null,null,0.13561733020971514,1.3764146946657658,"PM control","Electrostatic precipitator, cold side, w/o flue gas conditioning","1986-01-01","SO2 control","Wet FGD - Spray Type","1986-12-01","","",null,"","",null,"","",null,"","",null,"","",null,"","",null,"","",null,"","",null,"","",null,"",""]
["160_2","coal",null,null,160,"Apache Station","AZ","ST2","2","Conventional Boiler","Turbo",204,1932.521,9.4731421568627443,"coal - subbituminous","subbituminous",null,null,null,null,null,null,null,null,null,null,null,null,null,null,null,null,null,null,null,null,null,null,null,null,null,null,null,null,null,null,null,null,null,null,null,null,null,null,null,null,0.10256585416622069,0.97162091695666153,0.10256585416622069,0.97162091695666153,"PM control","Electrostatic precipitator, hot side, w/o flue gas conditioning","1978-06-01","SO2 control","Wet FGD - Spray Type","1978-06-01","","",null,"","",null,"","",null,"","",null,"","",null,"","",null,"","",null,"","",null,"","",null,"",""]
["160_3","coal",null,null,160,"Apache Station","AZ","ST3","3","Conventional Boiler","Turbo",204,1932.521,9.4731421568627443,"coal - subbituminous","subbituminous",null,null,null,null,null,null,null,null,null,null,null,null,null,null,null,null,null,null,null,null,null,null,null,null,null,null,null,null,null,null,null,null,null,null,null,null,null,null,null,null,0.12490650035692662,1.1832570341973929,0.12490650035692662,1.1832570341973929,"PM control","Electrostatic precipitator, hot side, w/o flue gas conditioning","1978-06-01","SO2 control","Wet FGD - Spray Type","1978-06-01","","",null,"","",null,"","",null,"","",null,"","",null,"","",null,"","",null,"","",null,"","",null,"",""]
["207_PPBoiler1","coal",null,null,207,"St Johns River Power Park","FL","PPUnit1Configuration","PPBoiler1","Conventional Boiler","Wall firing - opposed firing",660,6144,9.3090909090909086,"bituminous","bituminous",null,null,null,null,null,null,null,null,null,null,null,null,null,null,null,null,null,null,null,null,null,null,null,null,null,null,null,null,null,null,null,null,null,null,0.21052000000000001,1.9597498181818183,null,null,null,null,null,null,0.21052000000000001,1.9597498181818183,"NOx control","Selective Catalytic Reduction","2009-07-01","NOx control","Other (specify): Ammonia Injection for SO3 Mitigation","2009-06-01","PM control","Electrostatic precipitator, cold side, w/ flue gas conditioning","1988-03-01","SO2 control","Wet FGD - Spray/Tray Type","1986-12-01","SO2 control","Wet FGD - Spray Type","1986-12-01","","",null,"","",null,"","",null,"","",null,"","",null,"","",null,"",""]
["207_PPBoiler2","coal",null,null,207,"St Johns River Power Park","FL","PPUnit2Configuration","PPBoiler2","Conventional Boiler","Wall firing - opposed firing",660,6144,9.3090909090909086,"bituminous","bituminous",null,null,null,null,null,null,null,null,null,null,null,null,null,null,null,null,null,null,null,null,null,null,null,null,null,null,null,null,null,null,null,null,null,null,0.20700000000000005,1.9269818181818186,null,null,null,null,null,null,0.20700000000000005,1.9269818181818186,"NOx control","Selective Catalytic Reduction","2009-03-01","NOx control","Other (specify): Ammonia Injection for SO3 Mitigation","2009-03-01","PM control","Electrostatic precipitator, cold side, w/ flue gas conditioning","1986-12-01","SO2 control","Wet FGD - Spray/Tray Type","1988-03-01","SO2 control","Wet FGD - Spray Type","1988-03-01","","",null,"","",null,"","",null,"","",null,"","",null,"","",null,"",""]
["641_4","coal",null,null,641,"Crist","FL","Unit 4","4","Conventional Boiler","Tangential firing",82,868.84199999999998,10.595634146341464,"bituminous","bituminous",null,null,null,null,null,null,null,null,null,null,null,null,null,null,null,null,null,null,null,null,null,null,null,null,null,null,null,null,null,null,null,null,null,null,2.5000000000000012E-2,0.26489085365853671,null,null,null,null,null,null,2.5000000000000012E-2,0.26489085365853671,"NOx control","Selective Noncatalytic Reduction","2006-04-01","PM control","Electrostatic precipitator, hot side, w/o flue gas conditioning","2008-03-01","PM control","Electrostatic precipitator, cold side, w/o flue gas conditioning","1976-01-01","SO2 control","Wet FGD - Spray Type","2009-12-01","","",null,"","",null,"","",null,"","",null,"","",null,"","",null,"","",null,"",""]
["641_5","coal",null,null,641,"Crist","FL","Unit 5","5","Conventional Boiler","Tangential firing",82,817.82999999999993,9.9735365853658529,"bituminous","bituminous",null,null,null,null,null,null,null,null,null,null,null,null,null,null,null,null,null,null,null,null,null,null,null,null,null,null,null,null,null,null,null,null,null,null,2.5000000000000012E-2,0.24933841463414644,null,null,null,null,null,null,2.5000000000000012E-2,0.24933841463414644,"NOx control","Selective Noncatalytic Reduction","2006-04-01","PM control","Electrostatic precipitator, hot side, w/ flue gas conditioning","2008-03-01","PM control","Electrostatic precipitator, cold side, w/o flue gas conditioning","1976-01-01","SO2 control","Wet FGD - Spray Type","2009-12-01","","",null,"","",null,"","",null,"","",null,"","",null,"","",null,"","",null,"",""]
["641_6","coal",null,null,641,"Crist","FL","Unit 6","6","Conventional Boiler","Wall firing - front firing",320,3193.348,9.9792124999999992,"bituminous","bituminous",null,null,null,null,null,null,null,null,null,null,null,null,null,null,null,null,null,null,null,null,null,null,null,null,null,null,null,null,null,null,null,null,null,null,2.5000000000000012E-2,0.24948031250000011,null,null,null,null,null,null,2.5000000000000012E-2,0.24948031250000011,"NOx control","Selective Noncatalytic Reduction","2005-11-01","PM control","Electrostatic precipitator, cold side, w/o flue gas conditioning","1994-01-01","SO2 control","Wet FGD - Spray Type","2009-12-01","","",null,"","",null,"","",null,"","",null,"","",null,"","",null,"","",null,"","",null,"",""]
["641_7","coal",null,null,641,"Crist","FL","Unit 7","7","Conventional Boiler","Wall firing - front firing",500,5279.7920000000004,10.559584000000001,"bituminous","bituminous",null,null,null,null,null,null,null,null,null,null,null,null,null,null,null,null,null,null,null,null,null,null,null,null,null,null,null,null,null,null,null,null,null,null,2.5000000000000012E-2,0.26398960000000016,null,null,null,null,null,null,2.5000000000000012E-2,0.26398960000000016,"NOx control","Selective Catalytic Reduction","2005-04-01","PM control","Electrostatic precipitator, cold side, w/o flue gas conditioning","2004-04-01","SO2 control","Wet FGD - Spray Type","2009-12-01","","",null,"","",null,"","",null,"","",null,"","",null,"","",null,"","",null,"","",null,"",""]
["645_3","coal",null,null,645,"Big Bend","FL","BB03_SCR_iso","3","Conventional Boiler","Wall firing - opposed firing",400,4115,10.2875,"coal - bituminous, petroleum coke","subbituminous",null,null,null,null,null,null,null,null,null,null,null,null,null,null,null,null,null,null,null,null,null,null,null,null,null,null,null,null,null,null,null,null,null,null,null,null,null,null,null,null,0.16233292831105711,1.67,0.16233292831105711,1.67,"NOx control","Selective Catalytic Reduction","2008-07-01","PM control","Electrostatic precipitator, hot side, w/o flue gas conditioning","1976-05-01","SO2 control","Wet FGD - Packed Type","2008-01-01","","",null,"","",null,"","",null,"","",null,"","",null,"","",null,"","",null,"","",null,"",""]
["645_4","coal",null,null,645,"Big Bend","FL","BB04_SCR_iso","4","Conventional Boiler","Tangential firing",465,4330,9.3118279569892479,"coal - bituminous, petroleum coke, coal refuse","subbituminous",null,null,null,null,null,null,null,null,null,null,null,null,null,null,null,null,null,null,null,null,null,null,null,null,null,null,null,null,null,null,null,null,null,null,null,null,null,null,null,null,0.30394856468080217,2.8303167420814481,0.30394856468080217,2.8303167420814481,"NOx control","Selective Catalytic Reduction","2007-06-01","PM control","Electrostatic precipitator, hot side, w/o flue gas conditioning","1985-02-01","SO2 control","Wet FGD - Packed Type","2008-01-01","","",null,"","",null,"","",null,"","",null,"","",null,"","",null,"","",null,"","",null,"",""]
["663_B-2","coal",null,null,663,"Deerhaven Generating Station","FL","001","B-2","Conventional Boiler","Wall firing - unspecified",235,2428,10.331914893617022,"","Bituminous",null,null,null,null,null,null,null,null,null,null,null,null,null,null,null,null,null,null,null,null,null,null,null,null,null,null,null,null,null,null,null,null,null,null,null,null,null,null,null,null,1.04,10.745191489361703,1.04,10.745191489361703,"PM control","Electrostatic precipitator, hot side, unspecified","1987-10-01","NOx control","Selective Catalytic Reduction","2009-05-01","SO2 control","Dry FGD - Unspecified","2009-05-01","","",null,"","",null,"","",null,"","",null,"","",null,"","",null,"","",null,"","",null,"",""]
["884_4","coal",null,null,884,"Will County","IL","WC4CONFIG","4","Conventional Boiler","Tangential firing",542,5254.5300000000007,9.6947047970479723,"subbituminous","subbituminous",null,null,null,null,null,null,null,null,null,null,null,null,null,null,null,null,null,null,null,null,null,null,null,null,null,null,null,null,null,null,null,null,null,null,0.47749999999999992,4.6292215405904065,null,null,null,null,null,null,0.47749999999999992,4.6292215405904065,"Other control","Activated carbon injection","2009-07-01","PM control","Electrostatic precipitator, cold side, w/o flue gas conditioning","1963-06-01","","",null,"","",null,"","",null,"","",null,"","",null,"","",null,"","",null,"","",null,"","",null,"",""]
["891_Boiler 9","coal",null,null,891,"Havana","IL","Boiler 9","Boiler 9","Conventional Boiler","Wall firing - unspecified",481,5030,10.457380457380458,"bituminous","bituminous",9.2570980703007442E-4,5.806087195217205E-3,null,null,null,null,null,null,null,null,null,null,null,null,null,null,null,null,null,null,null,null,null,null,null,null,null,null,null,null,null,null,null,null,0.43072413793103448,4.5042461825220448,null,null,null,null,null,null,0.43072413793103448,4.5042461825220448,"PM control","Electrostatic precipitator, hot side, unspecified","1978-04-01","NOx control","Selective Catalytic Reduction","2003-08-01","Other control","Activated carbon injection","2009-07-01","SO2 control","Dry FGD - Spray Dryer",null,"PM control","Fabric Filter, unspecified","2009-06-01","","",null,"","",null,"","",null,"","",null,"","",null,"","",null,"",""]
["1217_1","coal",null,null,1217,"Earl F Wisdom","IA","1","1","Conventional Boiler","Wall firing - front firing",40,477,11.925000000000001,"coal - bituminous","bituminous",null,null,null,null,null,null,null,null,null,null,null,null,null,null,null,null,null,null,null,null,null,null,null,null,null,null,null,null,null,null,null,null,null,null,null,null,null,null,null,null,2.1,25.042500000000004,2.1,25.042500000000004,"PM control","Multiple cyclone","1960-04-01","PM control","Electrostatic precipitator, cold side, w/o flue gas conditioning","1975-07-01","","",null,"","",null,"","",null,"","",null,"","",null,"","",null,"","",null,"","",null,"","",null,"",""]
["1250_3","coal",null,null,1250,"Lawrence Energy Center","KS","3","3","Conventional Boiler","Tangential firing",58,645,11.120689655172415,"bituminous","bituminous",8.2210120695469133E-4,5.1521321140195683E-3,null,null,null,null,null,null,null,null,null,null,8.6666666666666663E-3,9.6379310344827593E-2,null,null,8.6666666666666663E-3,9.6379310344827593E-2,null,null,null,null,null,null,null,null,null,null,9.0000000000000008E-4,1.0008620689655174E-2,null,null,9.0000000000000008E-4,1.0008620689655174E-2,233.32529032819443,2594.7381424428522,null,null,0.39750000000000002,4.4204741379310351,null,null,0.39750000000000002,4.4204741379310351,"PM control","Electrostatic precipitator, cold side, w/o flue gas conditioning","1977-06-01","","",null,"","",null,"","",null,"","",null,"","",null,"","",null,"","",null,"","",null,"","",null,"","",null,"",""]
["1606_1","coal",null,null,1606,"Mount Tom","MA","1 current","1","Conventional Boiler","Wall firing - front firing",155,1480,9.5483870967741939,"coal - bituminous","bituminous",null,null,null,null,null,null,null,null,null,null,null,null,null,null,null,null,null,null,null,null,null,null,null,null,null,null,null,null,null,null,null,null,null,null,null,null,null,null,null,null,6.6000000000000003E-2,0.63019354838709685,6.6000000000000003E-2,0.63019354838709685,"NOx control","Selective Catalytic Reduction","2006-06-01","PM control","Electrostatic precipitator, cold side, w/o flue gas conditioning","1982-09-01","SO2 control","Dry FGD - Circulating Dry Scrubber","2009-12-01","PM control","Fabric Filter, pulse","2009-12-01","","",null,"","",null,"","",null,"","",null,"","",null,"","",null,"","",null,"",""]
["2049_4","coal",null,null,2049,"Jack Watson","MS","Unit 4","4","Conventional Boiler","Wall firing - front firing",250,2226.86,8.9074400000000011,"coal - bituminous","bituminous",null,null,null,null,null,null,null,null,null,null,null,null,null,null,null,null,null,null,null,null,null,null,null,null,null,null,null,null,null,null,null,null,null,null,null,null,null,null,null,null,0.77900000000000003,6.9388957600000012,0.77900000000000003,6.9388957600000012,"PM control","Electrostatic precipitator, cold side, w/o flue gas conditioning","1968-07-01","","",null,"","",null,"","",null,"","",null,"","",null,"","",null,"","",null,"","",null,"","",null,"","",null,"",""]
["2049_5","coal",null,null,2049,"Jack Watson","MS","Unit 5","5","Conventional Boiler","Wall firing - front firing",500,4752.8599999999997,9.5057200000000002,"coal - bituminous","bituminous",null,null,null,null,null,null,null,null,null,null,null,null,null,null,null,null,null,null,null,null,null,null,null,null,null,null,null,null,null,null,null,null,null,null,null,null,null,null,null,null,0.87860000000000005,8.3517255920000011,0.87860000000000005,8.3517255920000011,"PM control","Electrostatic precipitator, cold side, w/ flue gas conditioning","1973-05-01","","",null,"","",null,"","",null,"","",null,"","",null,"","",null,"","",null,"","",null,"","",null,"","",null,"",""]
["2324_2","coal",null,null,2324,"Reid Gardner","NV","2","2","Conventional Boiler","Wall firing - front firing",111,1215,10.945945945945946,"","bituminous",null,null,null,null,null,null,null,null,null,null,null,null,null,null,null,null,null,null,null,null,null,null,null,null,null,null,null,null,null,null,null,null,null,null,null,null,null,null,null,null,8.3000000000000004E-2,0.9085135135135135,8.3000000000000004E-2,0.9085135135135135,"PM control","Fabric Filter, pulse","2009-04-01","SO2 control","Wet FGD - Venturi Type","1976-07-01","","",null,"","",null,"","",null,"","",null,"","",null,"","",null,"","",null,"","",null,"","",null,"",""]
["2324_4","coal",null,null,2324,"Reid Gardner","NV","4","4","Conventional Boiler","Wall firing - front firing",281,2956,10.519572953736654,"","bituminous",null,null,null,null,null,null,null,null,null,null,null,null,null,null,null,null,null,null,null,null,null,null,null,null,null,null,null,null,null,null,null,null,null,null,null,null,null,null,null,null,5.9100000000000007E-2,0.62170676156583637,5.9100000000000007E-2,0.62170676156583637,"PM control","Fabric Filter, pulse","1983-07-01","SO2 control","Wet FGD - Venturi Type","1983-07-01","","",null,"","",null,"","",null,"","",null,"","",null,"","",null,"","",null,"","",null,"","",null,"",""]
["2364_2","coal",null,null,2364,"Merrimack Station","NH","mk2","2","Conventional Boiler","Cyclone firing",337,3017,8.9525222551928785,"bituminous","bituminous",null,null,null,null,null,null,null,null,null,null,null,null,null,null,null,null,null,null,null,null,null,null,null,null,null,null,null,null,null,null,null,null,null,null,2.1748000000000003,19.469945400593474,null,null,null,null,null,null,2.1748000000000003,19.469945400593474,"NOx control","Selective Catalytic Reduction","1995-05-01","Other control","Activated carbon injection",null,"PM control","Electrostatic precipitator, cold side, w/o flue gas conditioning","1999-11-01","PM control","Electrostatic precipitator, cold side, w/o flue gas conditioning","1968-05-01","","",null,"","",null,"","",null,"","",null,"","",null,"","",null,"","",null,"",""]
["2480_3","coal",null,null,2480,"Danskammer Generating Station","NY","3","3","Conventional Boiler","Tangential firing",144.9,1365,9.420289855072463,"bituminous","bituminous",null,null,null,null,null,null,null,null,null,null,null,null,null,null,null,null,null,null,null,null,null,null,null,null,null,null,null,null,null,null,null,null,null,null,null,null,0.96577255184564781,9.0978573724589999,null,null,null,null,0.96577255184564781,9.0978573724589999,"PM control","Electrostatic precipitator, cold side, w/o flue gas conditioning","1987-09-01","","",null,"","",null,"","",null,"","",null,"","",null,"","",null,"","",null,"","",null,"","",null,"","",null,"",""]
["2480_4","coal",null,null,2480,"Danskammer Generating Station","NY","4","4","Conventional Boiler","Tangential firing",242.3,2535,10.46223689640941,"bituminous","bituminous",null,null,null,null,null,null,null,null,null,null,null,null,null,null,null,null,null,null,null,null,null,null,null,null,null,null,null,null,null,null,null,null,null,null,null,null,0.94266462506591819,9.8623806213045917,null,null,null,null,0.94266462506591819,9.8623806213045917,"PM control","Electrostatic precipitator, cold side, w/o flue gas conditioning","1987-09-01","","",null,"","",null,"","",null,"","",null,"","",null,"","",null,"","",null,"","",null,"","",null,"","",null,"",""]
["2824_1","coal",null,null,2824,"Stanton","ND","u1","1","Conventional Boiler","Wall firing - front firing",132,1800,13.636363636363637,"subbituminous","subbituminous",null,null,null,null,null,null,null,null,null,null,null,null,null,null,null,null,null,null,null,null,null,null,null,null,null,null,null,null,null,null,null,null,null,null,null,null,null,null,null,null,0.37624331130273792,5.1305906086736988,0.37624331130273792,5.1305906086736988,"PM control","Electrostatic precipitator, cold side, w/o flue gas conditioning","2000-01-01","PM control","Electrostatic precipitator, cold side, w/o flue gas conditioning","2000-01-01","","",null,"","",null,"","",null,"","",null,"","",null,"","",null,"","",null,"","",null,"","",null,"",""]
["2824_10","coal",null,null,2824,"Stanton","ND","u10","10","Conventional Boiler","Tangential firing",60,642,10.7,"coal - subbituminous","subbituminous",null,null,null,null,null,null,null,null,null,null,null,null,null,null,null,null,null,null,null,null,null,null,null,null,null,null,null,null,null,null,null,null,null,null,null,null,null,null,null,null,7.6601195105882132E-3,8.1963278763293873E-2,7.6601195105882132E-3,8.1963278763293873E-2,"SO2 control","Dry FGD - Spray Dryer","2000-01-01","PM control","Fabric Filter, reverse air","2000-01-01","","",null,"","",null,"","",null,"","",null,"","",null,"","",null,"","",null,"","",null,"","",null,"",""]
["2832_Unit 7","coal",null,null,2832,"Miami Fort","OH","U7","Unit 7","Conventional Boiler","Wall firing - opposed firing",550,4995,9.081818181818182,"coal - bituminous","bituminous",null,null,null,null,null,null,null,null,null,null,null,null,null,null,null,null,null,null,null,null,null,null,null,null,null,null,null,null,null,null,null,null,null,null,null,null,null,null,null,null,0.15766666666666668,1.4319000000000002,0.15766666666666668,1.4319000000000002,"NOx control","Selective Catalytic Reduction","2007-01-01","SO2 control","Wet FGD - Spray Type","2007-01-01","Other control","Dry sorbent injection","2007-01-01","PM control","Electrostatic precipitator, cold side, w/o flue gas conditioning","1975-05-01","","",null,"","",null,"","",null,"","",null,"","",null,"","",null,"","",null,"",""]
["2832_Unit 8","coal",null,null,2832,"Miami Fort","OH","U8","Unit 8","Conventional Boiler","Wall firing - opposed firing",550,5003,9.0963636363636358,"coal - bituminous","bituminous",null,null,null,null,null,null,null,null,null,null,null,null,null,null,null,null,null,null,null,null,null,null,null,null,null,null,null,null,null,null,null,null,null,null,null,null,null,null,null,null,0.14466666666666669,1.3159406060606063,0.14466666666666669,1.3159406060606063,"NOx control","Selective Catalytic Reduction","2001-01-01","SO2 control","Wet FGD - Spray Type","2007-01-01","Other control","Dry sorbent injection","2007-01-01","PM control","Electrostatic precipitator, cold side, w/o flue gas conditioning","1978-02-01","","",null,"","",null,"","",null,"","",null,"","",null,"","",null,"","",null,"",""]
["2848_H-1","coal",null,null,2848,"O H Hutchings","OH","H-1","H-1","Conventional Boiler","Tangential firing",53,607,11.452830188679245,"coal - bituminous","bituminous",null,null,null,null,null,null,null,null,null,null,null,null,null,null,null,null,null,null,null,null,null,null,null,null,null,null,null,null,null,null,null,null,null,null,null,null,null,null,null,null,1.05,12.025471698113208,1.05,12.025471698113208,"PM control","Electrostatic precipitator, hot side, w/o flue gas conditioning","1973-01-01","","",null,"","",null,"","",null,"","",null,"","",null,"","",null,"","",null,"","",null,"","",null,"","",null,"",""]
["2848_H-2","coal",null,null,2848,"O H Hutchings","OH","H-2","H-2","Conventional Boiler","Tangential firing",53,574,10.830188679245284,"coal - bituminous","bituminous",null,null,null,null,null,null,null,null,null,null,null,null,null,null,null,null,null,null,null,null,null,null,null,null,null,null,null,null,null,null,null,null,null,null,null,null,null,null,null,null,1.1633333333333333,12.599119496855346,1.1633333333333333,12.599119496855346,"PM control","Electrostatic precipitator, hot side, w/o flue gas conditioning","1973-01-01","","",null,"","",null,"","",null,"","",null,"","",null,"","",null,"","",null,"","",null,"","",null,"","",null,"",""]
["2848_H-3","coal",null,null,2848,"O H Hutchings","OH","H-3","H-3","Conventional Boiler","Tangential firing",62.5,716,11.456,"coal - bituminous","bituminous",null,null,null,null,null,null,null,null,null,null,null,null,null,null,null,null,null,null,null,null,null,null,null,null,null,null,null,null,null,null,null,null,null,null,null,null,null,null,null,null,1.0766666666666669,12.334293333333335,1.0766666666666669,12.334293333333335,"PM control","Electrostatic precipitator, hot side, w/o flue gas conditioning","1973-01-01","","",null,"","",null,"","",null,"","",null,"","",null,"","",null,"","",null,"","",null,"","",null,"","",null,"",""]
["2848_H-4","coal",null,null,2848,"O H Hutchings","OH","H-4","H-4","Conventional Boiler","Tangential firing",64,696,10.875,"coal - bituminous","bituminous",null,null,null,null,null,null,null,null,null,null,null,null,null,null,null,null,null,null,null,null,null,null,null,null,null,null,null,null,null,null,null,null,null,null,null,null,null,null,null,null,1.23,13.376250000000001,1.23,13.376250000000001,"PM control","Electrostatic precipitator, hot side, w/o flue gas conditioning","1973-01-01","","",null,"","",null,"","",null,"","",null,"","",null,"","",null,"","",null,"","",null,"","",null,"","",null,"",""]
["2848_H-6","coal",null,null,2848,"O H Hutchings","OH","H-6","H-6","Conventional Boiler","Tangential firing",60.5,646,10.677685950413224,"coal - bituminous","bituminous",null,null,null,null,null,null,null,null,null,null,null,null,null,null,null,null,null,null,null,null,null,null,null,null,null,null,null,null,null,null,null,null,null,null,null,null,null,null,null,null,1.2300000000000002,13.133553719008267,1.2300000000000002,13.133553719008267,"PM control","Electrostatic precipitator, hot side, w/o flue gas conditioning","1973-01-01","","",null,"","",null,"","",null,"","",null,"","",null,"","",null,"","",null,"","",null,"","",null,"","",null,"",""]
["2963_3313","coal",null,null,2963,"Northeastern","OK","NE-3","3313","Conventional Boiler","Tangential firing",490,4775,9.7448979591836729,"subbituminous","subbituminous",null,null,null,null,null,null,null,null,null,null,null,null,null,null,null,null,null,null,null,null,null,null,null,null,null,null,null,null,null,null,null,null,null,null,0.52496153846153837,5.1156966248037667,null,null,null,null,null,null,0.52496153846153837,5.1156966248037667,"PM control","Electrostatic precipitator, cold side, w/o flue gas conditioning","1979-01-01","","",null,"","",null,"","",null,"","",null,"","",null,"","",null,"","",null,"","",null,"","",null,"","",null,"",""]
["3136_1","coal",null,null,3136,"Keystone","PA","KEY-1-4","1","Conventional Boiler","Tangential firing",936,8695,9.2895299145299148,"coal - bituminous","bituminous",null,null,null,null,null,null,null,null,null,null,null,null,null,null,null,null,null,null,null,null,null,null,null,null,null,null,null,null,null,null,null,null,null,null,null,null,null,null,null,null,0.42016666666666663,3.9031508190883191,0.42016666666666663,3.9031508190883191,"NOx control","Selective Catalytic Reduction","2003-05-01","PM control","Electrostatic precipitator, cold side, w/ flue gas conditioning","1974-04-01","SO2 control","Wet FGD - Spray Type","2009-09-01","","",null,"","",null,"","",null,"","",null,"","",null,"","",null,"","",null,"","",null,"",""]
["3136_2","coal",null,null,3136,"Keystone","PA","KEY-2-4","2","Conventional Boiler","Tangential firing",936,8695,9.2895299145299148,"coal - bituminous","bituminous",null,null,null,null,null,null,null,null,null,null,null,null,null,null,null,null,null,null,null,null,null,null,null,null,null,null,null,null,null,null,null,null,null,null,null,null,null,null,null,null,0.39333333333333331,3.6538817663817662,0.39333333333333331,3.6538817663817662,"NOx control","Selective Catalytic Reduction","2003-05-01","PM control","Electrostatic precipitator, cold side, w/ flue gas conditioning","1974-04-01","SO2 control","Wet FGD - Spray Type","2009-11-01","","",null,"","",null,"","",null,"","",null,"","",null,"","",null,"","",null,"","",null,"",""]
["3788_5","coal",null,null,3788,"Potomac River","VA","5","5","Conventional Boiler","Tangential firing",108,961,8.8981481481481488,"coal - bituminous","bituminous",null,null,null,null,null,null,null,null,null,null,null,null,null,null,null,null,null,null,null,null,null,null,null,null,null,null,null,null,null,null,null,null,null,null,null,null,null,null,null,null,0.32,2.8474074074074078,0.32,2.8474074074074078,"SO2 control","Dry FGD - Sorbent Injection","2006-05-01","PM control","Electrostatic precipitator, hot side, w/o flue gas conditioning","1978-10-01","PM control","Electrostatic precipitator, cold side, w/o flue gas conditioning","1957-05-01","","",null,"","",null,"","",null,"","",null,"","",null,"","",null,"","",null,"","",null,"",""]
["3947_1","coal",null,null,3947,"Kammer","WV","K-1","1","Conventional Boiler","Cyclone firing",237.5,2156,9.0778947368421061,"bituminous","bituminous",null,null,null,null,null,null,null,null,null,null,null,null,null,null,null,null,null,null,null,null,null,null,null,null,null,null,null,null,null,null,null,null,null,null,2.0177333333333336,18.316770807017548,null,null,null,null,null,null,2.0177333333333336,18.316770807017548,"PM control","Electrostatic precipitator, cold side, w/o flue gas conditioning","1978-08-01","","",null,"","",null,"","",null,"","",null,"","",null,"","",null,"","",null,"","",null,"","",null,"","",null,"",""]
["3947_3","coal",null,null,3947,"Kammer","WV","K-3","3","Conventional Boiler","Cyclone firing",237.5,2156,9.0778947368421061,"bituminous","bituminous",null,null,null,null,null,null,null,null,null,null,null,null,null,null,null,null,null,null,null,null,null,null,null,null,null,null,null,null,null,null,null,null,null,null,2.0177333333333336,18.316770807017548,null,null,null,null,null,null,2.0177333333333336,18.316770807017548,"PM control","Electrostatic precipitator, cold side, w/o flue gas conditioning","1978-04-01","","",null,"","",null,"","",null,"","",null,"","",null,"","",null,"","",null,"","",null,"","",null,"","",null,"",""]
["4078_3","coal",null,null,4078,"Weston","WI","W3","3","Conventional Boiler","Tangential firing",365.6,3423.48,9.364004376367614,"subbituminous","subbituminous",null,null,null,null,null,null,null,null,null,null,null,null,null,null,null,null,null,null,null,null,null,null,null,null,null,null,null,null,null,null,null,null,null,null,0.56486666666666663,5.2894139387308527,null,null,null,null,null,null,0.56486666666666663,5.2894139387308527,"PM control","Fabric Filter, pulse","2001-05-01","Other control","Activated carbon injection",null,"","",null,"","",null,"","",null,"","",null,"","",null,"","",null,"","",null,"","",null,"","",null,"",""]
["6041_1","coal",null,null,6041,"H L Spurlock Station","KY","Unit 01","1","Conventional Boiler","Wall firing - opposed firing",344,3641,10.584302325581396,"bituminous","bituminous",null,null,null,null,null,null,null,null,null,null,null,null,null,null,null,null,null,null,null,null,null,null,null,null,null,null,null,null,null,null,null,null,null,null,0.24906666666666669,2.6361968992248066,null,null,null,null,0.10866666666666668,1.1501608527131784,0.10866666666666668,1.1501608527131784,"PM control","Electrostatic precipitator, cold side, w/o flue gas conditioning","2003-05-01","NOx control","Selective Catalytic Reduction","2003-05-01","SO2 control","Wet FGD - Unspecified","2009-04-01","Other control","Wet electrostatic precipitator","2009-04-01","","",null,"","",null,"","",null,"","",null,"","",null,"","",null,"","",null,"",""]
["6041_2","coal",null,null,6041,"H L Spurlock Station","KY","Unit 02","2","Conventional Boiler","Tangential firing",555,5600,10.09009009009009,"bituminous","bituminous",null,null,null,null,null,null,null,null,null,null,null,null,null,null,null,null,null,null,null,null,null,null,null,null,null,null,null,null,null,null,null,null,null,null,0.14053333333333332,1.4179939939939938,null,null,null,null,null,null,0.14053333333333332,1.4179939939939938,"PM control","Electrostatic precipitator, hot side, w/o flue gas conditioning","1981-02-01","NOx control","Selective Catalytic Reduction","2002-05-01","SO2 control","Wet FGD - Unspecified","2008-10-01","Other control","Wet electrostatic precipitator","2008-10-01","","",null,"","",null,"","",null,"","",null,"","",null,"","",null,"","",null,"",""]
["6073_1","coal",null,null,6073,"Victor J. Daniel Jr","MS","Unit 1","1","Conventional Boiler","Tangential firing",537,5206.3059999999996,9.6951694599627558,"coal - subbituminous, coal - bituminous","subbituminous, bituminous",null,null,null,null,null,null,null,null,null,null,null,null,null,null,null,null,null,null,null,null,null,null,null,null,null,null,null,null,null,null,null,null,null,null,null,null,null,null,null,null,0.60799999999999998,5.8946630316573554,0.60799999999999998,5.8946630316573554,"PM control","Electrostatic precipitator, cold side, w/ flue gas conditioning","1998-01-01","PM control","Electrostatic precipitator, cold side, w/ flue gas conditioning","1998-01-01","","",null,"","",null,"","",null,"","",null,"","",null,"","",null,"","",null,"","",null,"","",null,"",""]
["6073_2","coal",null,null,6073,"Victor J. Daniel Jr","MS","Unit 2","2","Conventional Boiler","Tangential firing",536,5166.7280000000001,9.6394179104477615,"coal - subbituminous, coal - bituminous","subbituminous, bituminous",null,null,null,null,null,null,null,null,null,null,null,null,null,null,null,null,null,null,null,null,null,null,null,null,null,null,null,null,null,null,null,null,null,null,null,null,null,null,null,null,0.74,7.1331692537313431,0.74,7.1331692537313431,"PM control","Electrostatic precipitator, cold side, w/ flue gas conditioning","1998-01-01","PM control","Electrostatic precipitator, cold side, w/ flue gas conditioning","1998-01-01","","",null,"","",null,"","",null,"","",null,"","",null,"","",null,"","",null,"","",null,"","",null,"",""]
["6085_18","coal",null,null,6085,"R.M. Schahfer","IN","R.M.0018","18","Conventional Boiler","Tangential firing",393,3967,10.0941475826972,"bituminous","bituminous",null,null,null,null,null,null,null,null,null,null,null,null,null,null,null,null,null,null,null,null,null,null,null,null,null,null,null,null,null,null,null,null,null,null,null,null,0.31636356854335479,3.1934205506653646,null,null,null,null,0.31636356854335479,3.1934205506653646,"PM control","Electrostatic precipitator, cold side, w/o flue gas conditioning","1986-01-01","SO2 control","Wet FGD - Spray Type","1986-02-01","","",null,"","",null,"","",null,"","",null,"","",null,"","",null,"","",null,"","",null,"","",null,"",""]
["6166_MB2","coal",null,null,6166,"Rockport","IN","RP-2","MB2","Conventional Boiler","Wall firing - opposed firing",1320,12374,9.3742424242424249,"subbituminous","subbituminous",null,null,null,null,null,null,null,null,null,null,null,null,null,null,null,null,null,null,null,null,null,null,null,null,null,null,null,null,null,null,null,null,null,null,0.57263333333333322,5.3680036868686862,null,null,null,null,null,null,0.57263333333333322,5.3680036868686862,"Other control","Activated carbon injection","2009-09-01","PM control","Electrostatic precipitator, cold side, w/o flue gas conditioning","1989-12-01","","",null,"","",null,"","",null,"","",null,"","",null,"","",null,"","",null,"","",null,"","",null,"",""]
["6177_U1B","coal",null,null,6177,"Coronado Generating Station","AZ","U1B","U1B","Conventional Boiler","Wall firing - unspecified",456.6,4719,10.33508541392904,"","Bituminous, Subbituminous",null,null,null,null,null,null,null,null,null,null,null,null,null,null,null,null,null,null,null,null,null,null,null,null,null,null,null,null,null,null,null,null,null,null,null,null,null,null,null,null,0.28999999999999998,2.9971747700394213,0.28999999999999998,2.9971747700394213,"PM control","Electrostatic precipitator, hot side, unspecified","1979-12-01","","",null,"","",null,"","",null,"","",null,"","",null,"","",null,"","",null,"","",null,"","",null,"","",null,"",""]
["6177_U2B","coal",null,null,6177,"Coronado Generating Station","AZ","U2B","U2B","Conventional Boiler","Wall firing - unspecified",456.6,4719,10.33508541392904,"","Bituminous, Subbituminous",null,null,null,null,null,null,null,null,null,null,null,null,null,null,null,null,null,null,null,null,null,null,null,null,null,null,null,null,null,null,null,null,null,null,null,null,null,null,null,null,0.28000000000000003,2.8938239159001315,0.28000000000000003,2.8938239159001315,"PM control","Electrostatic precipitator, hot side, unspecified","1980-10-01","","",null,"","",null,"","",null,"","",null,"","",null,"","",null,"","",null,"","",null,"","",null,"","",null,"",""]
["6648_4","coal",null,null,6648,"Sandow No 4","TX","4","4","Conventional Boiler","Tangential firing",568,7810,13.75,"coal - lignite","Lignite",null,null,null,null,null,null,null,null,null,null,null,null,null,null,null,null,null,null,null,null,null,null,null,null,null,null,null,null,null,null,null,null,null,null,null,null,null,null,null,null,1.0080393928289542,13.860541651398119,1.0080393928289542,13.860541651398119,"NOx control","Selective Catalytic Reduction",null,"Other control","Activated carbon injection",null,"PM control","Electrostatic precipitator, cold side, w/o flue gas conditioning","1981-05-01","SO2 control","Wet FGD - Spray Type","1981-05-01","","",null,"","",null,"","",null,"","",null,"","",null,"","",null,"","",null,"",""]
[{"$f":"E322&\"_\"&I322","v":"7790_1-1"},"coal",null,null,7790,"Bonanza Power Plant","UT","1-1","1-1","Conventional Boiler","Wall firing - opposed firing",483,4899,10.142857142857142,"Bituminous","Bituminous",null,null,null,null,null,null,null,null,null,null,null,null,null,null,null,null,null,null,null,null,null,null,null,null,null,null,null,null,null,null,null,null,null,null,null,null,null,null,null,null,4.9429792976800398E-2,0.50135932876468969,4.9429792976800398E-2,0.50135932876468969,"PM control","Fabric Filter, reverse air","1985-11-01","SO2 control","Wet FGD - Spray Type","1985-11-01","","",null,"","",null,"","",null,"","",null,"","",null,"","",null,"","",null,"","",null,"","",null,"",""]
["8223_1","coal",null,null,8223,"Springerville","AZ","1","1","Conventional Boiler","Tangential firing",427,3830,8.9695550351288063,"coal - subbituminous","subbituminous",null,null,null,null,null,null,null,null,null,null,null,null,null,null,null,null,null,null,null,null,null,null,null,null,null,null,null,null,null,null,null,null,null,null,null,null,null,null,null,null,7.0999999999999994E-2,0.63683840749414522,7.0999999999999994E-2,0.63683840749414522,"SO2 control","Dry FGD - Spray Dryer","1985-06-01","PM control","Fabric Filter, reverse air","1985-06-01","","",null,"","",null,"","",null,"","",null,"","",null,"","",null,"","",null,"","",null,"","",null,"",""]
["8223_2","coal",null,null,8223,"Springerville","AZ","2","2","Conventional Boiler","Tangential firing",430,3830,8.9069767441860463,"bituminous","bituminous",null,null,null,null,null,null,null,null,null,null,null,null,null,null,null,null,null,null,null,null,null,null,null,null,null,null,null,null,null,null,null,null,null,null,null,null,null,null,null,null,5.6000000000000001E-2,0.49879069767441858,5.6000000000000001E-2,0.49879069767441858,"SO2 control","Dry FGD - Spray Dryer","1990-06-01","PM control","Fabric Filter, reverse air","1990-06-01","","",null,"","",null,"","",null,"","",null,"","",null,"","",null,"","",null,"","",null,"","",null,"",""]
["8224_1","coal",null,null,8224,"North Valmy","NV","1","1","Conventional Boiler","Wall firing - opposed firing",243.5,2560,10.513347022587268,"","subbituminous, bituminous",null,null,null,null,null,null,null,null,null,null,null,null,null,null,null,null,null,null,null,null,null,null,null,null,null,null,null,null,null,null,null,null,null,null,null,null,null,null,null,null,0.67,7.0439425051334705,0.67,7.0439425051334705,"PM control","Fabric Filter, reverse air","1981-12-01","","",null,"","",null,"","",null,"","",null,"","",null,"","",null,"","",null,"","",null,"","",null,"","",null,"",""]
["8224_2","coal",null,null,8224,"North Valmy","NV","2","2","Conventional Boiler","Wall firing - front firing",270.2,2881,10.662472242783124,"","subbituminous, bituminous",null,null,null,null,null,null,null,null,null,null,null,null,null,null,null,null,null,null,null,null,null,null,null,null,null,null,null,null,null,null,null,null,null,null,null,null,null,null,null,null,5.8666666666666666E-2,0.62553170490994325,5.8666666666666666E-2,0.62553170490994325,"SO2 control","Dry FGD - Spray Dryer","1985-05-01","PM control","Fabric Filter, reverse air","1985-05-01","","",null,"","",null,"","",null,"","",null,"","",null,"","",null,"","",null,"","",null,"","",null,"",""]
["10002_1","coal",null,null,10002,"ACE Cogeneration Company","CA","Config 1","1","Fluidized bed firing","Fluidized bed firing",117,1052,8.9914529914529915,"bituminous","bituminous",null,null,null,null,null,null,null,null,null,null,null,null,null,null,null,null,null,null,null,null,null,null,null,null,null,null,null,null,null,null,null,null,null,null,5.4566666666666666E-2,0.49063361823361823,null,null,null,null,5.1999999999999998E-2,0.46755555555555556,5.1999999999999998E-2,0.46755555555555556,"NOx control","Selective Noncatalytic Reduction","1991-01-01","PM control","Fabric Filter, reverse air","1991-01-01","","",null,"","",null,"","",null,"","",null,"","",null,"","",null,"","",null,"","",null,"","",null,"",""]
["10113_CFB1","coal",null,null,10113,"John B Rich Memorial Power Station","PA","CFB1","CFB1","Fluidized bed firing","Fluidized bed firing",44,520,11.818181818181818,"coal refuse (culm or gob)","coal refuse (culm or gob)",null,null,null,null,null,null,null,null,null,null,null,null,null,null,null,null,null,null,null,null,null,null,null,null,null,null,null,null,null,null,null,null,null,null,null,null,0.34643133768651119,4.0941885362951327,null,null,null,null,0.34643133768651119,4.0941885362951327,"PM control","Fabric Filter, pulse",null,"","",null,"","",null,"","",null,"","",null,"","",null,"","",null,"","",null,"","",null,"","",null,"","",null,"",""]
["10113_CFB2","coal",null,null,10113,"John B Rich Memorial Power Station","PA","CFB2","CFB2","Fluidized bed firing","Fluidized bed firing",44,520,11.818181818181818,"coal refuse (culm or gob)","coal refuse (culm or gob)",null,null,null,null,null,null,null,null,null,null,null,null,null,null,null,null,null,null,null,null,null,null,null,null,null,null,null,null,null,null,null,null,null,null,null,null,0.34643133768651119,4.0941885362951327,null,null,null,null,0.34643133768651119,4.0941885362951327,"PM control","Fabric Filter, pulse",null,"","",null,"","",null,"","",null,"","",null,"","",null,"","",null,"","",null,"","",null,"","",null,"","",null,"",""]
["10384_1A","coal",null,null,10384,"Edgecombe Genco, LLC","NC","Gen 1","1A","Conventional Boiler","Stoker - overfeed",30.5,375,12.295081967213115,"bituminous","bituminous",null,null,null,null,null,null,null,null,null,null,null,null,null,null,null,null,null,null,null,null,null,null,null,null,null,null,null,null,null,null,null,null,null,null,2.7800000000000009E-2,0.34180327868852467,null,null,null,null,null,null,2.7800000000000009E-2,0.34180327868852467,"SO2 control","Dry FGD - Spray Dryer","1990-10-01","SO2 control","Dry FGD - Spray Dryer","1990-10-01","PM control","Fabric Filter, reverse air","1990-10-01","PM control","Fabric Filter, pulse","1990-10-01","","",null,"","",null,"","",null,"","",null,"","",null,"","",null,"","",null,"",""]
["10384_1B","coal",null,null,10384,"Edgecombe Genco, LLC","NC","Gen 1","1B","Conventional Boiler","Stoker - overfeed",30.5,375,12.295081967213115,"bituminous","bituminous",null,null,null,null,null,null,null,null,null,null,null,null,null,null,null,null,null,null,null,null,null,null,null,null,null,null,null,null,null,null,null,null,null,null,2.7800000000000009E-2,0.34180327868852467,null,null,null,null,null,null,2.7800000000000009E-2,0.34180327868852467,"SO2 control","Dry FGD - Spray Dryer","1990-10-01","SO2 control","Dry FGD - Spray Dryer","1990-10-01","PM control","Fabric Filter, reverse air","1990-10-01","PM control","Fabric Filter, pulse","1990-10-01","","",null,"","",null,"","",null,"","",null,"","",null,"","",null,"","",null,"",""]
["10384_2A","coal",null,null,10384,"Edgecombe Genco, LLC","NC","Gen 2","2A","Conventional Boiler","Stoker - overfeed",30.5,375,12.295081967213115,"bituminous","bituminous",9.5136849090070474E-2,5.0961412617514358E-3,null,null,null,null,null,null,null,null,null,null,null,null,null,null,null,null,null,null,null,null,null,null,null,null,null,null,null,null,null,null,null,null,5.6800000000000003E-2,0.69836065573770501,null,null,null,null,null,null,5.6800000000000003E-2,0.69836065573770501,"SO2 control","Dry FGD - Spray Dryer","1990-10-01","SO2 control","Dry FGD - Spray Dryer","1990-10-01","PM control","Fabric Filter, reverse air","1990-10-01","PM control","Fabric Filter, reverse air","1990-10-01","","",null,"","",null,"","",null,"","",null,"","",null,"","",null,"","",null,"",""]
["10384_2B","coal",null,null,10384,"Edgecombe Genco, LLC","NC","Gen 2","2B","Conventional Boiler","Stoker - overfeed",30.5,375,12.295081967213115,"bituminous","bituminous",9.5136849090070474E-2,5.0961412617514358E-3,null,null,null,null,null,null,null,null,null,null,null,null,null,null,null,null,null,null,null,null,null,null,null,null,null,null,null,null,null,null,null,null,5.6800000000000003E-2,0.69836065573770501,null,null,null,null,null,null,5.6800000000000003E-2,0.69836065573770501,"SO2 control","Dry FGD - Spray Dryer","1990-10-01","SO2 control","Dry FGD - Spray Dryer","1990-10-01","PM control","Fabric Filter, reverse air","1990-10-01","PM control","Fabric Filter, reverse air","1990-10-01","","",null,"","",null,"","",null,"","",null,"","",null,"","",null,"","",null,"",""]
["10641_B1","coal",null,null,10641,"Cambria Cogen","PA","001","B1","Fluidized bed firing","Fluidized bed firing",49,560,11.428571428571429,"coal refuse (culm or gob),  other--natural gas","coal refuse (culm or gob),  other--natural gas",7.4790443094851305E-2,1.678971959310285E-2,null,null,null,null,null,null,null,null,null,null,null,null,null,null,null,null,null,null,null,null,null,null,null,null,null,null,null,null,null,null,null,null,null,null,0.37532674624343593,4.2894485284964103,null,null,null,null,0.37532674624343593,4.2894485284964103,"NOx control","Selective Noncatalytic Reduction",null,"PM control","Fabric Filter, unspecified",null,"","",null,"","",null,"","",null,"","",null,"","",null,"","",null,"","",null,"","",null,"","",null,"",""]
["10641_B2","coal",null,null,10641,"Cambria Cogen","PA","002","B2","Fluidized bed firing","Fluidized bed firing",49,560,11.428571428571429,"coal refuse (culm or gob),  other--natural gas","coal refuse (culm or gob),  other--natural gas",0.11887901297973344,1.8212216536441346E-2,null,null,null,null,null,null,null,null,null,null,null,null,null,null,null,null,null,null,null,null,null,null,null,null,null,null,null,null,null,null,null,null,null,null,0.44677576216328202,5.1060087104375089,null,null,null,null,0.44677576216328202,5.1060087104375089,"NOx control","Selective Noncatalytic Reduction",null,"PM control","Fabric Filter, unspecified",null,"","",null,"","",null,"","",null,"","",null,"","",null,"","",null,"","",null,"","",null,"","",null,"",""]
["10675_A","coal",null,null,10675,"AES Thames","CT","A","A","Fluidized bed firing","Fluidized bed firing",104,1002,9.634615384615385,"bituminous","bituminous",null,null,null,null,null,null,null,null,null,null,null,null,null,null,null,null,null,null,null,null,null,null,null,null,null,null,null,null,null,null,null,null,null,null,0.25759999999999994,2.4818769230769226,null,null,null,null,0.28999999999999998,2.7940384615384612,0.25759999999999994,2.4818769230769226,"SO2 control","Dry FGD - Circulating Dry Scrubber","1990-03-01","PM control","Fabric Filter, pulse","1990-03-01","","",null,"","",null,"","",null,"","",null,"","",null,"","",null,"","",null,"","",null,"","",null,"",""]
["10675_B","coal",null,null,10675,"AES Thames","CT","B","B","Fluidized bed firing","Fluidized bed firing",104,1002,9.634615384615385,"bituminous","bituminous",null,null,null,null,null,null,null,null,null,null,null,null,null,null,null,null,null,null,null,null,null,null,null,null,null,null,null,null,null,null,null,null,null,null,0.25286666666666668,2.4362730769230772,null,null,null,null,0.28999999999999998,2.7940384615384612,0.25286666666666668,2.4362730769230772,"SO2 control","Dry FGD - Circulating Dry Scrubber","1990-03-01","PM control","Fabric Filter, pulse","1990-03-01","","",null,"","",null,"","",null,"","",null,"","",null,"","",null,"","",null,"","",null,"","",null,"",""]
["10768_S-1715-3-13","coal",null,null,10768,"Rio Bravo Jasmin","CA","Config 1","S-1715-3-13","Fluidized bed firing","Fluidized bed firing",36,412.16,11.44888888888889,"bituminous","bituminous",null,null,null,null,null,null,null,null,null,null,null,null,null,null,null,null,null,null,null,null,null,null,null,null,null,null,null,null,null,null,null,null,null,null,2.3866666666666678E-2,0.273246814814815,null,null,null,null,2.3199999999999998E-2,0.26561422222222225,2.3199999999999998E-2,0.26561422222222225,"NOx control","Selective Noncatalytic Reduction","1990-03-01","PM control","Fabric Filter, reverse air","1990-03-01","","",null,"","",null,"","",null,"","",null,"","",null,"","",null,"","",null,"","",null,"","",null,"",""]
["10769_C-E CONTRACT 24687","coal",null,null,10769,"Rio Bravo Poso","CA","Config 1","C-E CONTRACT 24687","Fluidized bed firing","Fluidized bed firing",36,407.93,11.331388888888888,"bituminous","bituminous",null,null,null,null,null,null,null,null,null,null,null,null,null,null,null,null,null,null,null,null,null,null,null,null,null,null,null,null,null,null,null,null,null,null,2.5033333333333345E-2,0.2836624351851853,null,null,null,null,2.4500000000000001E-2,0.27761902777777775,2.4500000000000001E-2,0.27761902777777775,"NOx control","Selective Noncatalytic Reduction","1990-03-01","PM control","Fabric Filter, reverse air","1990-03-01","","",null,"","",null,"","",null,"","",null,"","",null,"","",null,"","",null,"","",null,"","",null,"",""]
["10784_BLR1","coal",null,null,10784,"Colstrip Energy LP","MT","Config1","BLR1","Fluidized bed firing","Fluidized bed firing",44,635,14.431818181818182,"coal refuse (culm or gob)","coal refuse (culm or gob)",null,null,null,null,null,null,null,null,null,null,null,null,null,null,null,null,null,null,null,null,null,null,null,null,null,null,null,null,null,null,null,null,null,null,null,null,null,null,3.1566666666666666E-2,0.45556439393939391,null,null,3.1566666666666666E-2,0.45556439393939391,"PM control","Fabric Filter, pulse","1990-06-01","Other control","Activated carbon injection","2009-12-01","","",null,"","",null,"","",null,"","",null,"","",null,"","",null,"","",null,"","",null,"","",null,"",""]
["50039_001","coal",null,null,50039,"Kline Township Cogen Facility","PA","001","001","Fluidized bed firing","Fluidized bed firing",58,825,14.224137931034482,"coal refuse (culm or gob)","coal refuse (culm or gob)",null,null,null,null,null,null,null,null,null,null,null,null,null,null,null,null,null,null,null,null,null,null,null,null,null,null,null,null,null,null,null,null,null,null,null,null,0.25912594783514392,3.685843223517133,null,null,null,null,0.25912594783514392,3.685843223517133,"PM control","Fabric Filter, unspecified",null,"","",null,"","",null,"","",null,"","",null,"","",null,"","",null,"","",null,"","",null,"","",null,"","",null,"",""]
["50611_031","coal",null,null,50611,"WPS Westwood Generation, LLC","PA","001","031","Fluidized bed firing","Fluidized bed firing",36,615,17.083333333333332,"coal refuse (culm or gob)","coal refuse (culm or gob)",null,null,null,null,null,null,null,null,null,null,null,null,null,null,null,null,null,null,null,null,null,null,null,null,null,null,null,null,null,null,null,null,null,null,0.16833333333333336,2.8756944444444446,null,null,null,null,null,null,0.16833333333333336,2.8756944444444446,"PM control","Fabric Filter, pulse","1987-12-01","","",null,"","",null,"","",null,"","",null,"","",null,"","",null,"","",null,"","",null,"","",null,"","",null,"",""]

{"sheet":"HCl_Variability","index":1,"n_rows":345,"n_cols":15,"rows_kept":345,"cut":false,"hidden":false,"merged":[]}
["facility_name","facility_id","boiler_id","configuration_id","compound","Final_EF","Final_EF_Units","Final_Output_EF","Final_Output_EF_Units","From","Report_id","HCl_Min_lb_per_MWh_Rank","New Souce MACT Floor Test_ID","New Source MACT Floor QA Calc","New Source Floor Agreement of QA Calc"]
[{"$f":"VLOOKUP(B2&\"_\"&C2,HCl_Min_Tests!A:BV,6,FALSE)","v":"Logan Generating Plant"},10043,"B01","Unit1","Hydrogen Chloride",1.2872827435455452E-5,"lb/MMBtu",1.1269715702699106E-4,"lb/MW","ERT",null,1,"1_HCl_T1",1.19373908712494E-4,{"$f":"N2/H2","v":1.0592450764654504}]
[{"$f":"VLOOKUP(B3&\"_\"&C3,HCl_Min_Tests!A:BV,6,FALSE)","v":"Logan Generating Plant"},10043,"B01","Unit1","Hydrogen Chloride",7.8076156813452146E-5,"lb/MMBtu",6.8352977996385912E-4,"lb/MW","Part II","2009 Annual Stack Test 3",1,"1_HCl_T6",6.8387832993546552E-4,1.0005099265340347]
[{"$f":"VLOOKUP(B4&\"_\"&C4,HCl_Min_Tests!A:BV,6,FALSE)","v":"Logan Generating Plant"},10043,"B01","Unit1","Hydrogen Chloride",7.8689071982380551E-5,"lb/MMBtu",6.8889564052427492E-4,"lb/MW","Part II","2006 Annual Stack Test 2",1,"1_HCl_T3",6.8924692669055895E-4,1.0005099265340345]
[{"$f":"VLOOKUP(B5&\"_\"&C5,HCl_Min_Tests!A:BV,6,FALSE)","v":"Logan Generating Plant"},10043,"B01","Unit1","Hydrogen Chloride",1.1840195694060023E-4,"lb/MMBtu",1.036568228739388E-3,"lb/MW","Part II","2005 Annual Stack Test 6",1,"1_HCl_T2",1.0367991870074685E-3,1.0002228104833595]
[{"$f":"VLOOKUP(B6&\"_\"&C6,HCl_Min_Tests!A:BV,6,FALSE)","v":"Logan Generating Plant"},10043,"B01","Unit1","Hydrogen Chloride",1.8748046912514158E-4,"lb/MMBtu",1.6413267383897378E-3,"lb/MW","Part II","2007 Annual Stack Test 3",1,"1_HCl_T4",1.6421636944446668E-3,1.0005099265340367]
[{"$f":"VLOOKUP(B7&\"_\"&C7,HCl_Min_Tests!A:BV,6,FALSE)","v":"Logan Generating Plant"},10043,"B01","Unit1","Hydrogen Chloride",4.1240433019282984E-4,"lb/MMBtu",3.610457437683194E-3,"lb/MW","Part II","2008 Annual Stack Test 3",1,"1_HCl_T5",3.6122985057306756E-3,1.0005099265340358]
[{"$f":"VLOOKUP(B8&\"_\"&C8,HCl_Min_Tests!A:BV,6,FALSE)","v":"Seward"},3130,"1","SEW-1","Hydrogen Chloride",1.9266666666666666E-5,"lb/MMBtu",2.0419373219373219E-4,"lb/MW","Part II","SE111",2]
[{"$f":"VLOOKUP(B9&\"_\"&C9,HCl_Min_Tests!A:BV,6,FALSE)","v":"Seward"},3130,"1","SEW-1","Hydrogen Chloride",1.4741923934699305E-4,"lb/MMBtu",1.5623919383783878E-3,"lb/MW","ERT","",2]
[{"$f":"VLOOKUP(B10&\"_\"&C10,HCl_Min_Tests!A:BV,6,FALSE)","v":"Seward"},3130,"2","SEW-1","Hydrogen Chloride",1.9266666666666666E-5,"lb/MMBtu",2.0419373219373219E-4,"lb/MW","Part II","SE111",3]
[{"$f":"VLOOKUP(B11&\"_\"&C11,HCl_Min_Tests!A:BV,6,FALSE)","v":"Seward"},3130,"2","SEW-1","Hydrogen Chloride",1.4741923934699305E-4,"lb/MMBtu",1.5623919383783878E-3,"lb/MW","ERT","",3]
[{"$f":"VLOOKUP(B12&\"_\"&C12,HCl_Min_Tests!A:BV,6,FALSE)","v":"Spruance Genco, LLC"},54081,"3A","GEN3","Hydrogen Chloride",1.61175568615607E-5,"lb/MMBtu",2.1059525515976525E-4,"lb/MW","ERT","",4]
[{"$f":"VLOOKUP(B13&\"_\"&C13,HCl_Min_Tests!A:BV,6,FALSE)","v":"Spruance Genco, LLC"},54081,"3B","GEN3","Hydrogen Chloride",1.61175568615607E-5,"lb/MMBtu",2.1059525515976525E-4,"lb/MW","ERT","",5]
[{"$f":"VLOOKUP(B14&\"_\"&C14,HCl_Min_Tests!A:BV,6,FALSE)","v":"Spruance Genco, LLC"},54081,"2A","GEN2","Hydrogen Chloride",1.6932996545912427E-5,"lb/MMBtu",2.2124995486819373E-4,"lb/MW","ERT","",6]
[{"$f":"VLOOKUP(B15&\"_\"&C15,HCl_Min_Tests!A:BV,6,FALSE)","v":"Spruance Genco, LLC"},54081,"2B","GEN2","Hydrogen Chloride",1.6932996545912427E-5,"lb/MMBtu",2.2124995486819373E-4,"lb/MW","ERT","",7]
[{"$f":"VLOOKUP(B16&\"_\"&C16,HCl_Min_Tests!A:BV,6,FALSE)","v":"Sandow Station"},52071,"5A","5A","Hydrogen Chloride",2.1185903639433637E-5,"lb/MMBtu",2.2210120337426442E-4,"lb/MW","Part II","2-Source Emissions Survey, Stacks",8]
[{"$f":"VLOOKUP(B17&\"_\"&C17,HCl_Min_Tests!A:BV,6,FALSE)","v":"Sandow Station"},52071,"5A","5A","Hydrogen Chloride",9.2435416955243219E-5,"lb/MMBtu",9.690413819285281E-4,"lb/MW","ERT","",8]
[{"$f":"VLOOKUP(B18&\"_\"&C18,HCl_Min_Tests!A:BV,6,FALSE)","v":"HOLCOMB"},108,"SGU1","SGU1","Hydrogen Chloride",2.5999999999999998E-5,"lb/MMBtu",2.2768475452196381E-4,"lb/MW","Part II","M093106",9]
[{"$f":"VLOOKUP(B19&\"_\"&C19,HCl_Min_Tests!A:BV,6,FALSE)","v":"Hatfield's Ferry Power Station"},3179,"1","001","Hydrogen Chloride",2.4700000000000001E-5,"lb/MMBtu",2.3862711864406779E-4,"lb/MW","Part II","HCL-HF-11/09-1",10]
[{"$f":"VLOOKUP(B20&\"_\"&C20,HCl_Min_Tests!A:BV,6,FALSE)","v":"Hatfield's Ferry Power Station"},3179,"1","001","Hydrogen Chloride",1.3129629639170115E-4,"lb/MMBtu",1.2684557448011805E-3,"lb/MW","ERT","",10]
[{"$f":"VLOOKUP(B21&\"_\"&C21,HCl_Min_Tests!A:BV,6,FALSE)","v":"Sandow Station"},52071,"5B","5B","Hydrogen Chloride",2.5523812469302678E-5,"lb/MMBtu",2.675774213179951E-4,"lb/MW","Part II","2-Source Emissions Survey, Stacks",11]
[{"$f":"VLOOKUP(B22&\"_\"&C22,HCl_Min_Tests!A:BV,6,FALSE)","v":"Sandow Station"},52071,"5B","5B","Hydrogen Chloride",3.0184528753548627E-5,"lb/MMBtu",3.1643777265983328E-4,"lb/MW","ERT","",11]
[{"$f":"VLOOKUP(B23&\"_\"&C23,HCl_Min_Tests!A:BV,6,FALSE)","v":"Rawhide"},6761,"101","Rawhide101","Hydrogen Chloride",3.6081010741494353E-5,"lb/MMBtu",3.3123550844650553E-4,"lb/MW","Part II","Nov 2009 PM, HCL & HF Testing",12]
[{"$f":"VLOOKUP(B24&\"_\"&C24,HCl_Min_Tests!A:BV,6,FALSE)","v":"Rawhide"},6761,"101","Rawhide101","Hydrogen Chloride",6.0000000000000002E-5,"lb/MMBtu",5.5081967213114753E-4,"lb/MW","Part II","Feb 2006 PM, HCL, and HF Testing",12]
[{"$f":"VLOOKUP(B25&\"_\"&C25,HCl_Min_Tests!A:BV,6,FALSE)","v":"Rawhide"},6761,"101","Rawhide101","Hydrogen Chloride",1.6000000000000001E-4,"lb/MMBtu",1.4688524590163936E-3,"lb/MW","Part II","Oct 2006 PM, HCL & HF Testing",12]
[{"$f":"VLOOKUP(B26&\"_\"&C26,HCl_Min_Tests!A:BV,6,FALSE)","v":"Rawhide"},6761,"101","Rawhide101","Hydrogen Chloride",3.2000000000000003E-4,"lb/MMBtu",2.9377049180327871E-3,"lb/MW","Part II","Nov 2007 PM, HCL & HF Testing",12]
[{"$f":"VLOOKUP(B27&\"_\"&C27,HCl_Min_Tests!A:BV,6,FALSE)","v":"Rawhide"},6761,"101","Rawhide101","Hydrogen Chloride",3.3353888445965523E-4,"lb/MMBtu",3.0619963163509333E-3,"lb/MW","ERT","",12]
[{"$f":"VLOOKUP(B28&\"_\"&C28,HCl_Min_Tests!A:BV,6,FALSE)","v":"Rawhide"},6761,"101","Rawhide101","Hydrogen Chloride",3.5100000000000002E-4,"lb/MMBtu",3.222295081967213E-3,"lb/MW","Part II","Dec 2008 PM, HCL & HF Testing",12]
[{"$f":"VLOOKUP(B29&\"_\"&C29,HCl_Min_Tests!A:BV,6,FALSE)","v":"INDIANTOWN COGENERATION L.P."},50976,"AABO1","001","Hydrogen Chloride",3.5766466360855867E-5,"lb/MMBtu",3.3903835979736503E-4,"lb/MW","ERT","",13]
[{"$f":"VLOOKUP(B30&\"_\"&C30,HCl_Min_Tests!A:BV,6,FALSE)","v":"Walter Scott Jr. Energy Center"},1082,"4","4","Hydrogen Chloride",3.8000000000000002E-5,"lb/MMBtu",3.4311764705882356E-4,"lb/MW","Part II","5/2007 HCL",14]
[{"$f":"VLOOKUP(B31&\"_\"&C31,HCl_Min_Tests!A:BV,6,FALSE)","v":"Walter Scott Jr. Energy Center"},1082,"4","4","Hydrogen Chloride",5.8999999999999998E-5,"lb/MMBtu",5.3273529411764701E-4,"lb/MW","Part II","8/2007 HCL",14]
[{"$f":"VLOOKUP(B32&\"_\"&C32,HCl_Min_Tests!A:BV,6,FALSE)","v":"Walter Scott Jr. Energy Center"},1082,"4","4","Hydrogen Chloride",7.3723519894592504E-5,"lb/MMBtu",6.6568001787176167E-4,"lb/MW","ERT","",14]
[{"$f":"VLOOKUP(B33&\"_\"&C33,HCl_Min_Tests!A:BV,6,FALSE)","v":"Roanoke Valley II"},54755,"BLR2","Boiler 2","Hydrogen Chloride",3.2174808236304253E-5,"lb/MMBtu",3.603578522466076E-4,"lb/MW","ERT","",15]
[{"$f":"VLOOKUP(B34&\"_\"&C34,HCl_Min_Tests!A:BV,6,FALSE)","v":"Roanoke Valley II"},54755,"BLR2","Boiler 2","Hydrogen Chloride",4.9199999999999992E-4,"lb/MMBtu",5.5103999999999986E-3,"lb/MW","Part II","2008 HCl Test",15]
[{"$f":"VLOOKUP(B35&\"_\"&C35,HCl_Min_Tests!A:BV,6,FALSE)","v":"Chambers Cogeneration LP"},10566,"Boil 1","Boil 1","Hydrogen Chloride",4.239954027850413E-5,"lb/MMBtu",4.1268885871077353E-4,"lb/MW","ERT","",16]
[{"$f":"VLOOKUP(B36&\"_\"&C36,HCl_Min_Tests!A:BV,6,FALSE)","v":"Cross"},130,"4","C4","Hydrogen Chloride",4.0966666666666669E-5,"lb/MMBtu",4.4558624E-4,"lb/MW","Part II","C4TVIC2008",17]
[{"$f":"VLOOKUP(B37&\"_\"&C37,HCl_Min_Tests!A:BV,6,FALSE)","v":"Cross"},130,"4","C4","Hydrogen Chloride",2.2897081309646017E-4,"lb/MMBtu",2.4904697398875778E-3,"lb/MW","ERT","",17]
[{"$f":"VLOOKUP(B38&\"_\"&C38,HCl_Min_Tests!A:BV,6,FALSE)","v":"Navajo Generating Station"},4941,"1","001","Hydrogen Chloride",5.0000000000000002E-5,"lb/MMBtu",4.5874384236453203E-4,"lb/MW","ETTS","",18]
[{"$f":"VLOOKUP(B39&\"_\"&C39,HCl_Min_Tests!A:BV,6,FALSE)","v":"Navajo Generating Station"},4941,"1","001","Hydrogen Chloride",6.4809371022371757E-5,"lb/MMBtu",5.9461799768062754E-4,"lb/MW","ERT","",18]
[{"$f":"VLOOKUP(B40&\"_\"&C40,HCl_Min_Tests!A:BV,6,FALSE)","v":"Spruance Genco, LLC"},54081,"4A","GEN4","Hydrogen Chloride",3.8420443784819034E-5,"lb/MMBtu",5.020092829026877E-4,"lb/MW","ERT","",19]
[{"$f":"VLOOKUP(B41&\"_\"&C41,HCl_Min_Tests!A:BV,6,FALSE)","v":"Spruance Genco, LLC"},54081,"4B","GEN4","Hydrogen Chloride",3.8420443784819034E-5,"lb/MMBtu",5.020092829026877E-4,"lb/MW","ERT","",20]
[{"$f":"VLOOKUP(B42&\"_\"&C42,HCl_Min_Tests!A:BV,6,FALSE)","v":"Chambers Cogeneration LP"},10566,"Boil 2","Boil 2","Hydrogen Chloride",5.6008863293497171E-5,"lb/MMBtu",5.451529360567057E-4,"lb/MW","ERT","",21]
[{"$f":"VLOOKUP(B43&\"_\"&C43,HCl_Min_Tests!A:BV,6,FALSE)","v":"Hardin Generator Project"},55749,"PC1","PC1","Hydrogen Chloride",5.0000000000000002E-5,"lb/MMBtu",5.4789915966386559E-4,"lb/MW","Part II","1",22]
[{"$f":"VLOOKUP(B44&\"_\"&C44,HCl_Min_Tests!A:BV,6,FALSE)","v":"Hardin Generator Project"},55749,"PC1","PC1","Hydrogen Chloride",1.4550461747956969E-4,"lb/MMBtu",1.5944371528853688E-3,"lb/MW","ERT","",22]
[{"$f":"VLOOKUP(B45&\"_\"&C45,HCl_Min_Tests!A:BV,6,FALSE)","v":"Roxboro Steam Electric Plant"},2712,"2","Rox_Cfg_2c","Hydrogen Chloride",5.6499999999999998E-5,"lb/MMBtu",5.5398933143669987E-4,"lb/MW","Part II","Rox_Blr_2_Test_7g",23]
[{"$f":"VLOOKUP(B46&\"_\"&C46,HCl_Min_Tests!A:BV,6,FALSE)","v":"TS Power Plant"},56224,"BLR100","TSPower","Hydrogen Chloride",6.5138924540459638E-5,"lb/MMBtu",5.6848515962582957E-4,"lb/MW","ERT","",24]
[{"$f":"VLOOKUP(B47&\"_\"&C47,HCl_Min_Tests!A:BV,6,FALSE)","v":"TS Power Plant"},56224,"BLR100","TSPower","Hydrogen Chloride",4.0000000000000002E-4,"lb/MMBtu",3.490909090909091E-3,"lb/MW","Part II","TRC 04/2008",24]
[{"$f":"VLOOKUP(B48&\"_\"&C48,HCl_Min_Tests!A:BV,6,FALSE)","v":"TS Power Plant"},56224,"BLR100","TSPower","Hydrogen Chloride",1.052E-3,"lb/MMBtu",9.1810909090909078E-3,"lb/MW","Part II","Optimal 07/2009",24]
[{"$f":"VLOOKUP(B49&\"_\"&C49,HCl_Min_Tests!A:BV,6,FALSE)","v":"Colstrip"},6076,"3","Unit3","Hydrogen Chloride",6.2094025539701585E-5,"lb/MMBtu",5.8414665268591314E-4,"lb/MW","ERT","",25]
[{"$f":"VLOOKUP(B50&\"_\"&C50,HCl_Min_Tests!A:BV,6,FALSE)","v":"H L Spurlock Station"},6041,"3","Unit 03","Hydrogen Chloride",7.3333333333333331E-5,"lb/MMBtu",6.111111111111111E-4,"lb/MW","ETTS","",26]
[{"$f":"VLOOKUP(B51&\"_\"&C51,HCl_Min_Tests!A:BV,6,FALSE)","v":"H L Spurlock Station"},6041,"3","Unit 03","Hydrogen Chloride",7.5132547271338502E-5,"lb/MMBtu",6.2610456059448755E-4,"lb/MW","ERT","",26]
[{"$f":"VLOOKUP(B52&\"_\"&C52,HCl_Min_Tests!A:BV,6,FALSE)","v":"Navajo Generating Station"},4941,"2","002","Hydrogen Chloride",6.666666666666667E-5,"lb/MMBtu",6.1165845648604271E-4,"lb/MW","ETTS","",27]
[{"$f":"VLOOKUP(B53&\"_\"&C53,HCl_Min_Tests!A:BV,6,FALSE)","v":"Navajo Generating Station"},4941,"2","002","Hydrogen Chloride",6.9650141399656536E-5,"lb/MMBtu",6.3903146973822811E-4,"lb/MW","ERT","",27]
[{"$f":"VLOOKUP(B54&\"_\"&C54,HCl_Min_Tests!A:BV,6,FALSE)","v":"Marshall"},2727,"Unit 4","U4","Hydrogen Chloride",7.5416666666666666E-5,"lb/MMBtu",6.4963916666666672E-4,"lb/MW","Part II","U4HCLHF032907",28]
[{"$f":"VLOOKUP(B55&\"_\"&C55,HCl_Min_Tests!A:BV,6,FALSE)","v":"Marshall"},2727,"Unit 4","U4","Hydrogen Chloride",7.9300000000000003E-5,"lb/MMBtu",6.8309020000000009E-4,"lb/MW","Part II","U4HCLHF033007",28]
[{"$f":"VLOOKUP(B56&\"_\"&C56,HCl_Min_Tests!A:BV,6,FALSE)","v":"Marshall"},2727,"Unit 4","U4","Hydrogen Chloride",9.2966666666666672E-5,"lb/MMBtu",8.0081486666666677E-4,"lb/MW","Part II","U4HCLHF032807",28]
[{"$f":"VLOOKUP(B57&\"_\"&C57,HCl_Min_Tests!A:BV,6,FALSE)","v":"Marshall"},2727,"Unit 4","U4","Hydrogen Chloride",2.8343336934549644E-4,"lb/MMBtu",2.4414950435421067E-3,"lb/MW","ERT","",28]
[{"$f":"VLOOKUP(B58&\"_\"&C58,HCl_Min_Tests!A:BV,6,FALSE)","v":"Cross"},130,"3","C3","Hydrogen Chloride",6.8939832141421862E-5,"lb/MMBtu",6.6822000498037383E-4,"lb/MW","ERT","",29]
[{"$f":"VLOOKUP(B59&\"_\"&C59,HCl_Min_Tests!A:BV,6,FALSE)","v":"Cross"},130,"3","C3","Hydrogen Chloride",2.7599999999999999E-4,"lb/MMBtu",2.6752128E-3,"lb/MW","Part II","C3TVM292007",29]
[{"$f":"VLOOKUP(B60&\"_\"&C60,HCl_Min_Tests!A:BV,6,FALSE)","v":"Roanoke Valley I"},54035,"BLR1","Boiler 1","Hydrogen Chloride",7.3156720274684963E-5,"lb/MMBtu",6.8333200256573867E-4,"lb/MW","ERT","",30]
[{"$f":"VLOOKUP(B61&\"_\"&C61,HCl_Min_Tests!A:BV,6,FALSE)","v":"Roanoke Valley I"},54035,"BLR1","Boiler 1","Hydrogen Chloride",5.6300000000000002E-4,"lb/MMBtu",5.2587912087912097E-3,"lb/MW","Part II","2008 HCL Test",30]
[{"$f":"VLOOKUP(B62&\"_\"&C62,HCl_Min_Tests!A:BV,6,FALSE)","v":"Weston"},4078,"4","W4","Hydrogen Chloride",7.6666666666666669E-5,"lb/MMBtu",6.9034296489701183E-4,"lb/MW","Part II","W4 HCl 2008",31]
[{"$f":"VLOOKUP(B63&\"_\"&C63,HCl_Min_Tests!A:BV,6,FALSE)","v":"Elm Road Generating Station"},56068,"1","ERGS-B1","Hydrogen Chloride",7.6400778323059757E-5,"lb/MMBtu",7.3523053290211872E-4,"lb/MW","ERT","",32]
[{"$f":"VLOOKUP(B64&\"_\"&C64,HCl_Min_Tests!A:BV,6,FALSE)","v":"Cholla"},113,"3","003","Hydrogen Chloride",8.0274153841027222E-5,"lb/MMBtu",7.7089507082088102E-4,"lb/MW","ERT","",33]
[{"$f":"VLOOKUP(B65&\"_\"&C65,HCl_Min_Tests!A:BV,6,FALSE)","v":"Hammond"},708,"2","Unit 2","Hydrogen Chloride",7.8766681379477131E-5,"lb/MMBtu",7.794695995099923E-4,"lb/MW","ERT","",34]
[{"$f":"VLOOKUP(B66&\"_\"&C66,HCl_Min_Tests!A:BV,6,FALSE)","v":"Hammond"},708,"3","Unit 3","Hydrogen Chloride",7.8766681379477131E-5,"lb/MMBtu",7.8177095646160132E-4,"lb/MW","ERT","",35]
[{"$f":"VLOOKUP(B67&\"_\"&C67,HCl_Min_Tests!A:BV,6,FALSE)","v":"Hammond"},708,"1","Unit 1","Hydrogen Chloride",7.8766681379477131E-5,"lb/MMBtu",7.9366130071158159E-4,"lb/MW","ERT","",36]
[{"$f":"VLOOKUP(B68&\"_\"&C68,HCl_Min_Tests!A:BV,6,FALSE)","v":"Hawthorn"},2079,"5A","5A","Hydrogen Chloride",7.2108461727332144E-5,"lb/MMBtu",8.0120513030369051E-4,"lb/MW","ERT","",37]
[{"$f":"VLOOKUP(B69&\"_\"&C69,HCl_Min_Tests!A:BV,6,FALSE)","v":"Hawthorn"},2079,"5A","5A","Hydrogen Chloride",2.7E-4,"lb/MMBtu",3.0000000000000001E-3,"lb/MW","Part II","AcidGasTest2006",37]
[{"$f":"VLOOKUP(B70&\"_\"&C70,HCl_Min_Tests!A:BV,6,FALSE)","v":"Hawthorn"},2079,"5A","5A","Hydrogen Chloride",3.5E-4,"lb/MMBtu",3.8888888888888888E-3,"lb/MW","Part II","AcidGasTest2005",37]
[{"$f":"VLOOKUP(B71&\"_\"&C71,HCl_Min_Tests!A:BV,6,FALSE)","v":"Dallman"},963,"34","34","Hydrogen Chloride",9.7E-5,"lb/MMBtu",8.1392894507410643E-4,"lb/MW","Part II","Dallman 34 Test 2",38]
[{"$f":"VLOOKUP(B72&\"_\"&C72,HCl_Min_Tests!A:BV,6,FALSE)","v":"Dallman"},963,"34","34","Hydrogen Chloride",1.0033333333333334E-4,"lb/MMBtu",8.4189901191514109E-4,"lb/MW","ETTS","",38]
[{"$f":"VLOOKUP(B73&\"_\"&C73,HCl_Min_Tests!A:BV,6,FALSE)","v":"Dallman"},963,"34","34","Hydrogen Chloride",8.5999999999999998E-4,"lb/MMBtu",7.2162772449869232E-3,"lb/MW","Part II","Dallman 34 Test 1",38]
[{"$f":"VLOOKUP(B74&\"_\"&C74,HCl_Min_Tests!A:BV,6,FALSE)","v":"Hammond"},708,"4","Unit 4","Hydrogen Chloride",7.8766681379477131E-5,"lb/MMBtu",8.2682748713522553E-4,"lb/MW","ERT","",39]
[{"$f":"VLOOKUP(B75&\"_\"&C75,HCl_Min_Tests!A:BV,6,FALSE)","v":"J K Spruce"},7097,"BLR1","1","Hydrogen Chloride",7.6236903942463802E-5,"lb/MMBtu",8.3610852754829694E-4,"lb/MW","ERT","",40]
[{"$f":"VLOOKUP(B76&\"_\"&C76,HCl_Min_Tests!A:BV,6,FALSE)","v":"Cholla"},113,"4","004","Hydrogen Chloride",8.5239102390997849E-5,"lb/MMBtu",8.5600115059947962E-4,"lb/MW","ERT","",41]
[{"$f":"VLOOKUP(B77&\"_\"&C77,HCl_Min_Tests!A:BV,6,FALSE)","v":"Navajo Generating Station"},4941,"3","003","Hydrogen Chloride",9.3828093167331065E-5,"lb/MMBtu",8.6086119962637498E-4,"lb/MW","ERT","",42]
[{"$f":"VLOOKUP(B78&\"_\"&C78,HCl_Min_Tests!A:BV,6,FALSE)","v":"Navajo Generating Station"},4941,"3","003","Hydrogen Chloride",9.6666666666666667E-5,"lb/MMBtu",8.8690476190476193E-4,"lb/MW","ETTS","",42]
[{"$f":"VLOOKUP(B79&\"_\"&C79,HCl_Min_Tests!A:BV,6,FALSE)","v":"Hopewell"},10771,"10771-01","1 & 2","Hydrogen Chloride",7.3366827978427467E-5,"lb/MMBtu",9.2247996943463947E-4,"lb/MW","ERT","",43]
[{"$f":"VLOOKUP(B80&\"_\"&C80,HCl_Min_Tests!A:BV,6,FALSE)","v":"Hopewell"},10771,"10771-02","1 & 2","Hydrogen Chloride",7.3366827978427467E-5,"lb/MMBtu",9.2247996943463947E-4,"lb/MW","ERT","",44]
[{"$f":"VLOOKUP(B81&\"_\"&C81,HCl_Min_Tests!A:BV,6,FALSE)","v":"AES Puerto Rico Cogeneration Facility"},68029,"BLR2","Unit_2","Hydrogen Chloride",9.5966190420016908E-5,"lb/MMBtu",9.2631835725423377E-4,"lb/MW","ERT","",45]
[{"$f":"VLOOKUP(B82&\"_\"&C82,HCl_Min_Tests!A:BV,6,FALSE)","v":"Pleasant Prairie"},6170,"2","PPPPB2","Hydrogen Chloride",9.4427057573626377E-5,"lb/MMBtu",9.4706079983252964E-4,"lb/MW","ERT","",46]
[{"$f":"VLOOKUP(B83&\"_\"&C83,HCl_Min_Tests!A:BV,6,FALSE)","v":"Pleasant Prairie"},6170,"1","PPPPB1","Hydrogen Chloride",9.6555893080218014E-5,"lb/MMBtu",9.5067015950278764E-4,"lb/MW","ERT","",47]
[{"$f":"VLOOKUP(B84&\"_\"&C84,HCl_Min_Tests!A:BV,6,FALSE)","v":"AES Puerto Rico Cogeneration Facility"},68029,"BLR1","Unit_1","Hydrogen Chloride",1.0185307653015406E-4,"lb/MMBtu",9.8314181400518106E-4,"lb/MW","ERT","",48]
[{"$f":"VLOOKUP(B85&\"_\"&C85,HCl_Min_Tests!A:BV,6,FALSE)","v":"Southampton Power Station"},10774,"1","Unit 1 & 2","Hydrogen Chloride",7.763296516269501E-5,"lb/MMBtu",1.0149368533769981E-3,"lb/MW","ERT","",49]
[{"$f":"VLOOKUP(B86&\"_\"&C86,HCl_Min_Tests!A:BV,6,FALSE)","v":"Southampton Power Station"},10774,"2","Unit 1 & 2","Hydrogen Chloride",7.763296516269501E-5,"lb/MMBtu",1.0149368533769981E-3,"lb/MW","ERT","",50]
[{"$f":"VLOOKUP(B87&\"_\"&C87,HCl_Min_Tests!A:BV,6,FALSE)","v":"San Juan"},2451,"Unit 3","Unit 3","Hydrogen Chloride",9.5978746589312882E-5,"lb/MMBtu",1.015892689083205E-3,"lb/MW","ERT","",51]
[{"$f":"VLOOKUP(B88&\"_\"&C88,HCl_Min_Tests!A:BV,6,FALSE)","v":"H L Spurlock Station"},6041,"4","Unit 04","Hydrogen Chloride",1.1843833333333333E-4,"lb/MMBtu",1.1054244444444444E-3,"lb/MW","Part II","HCL_HF_09/29-30/09",52]
[{"$f":"VLOOKUP(B89&\"_\"&C89,HCl_Min_Tests!A:BV,6,FALSE)","v":"H L Spurlock Station"},6041,"4","Unit 04","Hydrogen Chloride",1.3023959363441052E-4,"lb/MMBtu",1.2155695405878316E-3,"lb/MW","ERT","",52]
[{"$f":"VLOOKUP(B90&\"_\"&C90,HCl_Min_Tests!A:BV,6,FALSE)","v":"H L Spurlock Station"},6041,"4","Unit 04","Hydrogen Chloride",2.0000000000000001E-4,"lb/MMBtu",1.8666666666666669E-3,"lb/MW","ETTS","",52]
[{"$f":"VLOOKUP(B91&\"_\"&C91,HCl_Min_Tests!A:BV,6,FALSE)","v":"H L Spurlock Station"},6041,"4","Unit 04","Hydrogen Chloride",1.1299999999999999E-3,"lb/MMBtu",1.0546666666666666E-2,"lb/MW","Part II","Compliance_HCL_HF_05/28/09",52]
[{"$f":"VLOOKUP(B92&\"_\"&C92,HCl_Min_Tests!A:BV,6,FALSE)","v":"Walter Scott Jr. Energy Center"},1082,"3","3","Hydrogen Chloride",1.1E-4,"lb/MMBtu",1.1071895424836602E-3,"lb/MW","Part II","6/2009 HCL",53]
[{"$f":"VLOOKUP(B93&\"_\"&C93,HCl_Min_Tests!A:BV,6,FALSE)","v":"San Juan"},2451,"Unit 1","Unit 1","Hydrogen Chloride",1.1135261445682932E-4,"lb/MMBtu",1.1156328156526115E-3,"lb/MW","ERT","",54]
[{"$f":"VLOOKUP(B94&\"_\"&C94,HCl_Min_Tests!A:BV,6,FALSE)","v":"Bowen"},703,"4","Unit 4","Hydrogen Chloride",1.1939149442247827E-4,"lb/MMBtu",1.1373214563911256E-3,"lb/MW","ERT","",55]
[{"$f":"VLOOKUP(B95&\"_\"&C95,HCl_Min_Tests!A:BV,6,FALSE)","v":"San Juan"},2451,"Unit 4","Unit 4","Hydrogen Chloride",1.178198173825542E-4,"lb/MMBtu",1.2234635080772955E-3,"lb/MW","ERT","",56]
[{"$f":"VLOOKUP(B96&\"_\"&C96,HCl_Min_Tests!A:BV,6,FALSE)","v":"Cardinal"},2828,"1","CD-U1","Hydrogen Chloride",1.4296170455888643E-4,"lb/MMBtu",1.2258176065476688E-3,"lb/MW","ERT","",57]
[{"$f":"VLOOKUP(B97&\"_\"&C97,HCl_Min_Tests!A:BV,6,FALSE)","v":"San Juan"},2451,"Unit 2","Unit 2","Hydrogen Chloride",1.2405851099797505E-4,"lb/MMBtu",1.2365615907041405E-3,"lb/MW","ERT","",58]
[{"$f":"VLOOKUP(B98&\"_\"&C98,HCl_Min_Tests!A:BV,6,FALSE)","v":"Oak Grove"},6180,"1","OG1","Hydrogen Chloride",1.2025861536760588E-4,"lb/MMBtu",1.3203424477936656E-3,"lb/MW","ERT","",59]
[{"$f":"VLOOKUP(B99&\"_\"&C99,HCl_Min_Tests!A:BV,6,FALSE)","v":"Oak Grove"},6180,"1","OG1","Hydrogen Chloride",2.2666666666666668E-4,"lb/MMBtu",2.488616891064872E-3,"lb/MW","Part II","1-Compliance Test Report",59]
[{"$f":"VLOOKUP(B100&\"_\"&C100,HCl_Min_Tests!A:BV,6,FALSE)","v":"Hayden"},525,"2","Unit 2","Hydrogen Chloride",1.425588125755343E-4,"lb/MMBtu",1.3565596480871894E-3,"lb/MW","ERT","",60]
[{"$f":"VLOOKUP(B101&\"_\"&C101,HCl_Min_Tests!A:BV,6,FALSE)","v":"Bowen"},703,"2","Unit 2","Hydrogen Chloride",1.5566627684618814E-4,"lb/MMBtu",1.5018414355471358E-3,"lb/MW","ERT","",61]
[{"$f":"VLOOKUP(B102&\"_\"&C102,HCl_Min_Tests!A:BV,6,FALSE)","v":"AES Petersburg"},994,"2","2ss","Hydrogen Chloride",1.6244583360268774E-4,"lb/MMBtu",1.5127540099989618E-3,"lb/MW","ERT","",62]
[{"$f":"VLOOKUP(B103&\"_\"&C103,HCl_Min_Tests!A:BV,6,FALSE)","v":"AES Petersburg"},994,"1","1s","Hydrogen Chloride",1.7578119375756386E-4,"lb/MMBtu",1.5165436324181979E-3,"lb/MW","ERT","",63]
[{"$f":"VLOOKUP(B104&\"_\"&C104,HCl_Min_Tests!A:BV,6,FALSE)","v":"Conesville"},2840,"4","CV-4","Hydrogen Chloride",1.6321428202238091E-4,"lb/MMBtu",1.54389267367576E-3,"lb/MW","ERT","",64]
[{"$f":"VLOOKUP(B105&\"_\"&C105,HCl_Min_Tests!A:BV,6,FALSE)","v":"John E. Amos"},3935,"2","AM-2","Hydrogen Chloride",1.8273986732325522E-4,"lb/MMBtu",1.5715225635296482E-3,"lb/MW","ERT","",65]
[{"$f":"VLOOKUP(B106&\"_\"&C106,HCl_Min_Tests!A:BV,6,FALSE)","v":"Hamilton"},2917,"9","Unit 9","Hydrogen Chloride",1.1019147818598461E-4,"lb/MMBtu",1.5875412568692249E-3,"lb/MW","ERT","",66]
[{"$f":"VLOOKUP(B107&\"_\"&C107,HCl_Min_Tests!A:BV,6,FALSE)","v":"Cardinal"},2828,"2","CD-U2","Hydrogen Chloride",1.8535803671598547E-4,"lb/MMBtu",1.5893427237919755E-3,"lb/MW","ERT","",67]
[{"$f":"VLOOKUP(B108&\"_\"&C108,HCl_Min_Tests!A:BV,6,FALSE)","v":"Whelan Energy Center Unit 1 (WEC1)"},60,"1","1","Hydrogen Chloride",1.624030166840946E-4,"lb/MMBtu",1.6417080071737843E-3,"lb/MW","ERT","",68]
[{"$f":"VLOOKUP(B109&\"_\"&C109,HCl_Min_Tests!A:BV,6,FALSE)","v":"Yates"},728,"Y1BR","Y1BR","Hydrogen Chloride",1.630606070109156E-4,"lb/MMBtu",1.6683111686013436E-3,"lb/MW","ERT","",69]
[{"$f":"VLOOKUP(B110&\"_\"&C110,HCl_Min_Tests!A:BV,6,FALSE)","v":"Wygen 1"},55479,"3","WYG1Cfg","Hydrogen Chloride",1.5349999999999999E-4,"lb/MMBtu",1.7762142857142855E-3,"lb/MW","ETTS","",70]
[{"$f":"VLOOKUP(B111&\"_\"&C111,HCl_Min_Tests!A:BV,6,FALSE)","v":"Wygen 1"},55479,"3","WYG1Cfg","Hydrogen Chloride",1.5658193226885682E-4,"lb/MMBtu",1.8118766448253431E-3,"lb/MW","ERT","",70]
[{"$f":"VLOOKUP(B112&\"_\"&C112,HCl_Min_Tests!A:BV,6,FALSE)","v":"Welsh"},6139,"1","WE-1","Hydrogen Chloride",1.9444687992610377E-4,"lb/MMBtu",1.7967170482060771E-3,"lb/MW","ERT","",71]
[{"$f":"VLOOKUP(B113&\"_\"&C113,HCl_Min_Tests!A:BV,6,FALSE)","v":"Neil Simpson II"},7504,"2","NS2Cfg","Hydrogen Chloride",1.4749511877297958E-4,"lb/MMBtu",1.8436889846622448E-3,"lb/MW","ERT","",72]
[{"$f":"VLOOKUP(B114&\"_\"&C114,HCl_Min_Tests!A:BV,6,FALSE)","v":"Neil Simpson II"},7504,"2","NS2Cfg","Hydrogen Chloride",1.4766666666666669E-4,"lb/MMBtu",1.8458333333333337E-3,"lb/MW","ETTS","",72]
[{"$f":"VLOOKUP(B115&\"_\"&C115,HCl_Min_Tests!A:BV,6,FALSE)","v":"Mountaineer"},6264,"1","Mt-1","Hydrogen Chloride",2.1404790232427119E-4,"lb/MMBtu",1.9394037210593055E-3,"lb/MW","ERT","",73]
[{"$f":"VLOOKUP(B116&\"_\"&C116,HCl_Min_Tests!A:BV,6,FALSE)","v":"Lamar Plant"},508,"4","001","Hydrogen Chloride",1.6837700370974512E-4,"lb/MMBtu",1.9508771929824559E-3,"lb/MW","Part II","2",74]
[{"$f":"VLOOKUP(B117&\"_\"&C117,HCl_Min_Tests!A:BV,6,FALSE)","v":"Valmont"},477,"5","Unit 5","Hydrogen Chloride",2.1110907253864804E-4,"lb/MMBtu",1.9872257083357429E-3,"lb/MW","ERT","",75]
[{"$f":"VLOOKUP(B118&\"_\"&C118,HCl_Min_Tests!A:BV,6,FALSE)","v":"Louisa"},6664,"101","101","Hydrogen Chloride",1.9103938330077767E-4,"lb/MMBtu",2.0466132193613746E-3,"lb/MW","ERT","",76]
[{"$f":"VLOOKUP(B119&\"_\"&C119,HCl_Min_Tests!A:BV,6,FALSE)","v":"Wansley"},6052,"2","Unit 2","Hydrogen Chloride",2.2051861560499681E-4,"lb/MMBtu",2.0504108511929481E-3,"lb/MW","ERT","",77]
[{"$f":"VLOOKUP(B120&\"_\"&C120,HCl_Min_Tests!A:BV,6,FALSE)","v":"Asheville Steam Electric Plant"},2706,"2","Ash_Cfg_2","Hydrogen Chloride",2.2000000000000001E-4,"lb/MMBtu",2.0511764705882355E-3,"lb/MW","Part II","Ash_Blr_2_Test_7l",78]
[{"$f":"VLOOKUP(B121&\"_\"&C121,HCl_Min_Tests!A:BV,6,FALSE)","v":"Hayden"},525,"1","Unit 1","Hydrogen Chloride",2.1783347947369278E-4,"lb/MMBtu",2.1168669317171234E-3,"lb/MW","ERT","",79]
[{"$f":"VLOOKUP(B122&\"_\"&C122,HCl_Min_Tests!A:BV,6,FALSE)","v":"Healy"},6288,"001","1","Hydrogen Chloride",1.5404755683334943E-4,"lb/MMBtu",2.1381800888468903E-3,"lb/MW","ERT","",80]
[{"$f":"VLOOKUP(B123&\"_\"&C123,HCl_Min_Tests!A:BV,6,FALSE)","v":"Ghent"},1356,"1","GH1","Hydrogen Chloride",1.7960541830365118E-4,"lb/MMBtu",2.1711531912629836E-3,"lb/MW","ERT","",81]
[{"$f":"VLOOKUP(B124&\"_\"&C124,HCl_Min_Tests!A:BV,6,FALSE)","v":"Cherokee"},469,"4","Unit 4","Hydrogen Chloride",2.3684056901197341E-4,"lb/MMBtu",2.1767070572379799E-3,"lb/MW","ERT","",82]
[{"$f":"VLOOKUP(B125&\"_\"&C125,HCl_Min_Tests!A:BV,6,FALSE)","v":"Bowen"},703,"3","Unit 3","Hydrogen Chloride",2.4954833540198677E-4,"lb/MMBtu",2.1891642433920049E-3,"lb/MW","ERT","",83]
[{"$f":"VLOOKUP(B126&\"_\"&C126,HCl_Min_Tests!A:BV,6,FALSE)","v":"Cherokee"},469,"2","Unit 2","Hydrogen Chloride",1.8636690352363816E-4,"lb/MMBtu",2.2756379798675817E-3,"lb/MW","ERT","",84]
[{"$f":"VLOOKUP(B127&\"_\"&C127,HCl_Min_Tests!A:BV,6,FALSE)","v":"Gibson"},6113,"4","4","Hydrogen Chloride",2.605774768912504E-4,"lb/MMBtu",2.469769883091806E-3,"lb/MW","ERT","",85]
[{"$f":"VLOOKUP(B128&\"_\"&C128,HCl_Min_Tests!A:BV,6,FALSE)","v":"Gibson"},6113,"4","4","Hydrogen Chloride",5.4699263348207121E-4,"lb/MMBtu",5.1844309361046533E-3,"lb/MW","Part II","U4010406",85]
[{"$f":"VLOOKUP(B129&\"_\"&C129,HCl_Min_Tests!A:BV,6,FALSE)","v":"R D Green"},6639,"G2","2","Hydrogen Chloride",2.2267496503035716E-4,"lb/MMBtu",2.5403579901747777E-3,"lb/MW","ERT","",86]
[{"$f":"VLOOKUP(B130&\"_\"&C130,HCl_Min_Tests!A:BV,6,FALSE)","v":"Cross"},130,"1","C1","Hydrogen Chloride",2.4374610486427211E-4,"lb/MMBtu",2.5980937275860614E-3,"lb/MW","ERT","",87]
[{"$f":"VLOOKUP(B131&\"_\"&C131,HCl_Min_Tests!A:BV,6,FALSE)","v":"Marshall"},2727,"Unit 1","U12007","Hydrogen Chloride",2.8590391691690693E-4,"lb/MMBtu",2.6147342721635726E-3,"lb/MW","ERT","",88]
[{"$f":"VLOOKUP(B132&\"_\"&C132,HCl_Min_Tests!A:BV,6,FALSE)","v":"Marshall"},2727,"Unit 2","U22007","Hydrogen Chloride",2.8590391691690693E-4,"lb/MMBtu",2.6183080711250336E-3,"lb/MW","ERT","",89]
[{"$f":"VLOOKUP(B133&\"_\"&C133,HCl_Min_Tests!A:BV,6,FALSE)","v":"Crystal River Power Plant"},628,"5","CryR_Cfg_5c","Hydrogen Chloride",2.7384385685413096E-4,"lb/MMBtu",2.6502515637916741E-3,"lb/MW","ERT","",90]
[{"$f":"VLOOKUP(B134&\"_\"&C134,HCl_Min_Tests!A:BV,6,FALSE)","v":"Cherokee"},469,"1","Unit 1","Hydrogen Chloride",2.253718661946499E-4,"lb/MMBtu",2.6813473311363477E-3,"lb/MW","ERT","",91]
[{"$f":"VLOOKUP(B135&\"_\"&C135,HCl_Min_Tests!A:BV,6,FALSE)","v":"Labadie"},2103,"2","002","Hydrogen Chloride",2.7302749996087084E-4,"lb/MMBtu",2.7096774193548388E-3,"lb/MW","Part II","1",92]
[{"$f":"VLOOKUP(B136&\"_\"&C136,HCl_Min_Tests!A:BV,6,FALSE)","v":"HMP&L Station Two Henderson"},1382,"H1","1","Hydrogen Chloride",2.519679532483311E-4,"lb/MMBtu",2.7290207579394802E-3,"lb/MW","ERT","",93]
[{"$f":"VLOOKUP(B137&\"_\"&C137,HCl_Min_Tests!A:BV,6,FALSE)","v":"Asheville Steam Electric Plant"},2706,"1","Ash_Cfg_1d","Hydrogen Chloride",2.9533333333333337E-4,"lb/MMBtu",2.7307632850241551E-3,"lb/MW","Part II","Ash_Blr_1_Test_8r",94]
[{"$f":"VLOOKUP(B138&\"_\"&C138,HCl_Min_Tests!A:BV,6,FALSE)","v":"Asheville Steam Electric Plant"},2706,"1","Ash_Cfg_1d","Hydrogen Chloride",6.1356067479820921E-3,"lb/MMBtu",5.6732131959602534E-2,"lb/MW","ERT","",94]
[{"$f":"VLOOKUP(B139&\"_\"&C139,HCl_Min_Tests!A:BV,6,FALSE)","v":"PPL Montour"},3149,"1","U1","Hydrogen Chloride",3.0150224469107306E-4,"lb/MMBtu",2.7384877657699847E-3,"lb/MW","ERT","",95]
[{"$f":"VLOOKUP(B140&\"_\"&C140,HCl_Min_Tests!A:BV,6,FALSE)","v":"Conemaugh"},3118,"1","CON-1","Hydrogen Chloride",2.8801368141275391E-4,"lb/MMBtu",2.764746717407686E-3,"lb/MW","ERT","",96]
[{"$f":"VLOOKUP(B141&\"_\"&C141,HCl_Min_Tests!A:BV,6,FALSE)","v":"Conemaugh"},3118,"1","CON-1","Hydrogen Chloride",3.3E-4,"lb/MMBtu",3.1677884615384615E-3,"lb/MW","Part II","c-1900-2",96]
[{"$f":"VLOOKUP(B142&\"_\"&C142,HCl_Min_Tests!A:BV,6,FALSE)","v":"Nebraska City"},6096,"NC2","NC2","Hydrogen Chloride",2.7639906975612452E-4,"lb/MMBtu",2.8046213608153956E-3,"lb/MW","ERT","",97]
[{"$f":"VLOOKUP(B143&\"_\"&C143,HCl_Min_Tests!A:BV,6,FALSE)","v":"Marshall"},2727,"Unit 3","U3","Hydrogen Chloride",3.2635035851711166E-4,"lb/MMBtu",2.8453555329511202E-3,"lb/MW","ERT","",98]
[{"$f":"VLOOKUP(B144&\"_\"&C144,HCl_Min_Tests!A:BV,6,FALSE)","v":"Wansley"},6052,"1","Unit 1","Hydrogen Chloride",3.1073736993613934E-4,"lb/MMBtu",2.8526328922777997E-3,"lb/MW","ERT","",99]
[{"$f":"VLOOKUP(B145&\"_\"&C145,HCl_Min_Tests!A:BV,6,FALSE)","v":"Springerville"},8223,"3","3","Hydrogen Chloride",3.0597600000000001E-4,"lb/MMBtu",2.8557760000000004E-3,"lb/MW","ETTS","",100]
[{"$f":"VLOOKUP(B146&\"_\"&C146,HCl_Min_Tests!A:BV,6,FALSE)","v":"John E. Amos"},3935,"3","AM-3","Hydrogen Chloride",3.1261917495535905E-4,"lb/MMBtu",2.8703249786670507E-3,"lb/MW","ERT","",101]
[{"$f":"VLOOKUP(B147&\"_\"&C147,HCl_Min_Tests!A:BV,6,FALSE)","v":"Mt. Storm"},3954,"3","Unit 3","Hydrogen Chloride",2.8487699962828763E-4,"lb/MMBtu",3.0141594655204501E-3,"lb/MW","ERT","",102]
[{"$f":"VLOOKUP(B148&\"_\"&C148,HCl_Min_Tests!A:BV,6,FALSE)","v":"Conemaugh"},3118,"2","CON-2","Hydrogen Chloride",3.3266086643067225E-4,"lb/MMBtu",3.1933310735893059E-3,"lb/MW","ERT","",103]
[{"$f":"VLOOKUP(B149&\"_\"&C149,HCl_Min_Tests!A:BV,6,FALSE)","v":"Conemaugh"},3118,"2","CON-2","Hydrogen Chloride",4.6666666666666666E-4,"lb/MMBtu",4.4797008547008549E-3,"lb/MW","Part II","C-193-2",103]
[{"$f":"VLOOKUP(B150&\"_\"&C150,HCl_Min_Tests!A:BV,6,FALSE)","v":"AES Cayuga, LLC"},2535,"1","Unit_1","Hydrogen Chloride",3.5900740531135728E-4,"lb/MMBtu",3.2004196741780753E-3,"lb/MW","ERT","",104]
[{"$f":"VLOOKUP(B151&\"_\"&C151,HCl_Min_Tests!A:BV,6,FALSE)","v":"PPL Montour"},3149,"2","U2","Hydrogen Chloride",3.5654215755528501E-4,"lb/MMBtu",3.2588493415943286E-3,"lb/MW","ERT","",105]
[{"$f":"VLOOKUP(B152&\"_\"&C152,HCl_Min_Tests!A:BV,6,FALSE)","v":"HMP&L Station Two Henderson"},1382,"H2","2","Hydrogen Chloride",3.0516085000127532E-4,"lb/MMBtu",3.2899548138207975E-3,"lb/MW","ERT","",106]
[{"$f":"VLOOKUP(B153&\"_\"&C153,HCl_Min_Tests!A:BV,6,FALSE)","v":"Montrose"},2080,"2","2","Hydrogen Chloride",2.9999999999999997E-4,"lb/MMBtu",3.3989361702127657E-3,"lb/MW","Part II","M2-3Oct2006",107]
[{"$f":"VLOOKUP(B154&\"_\"&C154,HCl_Min_Tests!A:BV,6,FALSE)","v":"Montrose"},2080,"2","2","Hydrogen Chloride",3.5999999999999999E-3,"lb/MMBtu",4.0787234042553196E-2,"lb/MW","Part II","Mon2-3Oct-Nov2005",107]
[{"$f":"VLOOKUP(B155&\"_\"&C155,HCl_Min_Tests!A:BV,6,FALSE)","v":"Montrose"},2080,"1","1","Hydrogen Chloride",2.9999999999999997E-4,"lb/MMBtu",3.4148936170212761E-3,"lb/MW","Part II","M1Oct2006",108]
[{"$f":"VLOOKUP(B156&\"_\"&C156,HCl_Min_Tests!A:BV,6,FALSE)","v":"Montrose"},2080,"1","1","Hydrogen Chloride",1E-3,"lb/MMBtu",1.1382978723404255E-2,"lb/MW","Part II","M1OctNov-2005",108]
[{"$f":"VLOOKUP(B157&\"_\"&C157,HCl_Min_Tests!A:BV,6,FALSE)","v":"Arapahoe"},465,"3","Unit 3","Hydrogen Chloride",2.1753161421979439E-4,"lb/MMBtu",3.4206846336062666E-3,"lb/MW","ERT","",109]
[{"$f":"VLOOKUP(B158&\"_\"&C158,HCl_Min_Tests!A:BV,6,FALSE)","v":"Cumberland"},3399,"1","1","Hydrogen Chloride",3.1666490950349062E-4,"lb/MMBtu",3.4419039779110174E-3,"lb/MW","ERT","",110]
[{"$f":"VLOOKUP(B159&\"_\"&C159,HCl_Min_Tests!A:BV,6,FALSE)","v":"Cherokee"},469,"3","Unit 3","Hydrogen Chloride",3.0540492014800299E-4,"lb/MMBtu",3.4742123340472824E-3,"lb/MW","ERT","",111]
[{"$f":"VLOOKUP(B160&\"_\"&C160,HCl_Min_Tests!A:BV,6,FALSE)","v":"Red Hills Generating Facility"},55076,"AA-002","002","Hydrogen Chloride",3.6675435864666662E-4,"lb/MMBtu",3.494875634415816E-3,"lb/MW","ETTS","",112]
[{"$f":"VLOOKUP(B161&\"_\"&C161,HCl_Min_Tests!A:BV,6,FALSE)","v":"Red Hills Generating Facility"},55076,"AA-002","002","Hydrogen Chloride",3.8666666666666672E-4,"lb/MMBtu",3.6846240000000009E-3,"lb/MW","Part II","10-05",112]
[{"$f":"VLOOKUP(B162&\"_\"&C162,HCl_Min_Tests!A:BV,6,FALSE)","v":"Red Hills Generating Facility"},55076,"AA-001","001","Hydrogen Chloride",3.6675435864666662E-4,"lb/MMBtu",3.5223088604425861E-3,"lb/MW","ETTS","",113]
[{"$f":"VLOOKUP(B163&\"_\"&C163,HCl_Min_Tests!A:BV,6,FALSE)","v":"Red Hills Generating Facility"},55076,"AA-001","001","Hydrogen Chloride",3.8666666666666672E-4,"lb/MMBtu",3.713546666666667E-3,"lb/MW","Part II","10-05",113]
[{"$f":"VLOOKUP(B164&\"_\"&C164,HCl_Min_Tests!A:BV,6,FALSE)","v":"Montrose"},2080,"3","3","Hydrogen Chloride",2.9999999999999997E-4,"lb/MMBtu",3.5904255319148936E-3,"lb/MW","Part II","M2-3Oct2006",114]
[{"$f":"VLOOKUP(B165&\"_\"&C165,HCl_Min_Tests!A:BV,6,FALSE)","v":"Montrose"},2080,"3","3","Hydrogen Chloride",3.5999999999999999E-3,"lb/MMBtu",4.3085106382978723E-2,"lb/MW","Part II","Mon2-3Oct-Nov2005",114]
[{"$f":"VLOOKUP(B166&\"_\"&C166,HCl_Min_Tests!A:BV,6,FALSE)","v":"Cumberland"},3399,"2","2","Hydrogen Chloride",3.347070960925836E-4,"lb/MMBtu",3.6380086675293897E-3,"lb/MW","ERT","",115]
[{"$f":"VLOOKUP(B167&\"_\"&C167,HCl_Min_Tests!A:BV,6,FALSE)","v":"Homer City Station"},3122,"3","HC3CONFIG","Hydrogen Chloride",4.0608274589813931E-4,"lb/MMBtu",3.6875896410603088E-3,"lb/MW","ERT","",116]
[{"$f":"VLOOKUP(B168&\"_\"&C168,HCl_Min_Tests!A:BV,6,FALSE)","v":"PPL Brunner Island"},3140,"2","U2","Hydrogen Chloride",3.9813778149642103E-4,"lb/MMBtu",3.8395475620138309E-3,"lb/MW","ERT","",117]
[{"$f":"VLOOKUP(B169&\"_\"&C169,HCl_Min_Tests!A:BV,6,FALSE)","v":"Quindaro"},1295,"1","Unit 1","Hydrogen Chloride",3.7999999999999997E-4,"lb/MMBtu",3.8592207792207786E-3,"lb/MW","Part II","HCl/HF Emissions Test Report (July 2009)",118]
[{"$f":"VLOOKUP(B170&\"_\"&C170,HCl_Min_Tests!A:BV,6,FALSE)","v":"BL England"},2378,"2","2 Coal w or w/o TDF","Hydrogen Chloride",4.0494900932400938E-4,"lb/MMBtu",3.872793872793873E-3,"lb/MW","Part II","CAM 238-026",119]
[{"$f":"VLOOKUP(B171&\"_\"&C171,HCl_Min_Tests!A:BV,6,FALSE)","v":"BL England"},2378,"2","2 Coal w or w/o TDF","Hydrogen Chloride",5.3109444723337801E-4,"lb/MMBtu",5.0792057117358324E-3,"lb/MW","Part II","CAM 238-015",119]
[{"$f":"VLOOKUP(B172&\"_\"&C172,HCl_Min_Tests!A:BV,6,FALSE)","v":"BL England"},2378,"2","2 Coal w or w/o TDF","Hydrogen Chloride",1E-3,"lb/MMBtu",9.563658099222952E-3,"lb/MW","ETTS","",119]
[{"$f":"VLOOKUP(B173&\"_\"&C173,HCl_Min_Tests!A:BV,6,FALSE)","v":"BL England"},2378,"2","2 Coal w or w/o TDF","Hydrogen Chloride",1.0115967475410994E-3,"lb/MMBtu",9.6745654277690298E-3,"lb/MW","ERT","",119]
[{"$f":"VLOOKUP(B174&\"_\"&C174,HCl_Min_Tests!A:BV,6,FALSE)","v":"Nearman Creek"},6064,"N1","N1","Hydrogen Chloride",4.0999999999999999E-4,"lb/MMBtu",3.8754079254079252E-3,"lb/MW","Part II","HCl/HF Emission Test Report",120]
[{"$f":"VLOOKUP(B175&\"_\"&C175,HCl_Min_Tests!A:BV,6,FALSE)","v":"Clover"},7213,"2","Unit 2","Hydrogen Chloride",3.3765525141401685E-4,"lb/MMBtu",3.9219357658480626E-3,"lb/MW","ERT","",121]
[{"$f":"VLOOKUP(B176&\"_\"&C176,HCl_Min_Tests!A:BV,6,FALSE)","v":"PSEG Hudson Generating Station"},2403,"U2","HUDU2E2PT2OS1-Coal","Hydrogen Chloride",3.9360825359820368E-4,"lb/MMBtu",3.9378724780174991E-3,"lb/MW","Part II","EG08009",122]
[{"$f":"VLOOKUP(B177&\"_\"&C177,HCl_Min_Tests!A:BV,6,FALSE)","v":"PSEG Hudson Generating Station"},2403,"U2","HUDU2E2PT2OS1-Coal","Hydrogen Chloride",4.5865109637738385E-4,"lb/MMBtu",4.588596689541812E-3,"lb/MW","Part II","EG07044",122]
[{"$f":"VLOOKUP(B178&\"_\"&C178,HCl_Min_Tests!A:BV,6,FALSE)","v":"PSEG Hudson Generating Station"},2403,"U2","HUDU2E2PT2OS1-Coal","Hydrogen Chloride",2.1636331037078026E-3,"lb/MMBtu",2.1646170205353185E-2,"lb/MW","Part II","HUD2 2009 5YR ST CoNg",122]
[{"$f":"VLOOKUP(B179&\"_\"&C179,HCl_Min_Tests!A:BV,6,FALSE)","v":"PSEG Hudson Generating Station"},2403,"U2","HUDU2E2PT2OS1-Coal","Hydrogen Chloride",6.1841763070835234E-2,"lb/MMBtu",0.61869885746174402,"lb/MW","Part II","EG06031A",122]
[{"$f":"VLOOKUP(B180&\"_\"&C180,HCl_Min_Tests!A:BV,6,FALSE)","v":"AES Cayuga, LLC"},2535,"2","Unit_2","Hydrogen Chloride",4.6613654531442163E-4,"lb/MMBtu",4.0232023256304246E-3,"lb/MW","ERT","",123]
[{"$f":"VLOOKUP(B181&\"_\"&C181,HCl_Min_Tests!A:BV,6,FALSE)","v":"PPL Brunner Island"},3140,"1","U1","Hydrogen Chloride",3.9813778149642103E-4,"lb/MMBtu",4.0356693306228134E-3,"lb/MW","ERT","",124]
[{"$f":"VLOOKUP(B182&\"_\"&C182,HCl_Min_Tests!A:BV,6,FALSE)","v":"Clover"},7213,"1","Unit 1","Hydrogen Chloride",3.7307076952211804E-4,"lb/MMBtu",4.2613164695066985E-3,"lb/MW","ERT","",125]
[{"$f":"VLOOKUP(B183&\"_\"&C183,HCl_Min_Tests!A:BV,6,FALSE)","v":"Newton"},6017,"2","002","Hydrogen Chloride",4.8706228669869502E-4,"lb/MMBtu",4.3207138336174558E-3,"lb/MW","ERT","",126]
[{"$f":"VLOOKUP(B184&\"_\"&C184,HCl_Min_Tests!A:BV,6,FALSE)","v":"Laramie River Station"},6204,"3","3","Hydrogen Chloride",4.1077441077441078E-4,"lb/MMBtu",4.4444444444444444E-3,"lb/MW","Part II","Acid Emissions Study",127]
[{"$f":"VLOOKUP(B185&\"_\"&C185,HCl_Min_Tests!A:BV,6,FALSE)","v":"Mt. Storm"},3954,"1","Unit 1&2","Hydrogen Chloride",4.2000569098259898E-4,"lb/MMBtu",5.0027916975883494E-3,"lb/MW","ERT","",128]
[{"$f":"VLOOKUP(B186&\"_\"&C186,HCl_Min_Tests!A:BV,6,FALSE)","v":"Mt. Storm"},3954,"2","Unit 1&2","Hydrogen Chloride",4.2000569098259898E-4,"lb/MMBtu",5.0027916975883494E-3,"lb/MW","ERT","",129]
[{"$f":"VLOOKUP(B187&\"_\"&C187,HCl_Min_Tests!A:BV,6,FALSE)","v":"Harrison Power Station"},3944,"1","Boiler1","Hydrogen Chloride",6.0156668500892024E-4,"lb/MMBtu",5.0165279547857867E-3,"lb/MW","ERT","",130]
[{"$f":"VLOOKUP(B188&\"_\"&C188,HCl_Min_Tests!A:BV,6,FALSE)","v":"Harrison Power Station"},3944,"1","Boiler1","Hydrogen Chloride",0.9,"lb/MMBtu",7.5051948051948054,"lb/MW","Part II","9",130]
[{"$f":"VLOOKUP(B189&\"_\"&C189,HCl_Min_Tests!A:BV,6,FALSE)","v":"Reid Gardner"},2324,"3","3","Hydrogen Chloride",4.5233333333333329E-4,"lb/MMBtu",5.0408678678678671E-3,"lb/MW","Part II","U3_2009_BIOMASS",131]
[{"$f":"VLOOKUP(B190&\"_\"&C190,HCl_Min_Tests!A:BV,6,FALSE)","v":"Eddystone Generating Station"},3161,"2","Unit 2","Hydrogen Chloride",6.0871049466841814E-4,"lb/MMBtu",5.042062150527782E-3,"lb/MW","ERT","",132]
[{"$f":"VLOOKUP(B191&\"_\"&C191,HCl_Min_Tests!A:BV,6,FALSE)","v":"East Bend Station"},6018,"2","2","Hydrogen Chloride",5.2845554372447847E-4,"lb/MMBtu",5.1268073379306632E-3,"lb/MW","ERT","",133]
[{"$f":"VLOOKUP(B192&\"_\"&C192,HCl_Min_Tests!A:BV,6,FALSE)","v":"Harrison Power Station"},3944,"3","Boiler3","Hydrogen Chloride",6.2058304035335322E-4,"lb/MMBtu",5.2695750651969705E-3,"lb/MW","ERT","",134]
[{"$f":"VLOOKUP(B193&\"_\"&C193,HCl_Min_Tests!A:BV,6,FALSE)","v":"Wygen 2"},56319,"0001","WYG2Cfg","Hydrogen Chloride",3.9233333333333335E-4,"lb/MMBtu",5.3128472222222223E-3,"lb/MW","ETTS","",135]
[{"$f":"VLOOKUP(B194&\"_\"&C194,HCl_Min_Tests!A:BV,6,FALSE)","v":"Wygen 2"},56319,"0001","WYG2Cfg","Hydrogen Chloride",4.0000065083638128E-4,"lb/MMBtu",5.4166754800759965E-3,"lb/MW","ERT","",135]
[{"$f":"VLOOKUP(B195&\"_\"&C195,HCl_Min_Tests!A:BV,6,FALSE)","v":"Bailly"},995,"7","7","Hydrogen Chloride",5.7519726985606734E-4,"lb/MMBtu",5.3532564092286265E-3,"lb/MW","ERT","",136]
[{"$f":"VLOOKUP(B196&\"_\"&C196,HCl_Min_Tests!A:BV,6,FALSE)","v":"Ray D Nixon"},8219,"1","Unit 1","Hydrogen Chloride",5.8450000000000006E-4,"lb/MMBtu",5.4423444444444457E-3,"lb/MW","Part II","Airtech 2341",137]
[{"$f":"VLOOKUP(B197&\"_\"&C197,HCl_Min_Tests!A:BV,6,FALSE)","v":"Ray D Nixon"},8219,"1","Unit 1","Hydrogen Chloride",9.6999999999999994E-4,"lb/MMBtu",9.0317777777777775E-3,"lb/MW","Part II","APT CSU5148",137]
[{"$f":"VLOOKUP(B198&\"_\"&C198,HCl_Min_Tests!A:BV,6,FALSE)","v":"Bailly"},995,"8","8","Hydrogen Chloride",5.7519726985606734E-4,"lb/MMBtu",5.5133965582226455E-3,"lb/MW","ERT","",138]
[{"$f":"VLOOKUP(B199&\"_\"&C199,HCl_Min_Tests!A:BV,6,FALSE)","v":"Duck Creek"},6016,"1","001","Hydrogen Chloride",5.0140548643396083E-4,"lb/MMBtu",5.6408117223820595E-3,"lb/MW","ERT","",139]
[{"$f":"VLOOKUP(B200&\"_\"&C200,HCl_Min_Tests!A:BV,6,FALSE)","v":"Duck Creek"},6016,"1","001","Hydrogen Chloride",1.14E-3,"lb/MMBtu",1.2825E-2,"lb/MW","Part II","3",139]
[{"$f":"VLOOKUP(B201&\"_\"&C201,HCl_Min_Tests!A:BV,6,FALSE)","v":"Boswell Energy Center"},1893,"3","BEC3","Hydrogen Chloride",5.1266744943926886E-4,"lb/MMBtu",5.681730553306198E-3,"lb/MW","ERT","",140]
[{"$f":"VLOOKUP(B202&\"_\"&C202,HCl_Min_Tests!A:BV,6,FALSE)","v":"Harrison Power Station"},3944,"2","Boiler2","Hydrogen Chloride",6.5681230169897797E-4,"lb/MMBtu",5.7347686804410771E-3,"lb/MW","ERT","",141]
[{"$f":"VLOOKUP(B203&\"_\"&C203,HCl_Min_Tests!A:BV,6,FALSE)","v":"Elrama Power Plant"},3098,"4","ELR4-2","Hydrogen Chloride",5.53039270030101E-4,"lb/MMBtu",5.742640203934184E-3,"lb/MW","ERT","",142]
[{"$f":"VLOOKUP(B204&\"_\"&C204,HCl_Min_Tests!A:BV,6,FALSE)","v":"Elrama Power Plant"},3098,"3","ELR3-2","Hydrogen Chloride",5.53039270030101E-4,"lb/MMBtu",5.7648813507937728E-3,"lb/MW","ERT","",143]
[{"$f":"VLOOKUP(B205&\"_\"&C205,HCl_Min_Tests!A:BV,6,FALSE)","v":"Belews Creek Steam Station"},8042,"Unit 1","1-2008","Hydrogen Chloride",6.3354197760071181E-4,"lb/MMBtu",5.7701580014232479E-3,"lb/MW","ERT","",144]
[{"$f":"VLOOKUP(B206&\"_\"&C206,HCl_Min_Tests!A:BV,6,FALSE)","v":"Mecklenburg Power Station"},52007,"BLR1","Unit 1 & 2","Hydrogen Chloride",4.858859468511503E-4,"lb/MMBtu",5.8625975429276948E-3,"lb/MW","ERT","",145]
[{"$f":"VLOOKUP(B207&\"_\"&C207,HCl_Min_Tests!A:BV,6,FALSE)","v":"Mecklenburg Power Station"},52007,"BLR2","Unit 1 & 2","Hydrogen Chloride",4.858859468511503E-4,"lb/MMBtu",5.8625975429276948E-3,"lb/MW","ERT","",146]
[{"$f":"VLOOKUP(B208&\"_\"&C208,HCl_Min_Tests!A:BV,6,FALSE)","v":"Ghent"},1356,"3","GH3","Hydrogen Chloride",5.2655471938923583E-4,"lb/MMBtu",5.8853773207162589E-3,"lb/MW","ERT","",147]
[{"$f":"VLOOKUP(B209&\"_\"&C209,HCl_Min_Tests!A:BV,6,FALSE)","v":"Joliet 9"},874,"5","JOL5 CONFIG","Hydrogen Chloride",5.4129457770278535E-4,"lb/MMBtu",5.9316222113641745E-3,"lb/MW","ERT","",148]
[{"$f":"VLOOKUP(B210&\"_\"&C210,HCl_Min_Tests!A:BV,6,FALSE)","v":"Joppa Steam"},887,"1","1","Hydrogen Chloride",6.4118121105163678E-4,"lb/MMBtu",6.296378504598724E-3,"lb/MW","ERT","",149]
[{"$f":"VLOOKUP(B211&\"_\"&C211,HCl_Min_Tests!A:BV,6,FALSE)","v":"Urquhart"},3295,"URQ3","URQ003","Hydrogen Chloride",6.3899999999999992E-4,"lb/MMBtu",6.5016699029126213E-3,"lb/MW","ETTS","",150]
[{"$f":"VLOOKUP(B212&\"_\"&C212,HCl_Min_Tests!A:BV,6,FALSE)","v":"Elrama Power Plant"},3098,"1","ELR1-2","Hydrogen Chloride",5.53039270030101E-4,"lb/MMBtu",6.9351124461774659E-3,"lb/MW","ERT","",151]
[{"$f":"VLOOKUP(B213&\"_\"&C213,HCl_Min_Tests!A:BV,6,FALSE)","v":"Elrama Power Plant"},3098,"2","ELR2-2","Hydrogen Chloride",5.53039270030101E-4,"lb/MMBtu",6.9351124461774659E-3,"lb/MW","ERT","",152]
[{"$f":"VLOOKUP(B214&\"_\"&C214,HCl_Min_Tests!A:BV,6,FALSE)","v":"W H Zimmer"},6019,"1","1","Hydrogen Chloride",8.7784160862531017E-4,"lb/MMBtu",7.8905990048025038E-3,"lb/MW","ERT","",153]
[{"$f":"VLOOKUP(B215&\"_\"&C215,HCl_Min_Tests!A:BV,6,FALSE)","v":"Ghent"},1356,"4","GH4","Hydrogen Chloride",6.966455205662473E-4,"lb/MMBtu",7.9178739451786634E-3,"lb/MW","ERT","",154]
[{"$f":"VLOOKUP(B216&\"_\"&C216,HCl_Min_Tests!A:BV,6,FALSE)","v":"La Cygne"},1241,"2","2","Hydrogen Chloride",7.3104455206542487E-4,"lb/MMBtu",8.2175810962098854E-3,"lb/MW","ERT","",155]
[{"$f":"VLOOKUP(B217&\"_\"&C217,HCl_Min_Tests!A:BV,6,FALSE)","v":"La Cygne"},1241,"2","2","Hydrogen Chloride",8.9999999999999998E-4,"lb/MMBtu",1.0116788321167884E-2,"lb/MW","Part II","LC2AcidGas2005",155]
[{"$f":"VLOOKUP(B218&\"_\"&C218,HCl_Min_Tests!A:BV,6,FALSE)","v":"La Cygne"},1241,"2","2","Hydrogen Chloride",1.012959729346284E-3,"lb/MMBtu",1.1386554621848739E-2,"lb/MW","Part II","LC2HCl&HfTestJuly2006",155]
[{"$f":"VLOOKUP(B219&\"_\"&C219,HCl_Min_Tests!A:BV,6,FALSE)","v":"James River Power Station"},2161,"4","Unit_4_JRPS","Hydrogen Chloride",8.3333333333333339E-4,"lb/MMBtu",8.3333333333333332E-3,"lb/MW","ETTS","",156]
[{"$f":"VLOOKUP(B220&\"_\"&C220,HCl_Min_Tests!A:BV,6,FALSE)","v":"G G Allen"},2718,"ES-3","3-2009","Hydrogen Chloride",1.0590926888460891E-3,"lb/MMBtu",8.3824458641175367E-3,"lb/MW","ERT","",157]
[{"$f":"VLOOKUP(B221&\"_\"&C221,HCl_Min_Tests!A:BV,6,FALSE)","v":"Hoot Lake"},1943,"002","2","Hydrogen Chloride",6.8829413712907285E-4,"lb/MMBtu",8.472708060343382E-3,"lb/MW","ERT","",158]
[{"$f":"VLOOKUP(B222&\"_\"&C222,HCl_Min_Tests!A:BV,6,FALSE)","v":"G G Allen"},2718,"ES-4","4-2009","Hydrogen Chloride",1.0590926888460891E-3,"lb/MMBtu",8.4784413032414786E-3,"lb/MW","ERT","",159]
[{"$f":"VLOOKUP(B223&\"_\"&C223,HCl_Min_Tests!A:BV,6,FALSE)","v":"Mitchell Power Station"},3181,"33","033","Hydrogen Chloride",9.7203039498182375E-4,"lb/MMBtu",8.6204633298907068E-3,"lb/MW","Part II","Halogen Measurements 26A",160]
[{"$f":"VLOOKUP(B224&\"_\"&C224,HCl_Min_Tests!A:BV,6,FALSE)","v":"Quindaro"},1295,"2","Unit 2","Hydrogen Chloride",7.6333333333333331E-4,"lb/MMBtu",8.8821925431274342E-3,"lb/MW","Part II","HCl/HF Emissions Test Report (July 2009)",161]
[{"$f":"VLOOKUP(B225&\"_\"&C225,HCl_Min_Tests!A:BV,6,FALSE)","v":"Birchwood Power Facility"},54304,"1A","1A","Hydrogen Chloride",8.6666666666666663E-4,"lb/MMBtu",8.9789789789789781E-3,"lb/MW","ETTS","",162]
[{"$f":"VLOOKUP(B226&\"_\"&C226,HCl_Min_Tests!A:BV,6,FALSE)","v":"Monticello"},6147,"2","2","Hydrogen Chloride",7.4885695641079518E-4,"lb/MMBtu",8.9914214320335611E-3,"lb/MW","ERT","",163]
[{"$f":"VLOOKUP(B227&\"_\"&C227,HCl_Min_Tests!A:BV,6,FALSE)","v":"Dunkirk Generating Plant"},2554,"4","4","Hydrogen Chloride",9.6695665512505798E-4,"lb/MMBtu",9.1042688144082392E-3,"lb/MW","ERT","",164]
[{"$f":"VLOOKUP(B228&\"_\"&C228,HCl_Min_Tests!A:BV,6,FALSE)","v":"Stanton Energy Center"},564,"2","2 coal","Hydrogen Chloride",1.0494830346784402E-3,"lb/MMBtu",9.6112912107516966E-3,"lb/MW","ERT","",165]
[{"$f":"VLOOKUP(B229&\"_\"&C229,HCl_Min_Tests!A:BV,6,FALSE)","v":"Waukegan"},883,"8","WK8CONFIG","Hydrogen Chloride",9.4096590435598451E-4,"lb/MMBtu",9.7312384408260681E-3,"lb/MW","ERT","",166]
[{"$f":"VLOOKUP(B230&\"_\"&C230,HCl_Min_Tests!A:BV,6,FALSE)","v":"G G Allen"},2718,"ES-2","2-2009","Hydrogen Chloride",1.1427290670382338E-3,"lb/MMBtu",9.7422495037327375E-3,"lb/MW","ERT","",167]
[{"$f":"VLOOKUP(B231&\"_\"&C231,HCl_Min_Tests!A:BV,6,FALSE)","v":"Dunkirk Generating Plant"},2554,"1","1","Hydrogen Chloride",9.1344548107051419E-4,"lb/MMBtu",9.9103461487438614E-3,"lb/MW","ERT","",168]
[{"$f":"VLOOKUP(B232&\"_\"&C232,HCl_Min_Tests!A:BV,6,FALSE)","v":"Potomac River"},3788,"4","4","Hydrogen Chloride",1.1299999999999999E-3,"lb/MMBtu",1.0054907407407408E-2,"lb/MW","Part II","C4 PM 1208",169]
[{"$f":"VLOOKUP(B233&\"_\"&C233,HCl_Min_Tests!A:BV,6,FALSE)","v":"Potomac River"},3788,"4","4","Hydrogen Chloride",9.9500000000000005E-3,"lb/MMBtu",8.8536574074074087E-2,"lb/MW","Part II","C4 PM 0108",169]
[{"$f":"VLOOKUP(B234&\"_\"&C234,HCl_Min_Tests!A:BV,6,FALSE)","v":"G G Allen"},2718,"ES-5","5-2009","Hydrogen Chloride",1.1427290670382338E-3,"lb/MMBtu",1.0834497463506561E-2,"lb/MW","ERT","",170]
[{"$f":"VLOOKUP(B235&\"_\"&C235,HCl_Min_Tests!A:BV,6,FALSE)","v":"Elmer Smith Station"},1374,"1374","Unit001","Hydrogen Chloride",1.3368658253731819E-3,"lb/MMBtu",1.1088918556020072E-2,"lb/MW","ERT","",171]
[{"$f":"VLOOKUP(B236&\"_\"&C236,HCl_Min_Tests!A:BV,6,FALSE)","v":"Elmer Smith Station"},1374,"1374-2","Unit001","Hydrogen Chloride",1.3368658253731819E-3,"lb/MMBtu",1.1088918556020072E-2,"lb/MW","ERT","",172]
[{"$f":"VLOOKUP(B237&\"_\"&C237,HCl_Min_Tests!A:BV,6,FALSE)","v":"G G Allen"},2718,"ES-1","1-2009","Hydrogen Chloride",1.1427290670382338E-3,"lb/MMBtu",1.127164085421368E-2,"lb/MW","ERT","",173]
[{"$f":"VLOOKUP(B238&\"_\"&C238,HCl_Min_Tests!A:BV,6,FALSE)","v":"Pulliam"},4072,"8","8","Hydrogen Chloride",1.1820000000000001E-3,"lb/MMBtu",1.2942857142857145E-2,"lb/MW","ETTS","",174]
[{"$f":"VLOOKUP(B239&\"_\"&C239,HCl_Min_Tests!A:BV,6,FALSE)","v":"Silver Bay Power"},10849,"BLR1","GEN1","Hydrogen Chloride",1.6633023435666666E-3,"lb/MMBtu",1.3746708624405996E-2,"lb/MW","ETTS","",175]
[{"$f":"VLOOKUP(B240&\"_\"&C240,HCl_Min_Tests!A:BV,6,FALSE)","v":"Coffeen"},861,"1","001","Hydrogen Chloride",1.5179042339366552E-3,"lb/MMBtu",1.3838226932722507E-2,"lb/MW","ERT","",176]
[{"$f":"VLOOKUP(B241&\"_\"&C241,HCl_Min_Tests!A:BV,6,FALSE)","v":"Gallatin"},3403,"2","2","Hydrogen Chloride",1.5582137466406503E-3,"lb/MMBtu",1.4283626010872626E-2,"lb/MW","ERT","",177]
[{"$f":"VLOOKUP(B242&\"_\"&C242,HCl_Min_Tests!A:BV,6,FALSE)","v":"Martin Drake"},492,"7","Unit 7 - Coal","Hydrogen Chloride",1.4666666666666667E-3,"lb/MMBtu",1.5342789598108747E-2,"lb/MW","Part II","Airtech 2383A",178]
[{"$f":"VLOOKUP(B243&\"_\"&C243,HCl_Min_Tests!A:BV,6,FALSE)","v":"Martin Drake"},492,"7","Unit 7 - Coal","Hydrogen Chloride",1.9566666666666665E-3,"lb/MMBtu",2.0468676122931441E-2,"lb/MW","Part II","Airtech 2383",178]
[{"$f":"VLOOKUP(B244&\"_\"&C244,HCl_Min_Tests!A:BV,6,FALSE)","v":"AES Hawaii"},10673,"BLR B","002","Hydrogen Chloride",1.8274842302704016E-3,"lb/MMBtu",1.7000104534200131E-2,"lb/MW","ERT","",179]
[{"$f":"VLOOKUP(B245&\"_\"&C245,HCl_Min_Tests!A:BV,6,FALSE)","v":"Potomac River"},3788,"1","1","Hydrogen Chloride",1.81E-3,"lb/MMBtu",1.8878494623655914E-2,"lb/MW","Part II","C1 PM SBC20 0508",180]
[{"$f":"VLOOKUP(B246&\"_\"&C246,HCl_Min_Tests!A:BV,6,FALSE)","v":"Potomac River"},3788,"1","1","Hydrogen Chloride",1.8799999999999999E-3,"lb/MMBtu",1.9608602150537634E-2,"lb/MW","Part II","C1 PM SBC30 0508",180]
[{"$f":"VLOOKUP(B247&\"_\"&C247,HCl_Min_Tests!A:BV,6,FALSE)","v":"Potomac River"},3788,"1","1","Hydrogen Chloride",2.0999999999999999E-3,"lb/MMBtu",2.1903225806451612E-2,"lb/MW","Part II","C1 PM SBC50 0508",180]
[{"$f":"VLOOKUP(B248&\"_\"&C248,HCl_Min_Tests!A:BV,6,FALSE)","v":"Potomac River"},3788,"1","1","Hydrogen Chloride",2.8999999999999998E-3,"lb/MMBtu",3.0247311827956987E-2,"lb/MW","Part II","C1 PM SBC60 0508",180]
[{"$f":"VLOOKUP(B249&\"_\"&C249,HCl_Min_Tests!A:BV,6,FALSE)","v":"Bridgeport Station"},568,"BHB3","BHSEMU3OS2-Coal","Hydrogen Chloride",1.8993322903989014E-3,"lb/MMBtu",1.9323231738549617E-2,"lb/MW","ERT","",181]
[{"$f":"VLOOKUP(B250&\"_\"&C250,HCl_Min_Tests!A:BV,6,FALSE)","v":"Big Stone"},6098,"001","001","Hydrogen Chloride",1.8333333333333333E-3,"lb/MMBtu",1.9662962962962962E-2,"lb/MW","Part II","HCl and HF Emission Engineering Test",182]
[{"$f":"VLOOKUP(B251&\"_\"&C251,HCl_Min_Tests!A:BV,6,FALSE)","v":"Martin Drake"},492,"5","Unit 5 - Coal","Hydrogen Chloride",2.0300000000000001E-3,"lb/MMBtu",2.103818181818182E-2,"lb/MW","Part II","Airtech 2383A",183]
[{"$f":"VLOOKUP(B252&\"_\"&C252,HCl_Min_Tests!A:BV,6,FALSE)","v":"Martin Drake"},492,"5","Unit 5 - Coal","Hydrogen Chloride",2.875E-3,"lb/MMBtu",2.9795454545454545E-2,"lb/MW","Part II","Airtech 2383",183]
[{"$f":"VLOOKUP(B253&\"_\"&C253,HCl_Min_Tests!A:BV,6,FALSE)","v":"Spruance Genco, LLC"},54081,"1A","GEN1","Hydrogen Chloride",1.7743382064989756E-3,"lb/MMBtu",2.3183861583174765E-2,"lb/MW","ERT","",184]
[{"$f":"VLOOKUP(B254&\"_\"&C254,HCl_Min_Tests!A:BV,6,FALSE)","v":"Spruance Genco, LLC"},54081,"1B","GEN1","Hydrogen Chloride",1.7743382064989756E-3,"lb/MMBtu",2.3183861583174765E-2,"lb/MW","ERT","",185]
[{"$f":"VLOOKUP(B255&\"_\"&C255,HCl_Min_Tests!A:BV,6,FALSE)","v":"Salem Harbor"},1626,"1","Unit 1","Hydrogen Chloride",2.0395907008995099E-3,"lb/MMBtu",2.4574589193952508E-2,"lb/MW","ERT","",186]
[{"$f":"VLOOKUP(B256&\"_\"&C256,HCl_Min_Tests!A:BV,6,FALSE)","v":"RS Nelson"},1393,"6","001","Hydrogen Chloride",2.5800000000000003E-3,"lb/MMBtu",2.5626517241379314E-2,"lb/MW","ETTS","",187]
[{"$f":"VLOOKUP(B257&\"_\"&C257,HCl_Min_Tests!A:BV,6,FALSE)","v":"TransAlta Centralia Generation"},3845,"BD21","BW21CONFIG","Hydrogen Chloride",2.1217898335917397E-3,"lb/MMBtu",2.724547045025015E-2,"lb/MW","ERT","",188]
[{"$f":"VLOOKUP(B258&\"_\"&C258,HCl_Min_Tests!A:BV,6,FALSE)","v":"AES Hawaii"},10673,"BLR A","001","Hydrogen Chloride",2.8947442146795023E-3,"lb/MMBtu",2.9129967890380727E-2,"lb/MW","ERT","",189]
[{"$f":"VLOOKUP(B259&\"_\"&C259,HCl_Min_Tests!A:BV,6,FALSE)","v":"TransAlta Centralia Generation"},3845,"BD22","BW22CONFIG","Hydrogen Chloride",2.2945784847301968E-3,"lb/MMBtu",3.1334958037506022E-2,"lb/MW","ERT","",190]
[{"$f":"VLOOKUP(B260&\"_\"&C260,HCl_Min_Tests!A:BV,6,FALSE)","v":"Big Bend"},645,"1","BB01_pre-SCR","Hydrogen Chloride",3.7890135828660605E-3,"lb/MMBtu",3.730792154641533E-2,"lb/MW","ERT","",191]
[{"$f":"VLOOKUP(B261&\"_\"&C261,HCl_Min_Tests!A:BV,6,FALSE)","v":"Springerville"},8223,"4","4","Hydrogen Chloride",4.6461666666666665E-3,"lb/MMBtu",4.3364222222222221E-2,"lb/MW","ETTS","",192]
[{"$f":"VLOOKUP(B262&\"_\"&C262,HCl_Min_Tests!A:BV,6,FALSE)","v":"AES Shady Point,LLC"},10671,"1A","Unit 1","Hydrogen Chloride",3.2649929640079199E-3,"lb/MMBtu",4.5319532240221262E-2,"lb/MW","ERT","",193]
[{"$f":"VLOOKUP(B263&\"_\"&C263,HCl_Min_Tests!A:BV,6,FALSE)","v":"AES Shady Point,LLC"},10671,"1b","Unit 1","Hydrogen Chloride",3.2649929640079199E-3,"lb/MMBtu",4.5319532240221262E-2,"lb/MW","ERT","",194]
[{"$f":"VLOOKUP(B264&\"_\"&C264,HCl_Min_Tests!A:BV,6,FALSE)","v":"AES Shady Point,LLC"},10671,"2a","Unit 2","Hydrogen Chloride",3.2649929640079199E-3,"lb/MMBtu",4.5319532240221262E-2,"lb/MW","ERT","",195]
[{"$f":"VLOOKUP(B265&\"_\"&C265,HCl_Min_Tests!A:BV,6,FALSE)","v":"AES Shady Point,LLC"},10671,"2b","Unit 2","Hydrogen Chloride",3.2649929640079199E-3,"lb/MMBtu",4.5319532240221262E-2,"lb/MW","ERT","",196]
[{"$f":"VLOOKUP(B266&\"_\"&C266,HCl_Min_Tests!A:BV,6,FALSE)","v":"Big Bend"},645,"2","BB02_SCR","Hydrogen Chloride",6.3387839815559005E-3,"lb/MMBtu",6.1779953147066774E-2,"lb/MW","ERT","",197]
[{"$f":"VLOOKUP(B267&\"_\"&C267,HCl_Min_Tests!A:BV,6,FALSE)","v":"Reid Gardner"},2324,"1","1","Hydrogen Chloride",5.7130599223756658E-3,"lb/MMBtu",6.2534845096274175E-2,"lb/MW","ERT","",198]
[{"$f":"VLOOKUP(B268&\"_\"&C268,HCl_Min_Tests!A:BV,6,FALSE)","v":"Whitewater Valley"},1040,"2","002","Hydrogen Chloride",7.2621967220610996E-3,"lb/MMBtu",7.6831936334849318E-2,"lb/MW","ERT","",199]
[{"$f":"VLOOKUP(B269&\"_\"&C269,HCl_Min_Tests!A:BV,6,FALSE)","v":"R.M. Schahfer"},6085,"14","R.M.0014","Hydrogen Chloride",7.8754083590615084E-3,"lb/MMBtu",7.824924972144448E-2,"lb/MW","ERT","",200]
[{"$f":"VLOOKUP(B270&\"_\"&C270,HCl_Min_Tests!A:BV,6,FALSE)","v":"Richard Gorsuch"},7253,"3","UNIT3","Hydrogen Chloride",7.7709889049627249E-3,"lb/MMBtu",8.0625832353553223E-2,"lb/MW","ERT","",201]
[{"$f":"VLOOKUP(B271&\"_\"&C271,HCl_Min_Tests!A:BV,6,FALSE)","v":"Arapahoe"},465,"4","Unit 4","Hydrogen Chloride",6.150235576976238E-3,"lb/MMBtu",8.9095022841382904E-2,"lb/MW","ERT","",202]
[{"$f":"VLOOKUP(B272&\"_\"&C272,HCl_Min_Tests!A:BV,6,FALSE)","v":"O H Hutchings"},2848,"H-5","H-5","Hydrogen Chloride",9.0000000000000011E-3,"lb/MMBtu",9.1571428571428581E-2,"lb/MW","Part II","2009 H-5 EF Trial Baseline HCl",203]
[{"$f":"VLOOKUP(B273&\"_\"&C273,HCl_Min_Tests!A:BV,6,FALSE)","v":"General James M. Gavin"},8102,"2","GA-2","Hydrogen Chloride",1.1176762718697377E-2,"lb/MMBtu",0.10106503015937265,"lb/MW","ERT","",204]
[{"$f":"VLOOKUP(B274&\"_\"&C274,HCl_Min_Tests!A:BV,6,FALSE)","v":"General James M. Gavin"},8102,"1","GA-1","Hydrogen Chloride",1.1537044229893059E-2,"lb/MMBtu",0.10432284843030573,"lb/MW","ERT","",205]
[{"$f":"VLOOKUP(B275&\"_\"&C275,HCl_Min_Tests!A:BV,6,FALSE)","v":"Mitchell"},3948,"2","MI-2","Hydrogen Chloride",1.2260418741654259E-2,"lb/MMBtu",0.10543689766803002,"lb/MW","ERT","",206]
[{"$f":"VLOOKUP(B276&\"_\"&C276,HCl_Min_Tests!A:BV,6,FALSE)","v":"Cope"},7210,"COP1","COP001","Hydrogen Chloride",1.1766666666666667E-2,"lb/MMBtu",0.10830402872260014,"lb/MW","ETTS","",207]
[{"$f":"VLOOKUP(B277&\"_\"&C277,HCl_Min_Tests!A:BV,6,FALSE)","v":"Mitchell"},3948,"1","MI-1","Hydrogen Chloride",1.311690448170604E-2,"lb/MMBtu",0.11280248617123166,"lb/MW","ERT","",208]
[{"$f":"VLOOKUP(B278&\"_\"&C278,HCl_Min_Tests!A:BV,6,FALSE)","v":"Wabash River"},1010,"6","6","Hydrogen Chloride",1.2675252967989869E-2,"lb/MMBtu",0.11337533825112742,"lb/MW","ERT","",209]
[{"$f":"VLOOKUP(B279&\"_\"&C279,HCl_Min_Tests!A:BV,6,FALSE)","v":"Morgantown Energy Facility"},10743,"CFB1","Unit 1&2","Hydrogen Chloride",7.274912830340108E-3,"lb/MMBtu",0.11414087371740515,"lb/MW","ERT","",210]
[{"$f":"VLOOKUP(B280&\"_\"&C280,HCl_Min_Tests!A:BV,6,FALSE)","v":"Morgantown Energy Facility"},10743,"CFB1","Unit 1&2","Hydrogen Chloride",7.3000000000000001E-3,"lb/MMBtu",0.1145344827586207,"lb/MW","ETTS","",210]
[{"$f":"VLOOKUP(B281&\"_\"&C281,HCl_Min_Tests!A:BV,6,FALSE)","v":"Morgantown Energy Facility"},10743,"CFB2","Unit 1&2","Hydrogen Chloride",7.274912830340108E-3,"lb/MMBtu",0.11414087371740515,"lb/MW","ERT","",211]
[{"$f":"VLOOKUP(B282&\"_\"&C282,HCl_Min_Tests!A:BV,6,FALSE)","v":"Morgantown Energy Facility"},10743,"CFB2","Unit 1&2","Hydrogen Chloride",7.3000000000000001E-3,"lb/MMBtu",0.1145344827586207,"lb/MW","ETTS","",211]
[{"$f":"VLOOKUP(B283&\"_\"&C283,HCl_Min_Tests!A:BV,6,FALSE)","v":"Wabash River"},1010,"4","4","Hydrogen Chloride",1.2675252967989869E-2,"lb/MMBtu",0.13008964211408225,"lb/MW","ERT","",212]
[{"$f":"VLOOKUP(B284&\"_\"&C284,HCl_Min_Tests!A:BV,6,FALSE)","v":"Dallman"},963,"31","31","Hydrogen Chloride",1.2589666666666666E-2,"lb/MMBtu",0.13458633437037035,"lb/MW","ETTS","",213]
[{"$f":"VLOOKUP(B285&\"_\"&C285,HCl_Min_Tests!A:BV,6,FALSE)","v":"Dallman"},963,"32","32","Hydrogen Chloride",1.2589666666666666E-2,"lb/MMBtu",0.135779555,"lb/MW","ETTS","",214]
[{"$f":"VLOOKUP(B286&\"_\"&C286,HCl_Min_Tests!A:BV,6,FALSE)","v":"Colbert"},47,"3","3","Hydrogen Chloride",1.3641159247738151E-2,"lb/MMBtu",0.1446644938222631,"lb/MW","ERT","",215]
[{"$f":"VLOOKUP(B287&\"_\"&C287,HCl_Min_Tests!A:BV,6,FALSE)","v":"Sioux"},2107,"2","002","Hydrogen Chloride",1.6034472023995241E-2,"lb/MMBtu",0.15055267625583318,"lb/MW","ERT","",216]
[{"$f":"VLOOKUP(B288&\"_\"&C288,HCl_Min_Tests!A:BV,6,FALSE)","v":"PANTHER CREEK ENERGY FACILITY"},50776,"BLR1","BG1","Hydrogen Chloride",1.1810489489606335E-2,"lb/MMBtu",0.152393412769114,"lb/MW","ERT","",217]
[{"$f":"VLOOKUP(B289&\"_\"&C289,HCl_Min_Tests!A:BV,6,FALSE)","v":"PANTHER CREEK ENERGY FACILITY"},50776,"BLR1","BG1","Hydrogen Chloride",1.8500000000000003E-2,"lb/MMBtu",0.23870967741935487,"lb/MW","Part II","B1 Acid Gas Test",217]
[{"$f":"VLOOKUP(B290&\"_\"&C290,HCl_Min_Tests!A:BV,6,FALSE)","v":"PANTHER CREEK ENERGY FACILITY"},50776,"BLR2","BG2","Hydrogen Chloride",1.1810489489606335E-2,"lb/MMBtu",0.152393412769114,"lb/MW","ERT","",218]
[{"$f":"VLOOKUP(B291&\"_\"&C291,HCl_Min_Tests!A:BV,6,FALSE)","v":"PANTHER CREEK ENERGY FACILITY"},50776,"BLR2","BG2","Hydrogen Chloride",1.9466666666666663E-2,"lb/MMBtu",0.25118279569892465,"lb/MW","Part II","B2 Acid Gas Test",218]
[{"$f":"VLOOKUP(B292&\"_\"&C292,HCl_Min_Tests!A:BV,6,FALSE)","v":"Tanners Creek"},988,"4","TC-4","Hydrogen Chloride",1.7864752361641676E-2,"lb/MMBtu",0.15377801325615312,"lb/MW","ERT","",219]
[{"$f":"VLOOKUP(B293&\"_\"&C293,HCl_Min_Tests!A:BV,6,FALSE)","v":"AES Warrior Run Cogeneration Facility"},10678,"BLR1","BLR1","Hydrogen Chloride",1.5625814098616898E-2,"lb/MMBtu",0.15834673990034054,"lb/MW","ERT","",220]
[{"$f":"VLOOKUP(B294&\"_\"&C294,HCl_Min_Tests!A:BV,6,FALSE)","v":"Sunnyside Cogen Associates"},50951,"1","Config 1","Hydrogen Chloride",1.6025989556035593E-2,"lb/MMBtu",0.18696987815374858,"lb/MW","ERT","",221]
[{"$f":"VLOOKUP(B295&\"_\"&C295,HCl_Min_Tests!A:BV,6,FALSE)","v":"Albright Power Station"},3942,"1","Unit_1","Hydrogen Chloride",2.030669069261706E-2,"lb/MMBtu",0.1970501096839137,"lb/MW","ERT","",222]
[{"$f":"VLOOKUP(B296&\"_\"&C296,HCl_Min_Tests!A:BV,6,FALSE)","v":"Foster Wheeler Mt Carmel Cogen"},10343,"SG-101","SG-101","Hydrogen Chloride",1.7333333333333336E-2,"lb/MMBtu",0.20356589147286824,"lb/MW","Part II","HCl 2008",223]
[{"$f":"VLOOKUP(B297&\"_\"&C297,HCl_Min_Tests!A:BV,6,FALSE)","v":"Marion Generating Station"},976,"123","123","Hydrogen Chloride",2.0798249596441193E-2,"lb/MMBtu",0.2166484332962624,"lb/MW","ERT","",224]
[{"$f":"VLOOKUP(B298&\"_\"&C298,HCl_Min_Tests!A:BV,6,FALSE)","v":"Northampton Generating Company, L.P."},50888,"BLR1","GEN1","Hydrogen Chloride",2.6313191992352616E-2,"lb/MMBtu",0.24921419853914131,"lb/MW","ERT","",225]
[{"$f":"VLOOKUP(B299&\"_\"&C299,HCl_Min_Tests!A:BV,6,FALSE)","v":"Albright Power Station"},3942,"2","Unit_2","Hydrogen Chloride",3.3133320173514856E-2,"lb/MMBtu",0.26302129471074137,"lb/MW","ERT","",226]
[{"$f":"VLOOKUP(B300&\"_\"&C300,HCl_Min_Tests!A:BV,6,FALSE)","v":"Clinch River"},3775,"1","CR-1","Hydrogen Chloride",2.909199357078331E-2,"lb/MMBtu",0.26573638822982026,"lb/MW","ERT","",227]
[{"$f":"VLOOKUP(B301&\"_\"&C301,HCl_Min_Tests!A:BV,6,FALSE)","v":"Cardinal"},2828,"3","CD-U3","Hydrogen Chloride",3.4471603630206758E-2,"lb/MMBtu",0.27975032176821635,"lb/MW","ERT","",228]
[{"$f":"VLOOKUP(B302&\"_\"&C302,HCl_Min_Tests!A:BV,6,FALSE)","v":"Colver Power Project"},10143,"AAB01","AAB01","Hydrogen Chloride",3.2026721913269246E-2,"lb/MMBtu",0.2943524670501998,"lb/MW","ERT","",229]
[{"$f":"VLOOKUP(B303&\"_\"&C303,HCl_Min_Tests!A:BV,6,FALSE)","v":"Colver Power Project"},10143,"AAB01","AAB01","Hydrogen Chloride",3.203333333333333E-2,"lb/MMBtu",0.29441323155216287,"lb/MW","ETTS","",229]
[{"$f":"VLOOKUP(B304&\"_\"&C304,HCl_Min_Tests!A:BV,6,FALSE)","v":"Piney Creek Project"},54144,"BRBR1","BRBRI","Hydrogen Chloride",2.6880262790104855E-2,"lb/MMBtu",0.3360032848763107,"lb/MW","ERT","",230]
[{"$f":"VLOOKUP(B305&\"_\"&C305,HCl_Min_Tests!A:BV,6,FALSE)","v":"Grant Town Power Plant"},10151,"BLR1A","GEN1","Hydrogen Chloride",2.4184274921024481E-2,"lb/MMBtu",0.34367127519350582,"lb/MW","ERT","",231]
[{"$f":"VLOOKUP(B306&\"_\"&C306,HCl_Min_Tests!A:BV,6,FALSE)","v":"Grant Town Power Plant"},10151,"BLR1B","GEN1","Hydrogen Chloride",2.4184274921024481E-2,"lb/MMBtu",0.34367127519350582,"lb/MW","ERT","",232]
[{"$f":"VLOOKUP(B307&\"_\"&C307,HCl_Min_Tests!A:BV,6,FALSE)","v":"Ebensburg Power Company"},10603,"031","EPC01","Hydrogen Chloride",2.4333333333333335E-2,"lb/MMBtu",0.34821839080459771,"lb/MW","Part II","2005 Emissions",233]
[{"$f":"VLOOKUP(B308&\"_\"&C308,HCl_Min_Tests!A:BV,6,FALSE)","v":"Sunbury Generation LP"},3152,"2B","Boiler 2B","Hydrogen Chloride",2.7666858638658545E-2,"lb/MMBtu",0.36312751963239343,"lb/MW","Part II","AG_111407U2",234]
[{"$f":"VLOOKUP(B309&\"_\"&C309,HCl_Min_Tests!A:BV,6,FALSE)","v":"Conesville"},2840,"3","CV-3","Hydrogen Chloride",3.5774037070178726E-2,"lb/MMBtu",0.40370458802831993,"lb/MW","ERT","",235]
[{"$f":"VLOOKUP(B310&\"_\"&C310,HCl_Min_Tests!A:BV,6,FALSE)","v":"Eastlake"},2837,"1","Unit 1","Hydrogen Chloride",4.8399057448207335E-2,"lb/MMBtu",0.40500600156312389,"lb/MW","ERT","",236]
[{"$f":"VLOOKUP(B311&\"_\"&C311,HCl_Min_Tests!A:BV,6,FALSE)","v":"Potomac River"},3788,"3","3","Hydrogen Chloride",4.5559999999999996E-2,"lb/MMBtu",0.40539962962962961,"lb/MW","Part II","C3 PM STK 1206",237]
[{"$f":"VLOOKUP(B312&\"_\"&C312,HCl_Min_Tests!A:BV,6,FALSE)","v":"Fair Station"},1218,"1","U1","Hydrogen Chloride",3.3000000000000002E-2,"lb/MMBtu",0.44448979591836735,"lb/MW","Part II","MACT06U1",238]
[{"$f":"VLOOKUP(B313&\"_\"&C313,HCl_Min_Tests!A:BV,6,FALSE)","v":"PSEG Mercer Generating Station"},2408,"E2","MERU2E2PT2OS1-Coal","Hydrogen Chloride",4.9983721238474776E-2,"lb/MMBtu",0.45174791789875157,"lb/MW","Part II","MER2 2009 1YR ST Co NG",239]
[{"$f":"VLOOKUP(B314&\"_\"&C314,HCl_Min_Tests!A:BV,6,FALSE)","v":"Cedar Bay Generating Company L.P."},10672,"CBA","CBA1","Hydrogen Chloride",4.0228333333333331E-2,"lb/MMBtu",0.46481215579710145,"lb/MW","ETTS","",240]
[{"$f":"VLOOKUP(B315&\"_\"&C315,HCl_Min_Tests!A:BV,6,FALSE)","v":"Cedar Bay Generating Company L.P."},10672,"CBA","CBA1","Hydrogen Chloride",4.2542538854693217E-2,"lb/MMBtu",0.49155129133194447,"lb/MW","ERT","",240]
[{"$f":"VLOOKUP(B316&\"_\"&C316,HCl_Min_Tests!A:BV,6,FALSE)","v":"Wateree"},3297,"WAT1","WAT001","Hydrogen Chloride",5.6000000000000001E-2,"lb/MMBtu",0.48684908616187983,"lb/MW","Part II","PM-HCL-HF-HG-07/06-WAT1",241]
[{"$f":"VLOOKUP(B317&\"_\"&C317,HCl_Min_Tests!A:BV,6,FALSE)","v":"Wateree"},3297,"WAT2","WAT002","Hydrogen Chloride",5.96E-2,"lb/MMBtu",0.51837884210526308,"lb/MW","Part II","PM-HCL-HF-HG-07/06-WAT2",242]
[{"$f":"VLOOKUP(B318&\"_\"&C318,HCl_Min_Tests!A:BV,6,FALSE)","v":"Eastlake"},2837,"3","Unit 3","Hydrogen Chloride",6.3697552661671486E-2,"lb/MMBtu",0.53302465942579258,"lb/MW","ERT","",243]
[{"$f":"VLOOKUP(B319&\"_\"&C319,HCl_Min_Tests!A:BV,6,FALSE)","v":"Sunbury Generation LP"},3152,"4","Boiler 4","Hydrogen Chloride",5.1666666666666666E-2,"lb/MMBtu",0.54895833333333333,"lb/MW","ETTS","",244]
[{"$f":"VLOOKUP(B320&\"_\"&C320,HCl_Min_Tests!A:BV,6,FALSE)","v":"Cedar Bay Generating Company L.P."},10672,"CBB","CBB1","Hydrogen Chloride",4.9246666666666661E-2,"lb/MMBtu",0.56901311594202897,"lb/MW","ETTS","",245]
[{"$f":"VLOOKUP(B321&\"_\"&C321,HCl_Min_Tests!A:BV,6,FALSE)","v":"Cedar Bay Generating Company L.P."},10672,"CBB","CBB1","Hydrogen Chloride",4.9879164880000194E-2,"lb/MMBtu",0.57632122029826316,"lb/MW","ERT","",245]
[{"$f":"VLOOKUP(B322&\"_\"&C322,HCl_Min_Tests!A:BV,6,FALSE)","v":"Cedar Bay Generating Company L.P."},10672,"CBC","CBC1","Hydrogen Chloride",4.9705537402576307E-2,"lb/MMBtu",0.57431506803194143,"lb/MW","ERT","",246]
[{"$f":"VLOOKUP(B323&\"_\"&C323,HCl_Min_Tests!A:BV,6,FALSE)","v":"Cedar Bay Generating Company L.P."},10672,"CBC","CBC1","Hydrogen Chloride",4.998466666666667E-2,"lb/MMBtu",0.57754022463768118,"lb/MW","ETTS","",246]
[{"$f":"VLOOKUP(B324&\"_\"&C324,HCl_Min_Tests!A:BV,6,FALSE)","v":"John E. Amos"},3935,"1","AM-1","Hydrogen Chloride",7.5845293187809096E-2,"lb/MMBtu",0.65225279698446637,"lb/MW","ERT","",247]
[{"$f":"VLOOKUP(B325&\"_\"&C325,HCl_Min_Tests!A:BV,6,FALSE)","v":"Crystal River Power Plant"},628,"1","CryR_Cfg_1","Hydrogen Chloride",7.4352427286473941E-2,"lb/MMBtu",0.71322565874550126,"lb/MW","ERT","",248]
[{"$f":"VLOOKUP(B326&\"_\"&C326,HCl_Min_Tests!A:BV,6,FALSE)","v":"PSEG Mercer Generating Station"},2408,"E1","MERU1E1PT1OS1-Coal","Hydrogen Chloride",8.1854206295234058E-2,"lb/MMBtu",0.73979020266829609,"lb/MW","Part II","MER1 2009 1YR ST Co NG",249]
[{"$f":"VLOOKUP(B327&\"_\"&C327,HCl_Min_Tests!A:BV,6,FALSE)","v":"Sunbury Generation LP"},3152,"3","Boiler 3","Hydrogen Chloride",6.7657276503554159E-2,"lb/MMBtu",0.79173408674371892,"lb/MW","Part II","AG_111407U3",250]
[{"$f":"VLOOKUP(B328&\"_\"&C328,HCl_Min_Tests!A:BV,6,FALSE)","v":"Shawville"},3131,"3","SHAW3-2","Hydrogen Chloride",8.9305681714558174E-2,"lb/MMBtu",0.8522042180633902,"lb/MW","ERT","",251]
[{"$f":"VLOOKUP(B329&\"_\"&C329,HCl_Min_Tests!A:BV,6,FALSE)","v":"Shawville"},3131,"4","SHAW4-2","Hydrogen Chloride",8.9305681714558174E-2,"lb/MMBtu",0.8522042180633902,"lb/MW","ERT","",252]
[{"$f":"VLOOKUP(B330&\"_\"&C330,HCl_Min_Tests!A:BV,6,FALSE)","v":"W.H. Weatherspoon Plant"},2716,"1","Wea_Cfg_1","Hydrogen Chloride",9.6485183704092689E-2,"lb/MMBtu",0.85926427751569334,"lb/MW","ERT","",253]
[{"$f":"VLOOKUP(B331&\"_\"&C331,HCl_Min_Tests!A:BV,6,FALSE)","v":"W.H. Weatherspoon Plant"},2716,"2","Wea_Cfg_1","Hydrogen Chloride",9.6485183704092689E-2,"lb/MMBtu",0.85926427751569334,"lb/MW","ERT","",254]
[{"$f":"VLOOKUP(B332&\"_\"&C332,HCl_Min_Tests!A:BV,6,FALSE)","v":"F. B. Culley"},1012,"3","Config3","Hydrogen Chloride",0.10233113943204951,"lb/MMBtu",0.95877503112467288,"lb/MW","ERT","",255]
[{"$f":"VLOOKUP(B333&\"_\"&C333,HCl_Min_Tests!A:BV,6,FALSE)","v":"Scrubgrass Generating Company L.P."},50974,"#1 CFB boiler","Gen 1","Hydrogen Chloride",7.6715503346688516E-2,"lb/MMBtu",0.98860184725114064,"lb/MW","ERT","",256]
[{"$f":"VLOOKUP(B334&\"_\"&C334,HCl_Min_Tests!A:BV,6,FALSE)","v":"Scrubgrass Generating Company L.P."},50974,"#2 CFB Boiler","Gen 1","Hydrogen Chloride",7.6715503346688516E-2,"lb/MMBtu",0.98860184725114064,"lb/MW","ERT","",257]
[{"$f":"VLOOKUP(B335&\"_\"&C335,HCl_Min_Tests!A:BV,6,FALSE)","v":"Titus"},3115,"2","TI-2","Hydrogen Chloride",9.5666666666666678E-2,"lb/MMBtu",0.99883990719257554,"lb/MW","Part II","T-57",258]
[{"$f":"VLOOKUP(B336&\"_\"&C336,HCl_Min_Tests!A:BV,6,FALSE)","v":"Deepwater"},2384,"8","Coal-firing","Hydrogen Chloride",0.10657381742616871,"lb/MMBtu",1.00448885390182,"lb/MW","Part II","Hydrated Lime EIPT",259]
[{"$f":"VLOOKUP(B337&\"_\"&C337,HCl_Min_Tests!A:BV,6,FALSE)","v":"F. B. Culley"},1012,"2","Config2","Hydrogen Chloride",0.10233113943204951,"lb/MMBtu",1.0550340475444304,"lb/MW","ERT","",260]
[{"$f":"VLOOKUP(B338&\"_\"&C338,HCl_Min_Tests!A:BV,6,FALSE)","v":"Scholz"},642,"1","Unit 1","Hydrogen Chloride",0.10834601350981614,"lb/MMBtu",1.2848753742129095,"lb/MW","ERT","",261]
[{"$f":"VLOOKUP(B339&\"_\"&C339,HCl_Min_Tests!A:BV,6,FALSE)","v":"Scholz"},642,"2","Unit 2","Hydrogen Chloride",0.10834601350981614,"lb/MMBtu",1.4256168457621607,"lb/MW","ERT","",262]
[{"$f":"VLOOKUP(B340&\"_\"&C340,HCl_Min_Tests!A:BV,6,FALSE)","v":"Riverbend"},2732,"7","7","Hydrogen Chloride",0.1438505690399815,"lb/MMBtu",1.5310326895813104,"lb/MW","ERT","",263]
[{"$f":"VLOOKUP(B341&\"_\"&C341,HCl_Min_Tests!A:BV,6,FALSE)","v":"Dale Station"},1385,"3","03","Hydrogen Chloride",0.14398901602472744,"lb/MMBtu",1.699070389091784,"lb/MW","ERT","",264]
[{"$f":"VLOOKUP(B342&\"_\"&C342,HCl_Min_Tests!A:BV,6,FALSE)","v":"Dale Station"},1385,"3","03","Hydrogen Chloride",0.14403333333333332,"lb/MMBtu",1.6995933333333333,"lb/MW","ETTS","",264]
[{"$f":"VLOOKUP(B343&\"_\"&C343,HCl_Min_Tests!A:BV,6,FALSE)","v":"Fair Station"},1218,"2","U2","Hydrogen Chloride",0.17784597101603083,"lb/MMBtu",1.8795085573285077,"lb/MW","ERT","",265]
[{"$f":"VLOOKUP(B344&\"_\"&C344,HCl_Min_Tests!A:BV,6,FALSE)","v":"R. Gallagher"},1008,"2","2-2007","Hydrogen Chloride",0.25699780151390705,"lb/MMBtu",2.5014452680686952,"lb/MW","Part II","U2091409-BAGOUT",266]
[{"$f":"VLOOKUP(B345&\"_\"&C345,HCl_Min_Tests!A:BV,6,FALSE)","v":"R. Gallagher"},1008,"2","2-2007","Hydrogen Chloride",0.25763567732404263,"lb/MMBtu",2.5076539259540147,"lb/MW","Part II","U2091409-BASE",266]

{"sheet":"Lognormal Template","index":2,"n_rows":172,"n_cols":13,"rows_kept":172,"cut":false,"hidden":false,"merged":[[116,0,116,2],[0,1,0,11],[37,0,37,3],[48,1,48,11],[86,0,86,1],[113,0,113,2],[127,0,127,3],[132,0,132,8],[133,0,133,4],[135,0,135,8],[137,0,137,2]]}
[null,"Emissions (lb/MW)"]
[{"$f":"'UPL Pooled Template '!A1","v":"HCl"},"10043\nLogan\nUnit1",null,null,null,null,null,null,null,null,null,null,"Outliers Removed"]
[1,{"$f":"'UPL Normal'!B5","v":1.1873905735104945E-4}]
[2,6.8352977996385912E-4]
[3,6.8889564052427492E-4]
[4,1.036568228739388E-3]
[5,1.6413267383897378E-3]
[6,3.610457437683194E-3]
[7]
[8]
[9]
[10]
[11]
[12]
[13]
[14]
[15]
[16]
[17]
[18]
[19]
[20]
[21]
[22]
[23]
[24]
[25]
[26]
[27]
[28]
[29]
[30]
[31]
[32]
[33]
[34]
[35]
["Use for small sample sets that are Lognormal."]
[]
["Testing Normality","Raw Data","Log Data"]
["Sample Size",{"$f":"COUNT(B3:L37)","v":6},{"$f":"COUNT(B51:L85)","v":6}]
["Kurtosis",{"$f":"KURT(B3:L37)","v":2.9308817166555912},{"$f":"KURT(B51:L85)","v":1.6814804051758845}]
["SE Kurtosis",{"$f":"SQRT((B41^2-1)/((B41-3)*(B41+5)))","v":1.0298573010888745},{"$f":"SQRT((C41^2-1)/((C41-3)*(C41+5)))","v":1.0298573010888745}]
["Result Kurtosis",{"$f":"IF(ABS(B42/B43)>NORMSINV(1-0.05/2),\"non normal\",\"normal\")","v":"non normal"},{"$f":"IF(ABS(C42/C43)>NORMSINV(1-0.05/2),\"non normal\",\"normal\")","v":"normal"}]
["Skewness",{"$f":"SKEW(B3:L37)","v":1.6290770934973764},{"$f":"SKEW(B51:L85)","v":-0.80853400452905178}]
["SE Skewness",{"$f":"SQRT((6*B41*(B41-1))/((B41-2)*(B41+1)*(B41+3)))","v":0.84515425472851657},{"$f":"SQRT((6*C41*(C41-1))/((C41-2)*(C41+1)*(C41+3)))","v":0.84515425472851657}]
["Result Skewness",{"$f":"IF(ABS(B45/B46)>NORMSINV(1-0.05/2),\"non normal\",\"normal\")","v":"normal"},{"$f":"IF(ABS(C45/C46)>NORMSINV(1-0.05/2),\"non normal\",\"normal\")","v":"normal"}]
[]
[null,"1. Take LN( ) of Raw Data"]
["Averages"]
[1,{"$f":"IF(B3>0,LN(B3),\"\")","v":-9.0385822679182102},{"$f":"IF(C3>0,LN(C3),\"\")","v":""},"","","","","","","","",""]
[2,{"$f":"IF(B4>0,LN(B4),\"\")","v":-7.2882403329412728},"","","","","","","","","",""]
[3,-7.2804207635542939,"","","","","","","","","",""]
[4,-6.8718398021676768,"","","","","","","","","",""]
[5,-6.4122503773764832,"","","","","","","","","",""]
[6,-5.6239208006252275,"","","","","","","","","",""]
[7,"","","","","","","","","","",""]
[8,"","","","","","","","","","",""]
[9,"","","","","","","","","","",""]
[10,"","","","","","","","","","",""]
[11,"","","","","","","","","","",""]
[12,"","","","","","","","","","",""]
[13,"","","","","","","","","","",""]
[14,"","","","","","","","","","",""]
[15,"","","","","","","","","","",""]
[16,"","","","","","","","","","",""]
[17,"","","","","","","","","","",""]
[18,{"$f":"IF(B20>0,LN(B20),\"\")","v":""},"","","","","","","","","",""]
[19,"","","","","","","","","","",""]
[20,"","","","","","","","","","",""]
[21,"","","","","","","","","","",""]
[22,"","","","","","","","","","",""]
[23,"","","","","","","","","","",""]
[24,"","","","","","","","","","",""]
[25,"","","","","","","","","","",""]
[26,"","","","","","","","","","",""]
[27,"","","","","","","","","","",""]
[28,"","","","","","","","","","",""]
[29,"","","","","","","","","","",""]
[30,"","","","","","","","","","",""]
[31,"","","","","","","","","","",""]
[32,"","","","","","","","","","",""]
[33,"","","","","","","","","","",""]
[34,{"$f":"IF(B36>0,LN(B36),\"\")","v":""},"","","","","","","","","",""]
[35,"","","","","","","","","","",""]
[]
["2. Calculate sample size, n=",null,{"$f":"COUNT(B51:L85)","v":6}]
[]
["Average of Raw Data",null,{"$f":"AVERAGE(B3:L37)","v":1.2965861471085837E-3}]
[]
[]
["3. Calculate ",null,null,{"$f":"AVERAGE(B51:L85)","v":-7.0858757240971935}]
[]
[]
[]
[]
[]
[]
[]
[]
[]
[null,null,null,null,{"$f":"VAR(B51:L85)","v":1.3057513470912341}]
["4. Calculate"]
[]
[]
[]
[]
["5. m",null,{"$f":"'UPL Normal'!C78","v":1}]
[]
["6. Calculate"]
[]
[]
[]
["a- Numerator first term",null,null,null,null,{"$f":"EXP(4*E102)+2*EXP(3*E102)+3*EXP(2*E102)-3","v":323.87379759344032}]
[]
[]
["b- denominator first term",null,null,null,null,{"$f":"C108*(EXP(E102)-1)^2","v":7.2385796894030978}]
[]
[]
[]
[null,null,{"$f":"F114/F117+3*(1-1/C108)","v":44.742727370615896}]
[]
[]
["7. Calculate"]
[null,null,null,null,null,{"$f":"SQRT(EXP(E102)-1)*(EXP(E102)+2)/SQRT(C108)","v":9.3338492254951362}]
[]
[]
["8. Go to tab distribution for 99 percentile \"lognormal distribution 99%\""]
[]
["9. substitue the values of ",null,null,null,"in cell D7 and F7 respectively"]
[]
[]
["10. In column AE indentify the value that is the smallest value that is larger than 0.99, note what row number this is.",null,null,null,null,null,null,null,null,{"$f":"VLOOKUP(\"x\",'lognormal distribution 99 %'!AF:AL,2,FALSE)","v":94},"is the Row number in Column AE with the first value > 0.99."]
[]
[]
["11. In column B, go down to the row number from Step 10. above, and copy the z value.",null,null,null,null,null,null,null,null,{"$f":"INDIRECT(\"'lognormal distribution 99 %'!B\" & J133)","v":3.5850000000000009},"z value from \"lognormal distribution 99%\""]
[]
["12. calculate the UPL using the formula "]
[]
[]
[]
[]
[]
[]
[]
["a- Calculate ",null,null,{"$f":"EXP(D92+E102/2)","v":1.6076206494936287E-3}]
[]
[]
["b- Calculate",null,null,{"$f":"EXP(2*D92+E102)","v":2.5844441526783165E-6}]
[]
[]
[]
["c- Calculate ",null,null,{"$f":"EXP(E102)-1","v":2.6904608693313303}]
[]
[]
[]
["d-calculate",null,null,null,{"$f":"(E102)/C87+(E102^2)/(2*(C87-1))","v":0.38812388255826291}]
[]
[]
[]
["e- Calculate",null,null,null,null,null,null,{"$f":"SQRT(C108*D149*D153+C108^2*D149*E157)","v":2.8207145124144847E-3}]
[]
[]
[]
["f- Calculate UPL",null,null,{"$f":"D146+(J136/C108)*H161","v":1.1719882176499559E-2},"lb/MW",{"$f":"D165*1000","v":11.719882176499558},"lb/GW"]
[]
[]
[]
[null,null,"3xRDL value used at promulgation",4.0000000000000002E-4,"lb/MWh"]
[]
[]
[null,null,"compare UPL to 3xRDL",{"$f":"IF(D169<D165,D165,D169)","v":1.1719882176499559E-2}]

{"sheet":"lognormal distribution 99 %","index":3,"n_rows":110,"n_cols":33,"rows_kept":110,"cut":false,"hidden":false,"merged":[]}
[]
[null,null,null,null,null,null,null,null,null,null,null,null,null,null,null,"distribution of Z"]
[null,null,null,null,null,null,null,null,null,null,null,null,null,"Normal "]
[null,null,null,null,null,null,null,null,null,null,null,null,null,"distribution"]
["∆z","z",null,null,null,null,null,null,null,null,null,null,null,null,null,null,null,null,null,null,null,"Absolute values"]
[null,null,null,null,null,null,null,null,null,null,null,null,null,null,null,null,null,null,null,null,null,null,null,null,null,null,null,null,null,"Cumulative","normalization"]
[0.10100000000000001,null,null,{"$f":"'Lognormal Template'!C121","v":44.742727370615896},null,{"$f":"'Lognormal Template'!F125","v":9.3338492254951362}]
[]
[null,-5,"=f(a)",null,null,null,{"$f":"(1-($F$7/6)*(3*B9-B9^3)+(($D$7-3)*(3-6*B9^2+B9^4))/24)","v":661.25541766402239},null,null,null,null,null,null,{"$f":"NORMDIST(B9,0,1,FALSE)","v":1.4867195147342977E-6},null,{"$f":"G9*N9","v":9.8310133366488078E-4},null,null,null,null,null,{"$f":"ABS(P9)","v":9.8310133366488078E-4},null,null,{"$f":"($A$7/2)*V9","v":4.9646617350076481E-5},null,null,null,null,{"$f":"Y9","v":4.9646617350076481E-5},{"$f":"AD9/SUM($Y$9:$Y$108)","v":9.0044462371378314E-6},{"$f":"IF(AE9>0.99,\"x\",\"\")","v":""},9]
[1,{"$f":"$B$9+A10*$A$7","v":-4.899},null,null,null,null,597.55723908341542,null,null,null,null,null,null,2.4509397556839956E-6,null,1.4645767935663092E-3,null,null,null,null,null,1.4645767935663092E-3,null,null,{"$f":"($A$7)*V10","v":1.4792225615019723E-4},null,null,null,null,{"$f":"Y10+AD9","v":1.975688735002737E-4},3.5833222775697514E-5,{"$f":"IF(AE10>0.99,\"x\",\"\")","v":""},10]
[2,-4.798,null,null,null,null,538.28991093426885,null,null,null,null,null,null,3.9995026854766194E-6,null,2.1528919443465785E-3,null,null,null,null,null,2.1528919443465785E-3,null,null,2.1744208637900444E-4,null,null,null,null,4.1501095987927811E-4,7.5270865882067357E-5,"",11]
[3,-4.6970000000000001,null,null,null,null,483.25452766943272,null,null,null,null,null,null,6.4602468217096111E-6,null,3.121943526453232E-3,null,null,null,null,null,3.121943526453232E-3,null,null,3.1531629617177645E-4,null,null,null,null,7.3032725605105451E-4,1.3246003179344474E-4,"",12]
[4,-4.5960000000000001,null,null,null,null,432.2565275067077,null,null,null,null,null,null,1.0329088331249594E-5,null,4.4648158543760036E-3,null,null,null,null,null,4.4648158543760036E-3,null,null,4.509464012919764E-4,null,null,null,null,1.181273657343031E-3,2.1424853709345643E-4,"",13]
[5,-4.4950000000000001,null,null,null,null,385.10569242884304,null,null,null,null,null,null,1.6347247339999862E-5,null,6.2954180061762094E-3,null,null,null,null,null,6.2954180061762094E-3,null,null,6.3583721862379722E-4,null,null,null,null,1.8171108759668282E-3,3.2957083609919959E-4,"",14]
[6,-4.3940000000000001,null,null,null,null,341.6161481835361,null,null,null,null,null,null,2.5609260510355175E-5,null,8.7485369333762733E-3,null,null,null,null,null,8.7485369333762733E-3,null,null,8.836022302710037E-4,null,null,null,null,2.7007131062378319E-3,4.8983047113913001E-4,"",15]
[7,-4.2930000000000001,null,null,null,null,301.6063642834348,null,null,null,null,null,null,3.97117663248513E-5,null,1.1977321460511741E-2,null,null,null,null,null,1.1977321460511741E-2,null,null,1.2097094675116858E-3,null,null,null,null,3.9104225737495177E-3,7.092364336029318E-4,"",16]
[8,-4.1920000000000002,null,null,null,null,264.89915400613495,null,null,null,null,null,null,6.0955252216615318E-5,null,1.6146994744411981E-2,null,null,null,null,null,1.6146994744411981E-2,null,null,1.6308464691856103E-3,null,null,null,null,5.5412690429351283E-3,1.0050243469920655E-3,"",17]
[9,-4.0910000000000002,null,null,null,null,231.32167439418151,null,null,null,null,null,null,9.2613185614433534E-5,null,2.1423437167309888E-2,null,null,null,null,null,2.1423437167309888E-2,null,null,2.1637671538982987E-3,null,null,null,null,7.7050361968334265E-3,1.3974685062703603E-3,"",18]
[10,-3.99,null,null,null,null,200.70542625506886,null,null,null,null,null,null,1.3928497646575994E-4,null,2.7955250572487583E-2,null,null,null,null,null,2.7955250572487583E-2,null,null,2.8234803078212461E-3,null,null,null,null,1.0528516504654672E-2,1.909565361814832E-3,"",19]
[11,-3.8890000000000002,null,null,null,null,172.88625416124032,null,null,null,null,null,null,2.0735069214939127E-4,null,3.5848084463448754E-2,null,null,null,null,null,3.5848084463448754E-2,null,null,3.6206565308083243E-3,null,null,null,null,1.4149173035462996E-2,2.566246699133684E-3,"",20]
[12,-3.7879999999999998,null,null,null,null,147.70434645008783,null,null,null,null,null,null,3.0554590364653618E-4,null,4.5130458008613136E-2,null,null,null,null,null,4.5130458008613136E-2,null,null,4.558176258869927E-3,null,null,null,null,1.8707349294332924E-2,3.3929667306914651E-3,"",21]
[13,-3.6869999999999998,null,null,null,null,125.004235223953,null,null,null,null,null,null,4.4567390271459394E-4,null,5.5711125368112249E-2,null,null,null,null,null,5.5711125368112249E-2,null,null,5.6268236621793378E-3,null,null,null,null,2.4334172956512263E-2,4.4135081866114381E-3,"",22]
[14,-3.5859999999999999,null,null,null,null,104.63479635012578,null,null,null,null,null,null,6.4346911127639178E-4,null,6.732925941600168E-2,null,null,null,null,null,6.732925941600168E-2,null,null,6.8002552010161697E-3,null,null,null,null,3.1134428157528433E-2,5.646875848391777E-3,"",23]
[15,-3.4849999999999999,null,null,null,null,86.449249460845635,null,null,null,null,null,null,9.196190652258089E-4,null,7.9500377978655626E-2,null,null,null,null,null,7.9500377978655626E-2,null,null,8.0295381758442187E-3,null,null,null,null,3.916396633337265E-2,7.1031995351318097E-3,"",24]
[16,-3.3839999999999999,null,null,null,null,70.30515795330075,null,null,null,null,null,null,1.3009421669529307E-3,null,9.1462944535735141E-2,null,null,null,null,null,9.1462944535735141E-2,null,null,9.2377573981092496E-3,null,null,null,null,4.8401723731481897E-2,8.7786588973771378E-3,"",25]
[17,-3.2829999999999999,null,null,null,null,56.064428989628496,null,null,null,null,null,null,1.8217038523946315E-3,null,0.10213278627271148,null,null,null,null,null,0.10213278627271148,null,null,1.0315411413543861E-2,null,null,null,null,5.8717135145025759E-2,1.0649573220346023E-2,"",26]
[18,-3.1819999999999999,null,null,null,null,43.593313496915194,null,null,null,null,null,null,2.5250345499379808E-3,null,0.11007462272598856,null,null,null,null,null,0.11007462272598856,null,null,1.1117536895324845E-2,null,null,null,null,6.9834672040350598E-2,1.2665969676069396E-2,"",27]
[19,-3.081,null,null,null,null,32.762406167196247,null,null,null,null,null,null,3.4643888734137819E-3,null,0.11350171539189774,null,null,null,null,null,0.11350171539189774,null,null,1.1463673254581672E-2,null,null,null,null,8.1298345294932267E-2,1.4745145156910821E-2,"",28]
[20,-2.98,null,null,null,null,23.446645457455976,null,null,null,null,null,null,4.7049575269339792E-3,null,0.11031547102640989,null,null,null,null,null,0.11031547102640989,null,null,1.1141862573667399E-2,null,null,null,null,9.2440207868599661E-2,1.6765953580145956E-2,"",29]
[21,-2.879,null,null,null,null,15.525313589627814,null,null,null,null,null,null,6.3249127862128329E-3,null,9.8196254433000812E-2,null,null,null,null,null,9.8196254433000812E-2,null,null,9.9178216977330834E-3,null,null,null,null,0.10235802956633275,1.8564756742041923E-2,"",30]
[22,-2.778,null,null,null,null,8.8820365505942149,null,null,null,null,null,null,8.416337402369389E-3,null,7.4754216429978079E-2,null,null,null,null,null,7.4754216429978079E-2,null,null,7.5501758594277869E-3,null,null,null,null,0.10990820542576053,1.9934138106491493E-2,"",31]
[23,-2.677,null,null,null,null,3.4047840921865671,null,null,null,null,null,null,1.1085658498589472E-2,null,3.7744273707410257E-2,null,null,null,null,null,3.7744273707410257E-2,null,null,3.8121716444484361E-3,null,null,null,null,0.11372037707020898,2.0625554691374379E-2,"",32]
[24,-2.5759999999999996,null,null,null,null,-1.0141302688146521,null,null,null,null,null,null,1.4453386482878732E-2,null,-1.4657616719163867E-2,null,null,null,null,null,1.4657616719163867E-2,null,null,1.4804192886355508E-3,null,null,null,null,0.11520079635884453,2.0894059508106272E-2,"",33]
[25,-2.4749999999999996,null,null,null,null,-4.4780492506799554,null,null,null,null,null,null,1.8652948792269922E-2,null,-8.35288233621959E-2,null,null,null,null,null,8.35288233621959E-2,null,null,8.4364111595817866E-3,null,null,null,null,0.12363720751842631,2.2424178069562036E-2,"",34]
[26,-2.3739999999999997,null,null,null,null,-7.0859718067308295,null,null,null,null,null,null,2.3828414277471986E-2,null,-0.16884747176926887,null,null,null,null,null,0.16884747176926887,null,null,1.7053594648696158E-2,null,null,null,null,0.14069080216712249,2.551720201279126E-2,"",35]
[27,-2.2729999999999997,null,null,null,null,-8.9325531253397745,null,null,null,null,null,null,3.0130930809477742E-2,null,-0.26914614017159688,null,null,null,null,null,0.26914614017159688,null,null,2.7183760157331288E-2,null,null,null,null,0.16787456232445377,3.0447542082769098E-2,"",36]
[28,-2.1719999999999997,null,null,null,null,-10.108104629930233,null,null,null,null,null,null,3.7713749861696219E-2,null,-0.38121452958904223,null,null,null,null,null,0.38121452958904223,null,null,3.8502667488493264E-2,null,null,null,null,0.20637722981294704,3.7430801323612387E-2,"",37]
[29,-2.0709999999999997,null,null,null,null,-10.698593978976653,null,null,null,null,null,null,4.6725789305731173E-2,null,-0.49990024812922723,null,null,null,null,null,0.49990024812922723,null,null,5.0489925061051953E-2,null,null,null,null,0.25686715487399897,4.6588198946970506E-2,"",38]
[30,-1.9699999999999998,null,null,null,null,-10.785645066004456,null,null,null,null,null,null,5.7303788919117152E-2,null,-0.61805832821883677,null,null,null,null,null,0.61805832821883677,null,null,6.2423891150102516E-2,null,null,null,null,0.31929104602410147,5.7910069434349759E-2,"",39]
[31,-1.8689999999999998,null,null,null,null,-10.446538019590031,null,null,null,null,null,null,6.9563238531014968E-2,null,-0.72669501608005804,null,null,null,null,null,0.72669501608005804,null,null,7.3396196624085863E-2,null,null,null,null,0.39268724264818733,7.1221995639750346E-2,"",40]
[32,-1.7679999999999998,null,null,null,null,-9.7542092033607606,null,null,null,null,null,null,8.3588399272377337E-2,null,-0.81533873347681696,null,null,null,null,null,0.81533873347681696,null,null,8.2349212081158515E-2,null,null,null,null,0.47503645472934586,8.6157737336446438E-2,"",41]
[33,-1.6669999999999998,null,null,null,null,-8.7772512159950082,null,null,null,null,null,null,9.9421883540771347E-2,null,-0.87265084820474936,null,null,null,null,null,0.87265084820474936,null,null,8.813773566867969E-2,null,null,null,null,0.56317419039802552,0.10214334813235434,"",42]
[34,-1.5659999999999998,null,null,null,null,-7.5799128912221061,null,null,null,null,null,null,0.11705439552546529,null,-0.88726212161768558,null,null,null,null,null,0.88726212161768558,null,null,8.9613474283386244E-2,null,null,null,null,0.65278766468141181,0.11839661480746333,"",43]
[35,-1.4649999999999999,null,null,null,null,-6.2220992978223775,null,null,null,null,null,null,0.13641534591340351,null,-0.8487898280199847,null,null,null,null,null,0.8487898280199847,null,null,8.5727772630018462E-2,null,null,null,null,0.73851543731143021,0.13394512870184222,"",44]
[36,-1.3639999999999999,null,null,null,null,-4.7593717396271238,null,null,null,null,null,null,0.15736512556566029,null,-0.74895913142007742,null,null,null,null,null,0.74895913142007742,null,null,7.5644872273427824E-2,null,null,null,null,0.81416030958485808,0.14766489898746452,"",45]
[37,-1.2629999999999999,null,null,null,null,-3.2429477555186166,null,null,null,null,null,null,0.17968983860954071,null,-0.58272475880831254,null,null,null,null,null,0.58272475880831254,null,null,5.8855200639639567E-2,null,null,null,null,0.87301551022449764,0.15833951325571693,"",46]
[38,-1.1619999999999999,null,null,null,null,-1.7197011194301211,null,null,null,null,null,null,0.20309924389892503,null,-0.34926999708839257,null,null,null,null,null,0.34926999708839257,null,null,3.5276269705927649E-2,null,null,null,null,0.90829177993042531,0.16473759818009318,"",47]
[39,-1.0609999999999999,null,null,null,null,-0.23216184034587251,null,null,null,null,null,null,0.22722852877998642,null,-5.2753793420646705E-2,null,null,null,null,null,5.2753793420646705E-2,null,null,5.3281331354853179E-3,null,null,null,null,0.91361991306591062,0.16570396589905553,"",48]
[40,-0.96,null,null,null,null,1.1814838376989072,null,null,null,null,null,null,0.25164434109811712,null,0.29731372185581623,null,null,null,null,null,0.29731372185581623,null,null,3.0028685907437441E-2,null,null,null,null,0.94364859897334807,0.17115029240139884,"",49]
[41,-0.85899999999999999,null,null,null,null,2.4873934356180225,null,null,null,null,null,null,0.27585524287120494,null,0.68616052029865049,null,null,null,null,null,0.68616052029865049,null,null,6.9302212550163708E-2,null,null,null,null,1.0129508115235117,0.1837196894787948,"",50]
[42,-0.75800000000000001,null,null,null,null,3.6560682392742936,null,null,null,null,null,null,0.29932643861165642,null,1.0943578853831637,null,null,null,null,null,1.0943578853831637,null,null,0.11053014642369954,null,null,null,null,1.1234809579472114,0.20376662951576074,"",51]
[43,-0.65700000000000003,null,null,null,null,4.6623532994795571,null,null,null,null,null,null,0.32149829672959446,null,1.4989386445342825,null,null,null,null,null,1.4989386445342825,null,null,0.15139280309796255,null,null,null,null,1.2748737610451739,0.23122486189789296,"",52]
[44,-0.55600000000000005,null,null,null,null,5.4854374319946766,null,null,null,null,null,null,0.34180785297801497,null,1.8749655912753365,null,null,null,null,null,1.8749655912753365,null,null,0.189371524718809,null,null,null,null,1.4642452857639829,0.26557132504464565,"",53]
[45,-0.45500000000000007,null,null,null,null,6.1088532175295329,null,null,null,null,null,null,0.35971219226542389,null,2.1974289831052367,null,null,null,null,null,2.1974289831052367,null,null,0.22194032729362892,null,null,null,null,1.6861856130576118,0.3058248176618053,"",54]
[46,-0.35400000000000009,null,null,null,null,6.5204770017430276,null,null,null,null,null,null,0.37471238028421117,null,2.4433034579115862,null,null,null,null,null,2.4433034579115862,null,null,0.24677364924907022,null,null,null,null,1.932959262306682,0.35058234951411665,"",55]
[47,-0.25300000000000011,null,null,null,null,6.7125288952430804,null,null,null,null,null,null,0.38637648574037453,null,2.5935633249747401,null,null,null,null,null,2.5935633249747401,null,null,0.26194989582244876,null,null,null,null,2.1949091581291307,0.39809240920509098,"",56]
[48,-0.15199999999999925,null,null,null,null,6.6815727735866304,null,null,null,null,null,null,0.39436021613719047,null,2.6349464831279907,null,null,null,null,null,2.6349464831279907,null,null,0.26612959479592707,null,null,null,null,2.4610387529250577,0.44636054420316473,"",57]
[49,-5.0999999999999268E-2,null,null,null,null,6.4285162772796376,null,null,null,null,null,null,0.39842379318515947,null,2.5612738397462937,null,null,null,null,null,2.5612738397462937,null,null,0.25868865781437567,null,null,null,null,2.7197274107394334,0.4932791105784286,"",58]
[50,5.0000000000000711E-2,null,null,null,null,5.9586108117770866,null,null,null,null,null,null,0.39844391409476398,null,2.3741722144118413,null,null,null,null,null,2.3741722144118413,null,null,0.23979139365559599,null,null,null,null,2.9595188043950293,0.53677026521389826,"",59]
[51,0.15100000000000069,null,null,null,null,5.2814515474829751,null,null,null,null,null,null,0.39441996623589087,null,2.0831099410347287,null,null,null,null,null,2.0831099410347287,null,null,0.21039410404450762,null,null,null,null,3.169912908439537,0.57492961019244659,"",60]
[52,0.25200000000000067,null,null,null,null,4.410977419750326,null,null,null,null,null,null,0.38647405812101859,null,1.7047283436910881,null,null,null,null,null,1.7047283436910881,null,null,0.17217756271279991,null,null,null,null,3.3420904711523369,0.60615759085740617,"",61]
[53,0.35300000000000065,null,null,null,null,3.3654711288811772,null,null,null,null,null,null,0.37484486452585164,null,1.2615295693711299,null,null,null,null,null,1.2615295693711299,null,null,0.12741448650648413,null,null,null,null,3.4695049576588213,0.62926685700317697,"",62]
[54,0.45400000000000063,null,null,null,null,2.1675591401265901,null,null,null,null,null,null,0.3598757186153565,null,0.78005190319434081,null,null,null,null,null,0.78005190319434081,null,null,7.8785242222628421E-2,null,null,null,null,3.5482901998814498,0.64355619866911928,"",63]
[55,0.5550000000000006,null,null,null,null,0.84421168368664601,null,null,null,null,null,null,0.3419977799876871,null,0.28871852166050044,null,null,null,null,null,0.28871852166050044,null,null,2.9160570687710545E-2,null,null,null,null,3.5774507705691603,0.6488450744277684,"",64]
[56,0.65600000000000058,null,null,null,null,-0.57325724528955591,null,null,null,null,null,null,0.3217094296581981,null,-0.1844222614295328,null,null,null,null,null,0.1844222614295328,null,null,1.8626648404382815E-2,null,null,null,null,3.5960774189735432,0.65222340437425119,"",65]
[57,0.75700000000000056,null,null,null,null,-2.0491898867038945,null,null,null,null,null,null,0.29955326428828344,null,-0.61384151970868928,null,null,null,null,null,0.61384151970868928,null,null,6.1997993490577621E-2,null,null,null,null,3.6580754124641208,0.66346802946642713,"",66]
[58,0.85800000000000054,null,null,null,null,-3.5435847155092302,null,null,null,null,null,null,0.27609216628203237,null,-0.97835598050884276,null,null,null,null,null,0.97835598050884276,null,null,9.881395403139312E-2,null,null,null,null,3.7568893664955141,0.68138999442691239,"",67]
[59,0.95900000000000052,null,null,null,null,-5.0120964417094012,null,null,null,null,null,null,0.25188590971741259,null,-1.2624764718113792,null,null,null,null,null,1.2624764718113792,null,null,0.12751012365294931,null,null,null,null,3.8843994901484633,0.70451660635754387,"",68]
[60,1.0600000000000005,null,null,null,null,-6.4060360103592293,null,null,null,null,null,null,0.22746963245738577,null,-1.4571786567851919,null,null,null,null,null,1.4571786567851919,null,null,0.1471750443353044,null,null,null,null,4.0315745344837675,0.73120986049852477,"",69]
[61,1.1610000000000005,null,null,null,null,-7.6723706015645128,null,null,null,null,null,null,0.20333528072256271,null,-1.5600636300766575,null,null,null,null,null,1.5600636300766575,null,null,0.15756642663774242,null,null,null,null,4.1891409611215096,0.75978780786265243,"",70]
[62,1.2620000000000005,null,null,null,null,-8.7537236304820336,null,null,null,null,null,null,0.17991684029544777,null,-1.5749422964159232,null,null,null,null,null,1.5749422964159232,null,null,0.15906917193800826,null,null,null,null,4.348210133059518,0.78863830932989132,"",71]
[63,1.3630000000000004,null,null,null,null,-9.5883747473195502,null,null,null,null,null,null,0.15757983926216645,null,-1.5109345514680306,null,null,null,null,null,1.5109345514680306,null,null,0.15260438969827109,null,null,null,null,4.5008145227577891,0.81631628813154677,"",72]
[64,1.4640000000000004,null,null,null,null,{"$f":"(1-($F$7/6)*(3*B73-B73^3)+(($D$7-3)*(3-6*B73^2+B73^4))/24)","v":-10.110259837335802},null,null,null,null,null,null,{"$f":"NORMDIST(B73,0,1,FALSE)","v":0.1366152725480389},null,{"$f":"G73*N73","v":-1.381215903209122},null,null,null,null,null,{"$f":"ABS(P73)","v":1.381215903209122},null,null,0.13950280622412134,null,null,null,null,4.6403173289819106,{"$f":"AD73/SUM($Y$9:$Y$108)","v":0.84161802238098038},"",73]
[65,{"$f":"$B$9+A74*$A$7","v":1.5650000000000004},null,null,null,null,-10.248971020840509,null,null,null,null,null,null,0.11723778769442594,null,-1.2015666886276235,null,null,null,null,null,1.2015666886276235,null,null,{"$f":"($A$7)*V74","v":0.12135823555138998},null,null,null,null,{"$f":"Y74+AD73","v":4.7616755645333004},0.86362886150322959,{"$f":"IF(AE74>0.99,\"x\",\"\")","v":""},74]
[66,1.6660000000000004,null,null,null,null,-9.9297566531943708,null,null,null,null,null,null,9.9587708244748885E-2,null,-0.98888170851967516,null,null,null,null,null,0.98888170851967516,null,null,9.9877052560487192E-2,null,null,null,null,4.8615526170937873,0.88174364148437379,"",75]
[67,1.7670000000000003,null,null,null,null,-9.0735213248090698,null,null,null,null,null,null,8.3736272412481758E-2,null,-0.75978285339467466,null,null,null,null,null,0.75978285339467466,null,null,7.6738068192862149E-2,null,null,null,null,4.9382906852866491,0.89566168557813475,"",76]
[68,1.8680000000000003,null,null,null,null,-7.5968258611472663,null,null,null,null,null,null,6.9693338950675629E-2,null,-0.52944815969019465,null,null,null,null,null,0.52944815969019465,null,null,5.3474264128709662E-2,null,null,null,null,4.9917649494153586,0.90536035513747648,"",77]
[69,1.9690000000000003,null,null,null,null,-5.4118873227225972,null,null,null,null,null,null,5.7416759943091943E-2,null,-0.31073303524782592,null,null,null,null,null,0.31073303524782592,null,null,3.1384036560030422E-2,null,null,null,null,5.0231489859753893,0.91105250265915916,"",78]
[70,2.0700000000000003,null,null,null,null,-2.4265790050996916,null,null,null,null,null,null,4.6822635277683121E-2,null,-0.11361882372826602,null,null,null,null,null,0.11361882372826602,null,null,1.1475501196554869E-2,null,null,null,null,5.0346244871719446,0.91313382338318694,"",79]
[71,2.1710000000000003,null,null,null,null,1.4555695611058646,null,null,null,null,null,null,3.7795734251856623E-2,null,5.5014320316648838E-2,null,null,null,null,null,5.5014320316648838E-2,null,null,5.5564463519815329E-3,null,null,null,null,5.040180933523926,0.91414160045071924,"",80]
[72,2.2720000000000002,null,null,null,null,6.3353726102274894,null,null,null,null,null,null,3.0199481210634573E-2,null,0.19132496610493396,null,null,null,null,null,0.19132496610493396,null,null,1.9323821576598333E-2,null,null,null,null,5.0595047551005248,0.91764637724660014,"",81]
[73,2.3730000000000002,null,null,null,null,12.317988141547621,null,null,null,null,null,null,2.3885038190605869E-2,null,0.29421561719229516,null,null,null,null,null,0.29421561719229516,null,null,2.9715777336421813E-2,null,null,null,null,5.0892205324369462,0.92303595127404703,"",82]
[74,2.4740000000000002,null,null,null,null,19.51291791929771,null,null,null,null,null,null,1.8699162668593644E-2,null,0.3648752263118637,null,null,null,null,null,0.3648752263118637,null,null,3.6852397857498234E-2,null,null,null,null,5.1260729302944448,0.92971989980728875,"",83]
[75,2.5750000000000002,null,null,null,null,28.034007472658239,null,null,null,null,null,null,1.4490659157048438E-2,null,0.40623124709243946,null,null,null,null,null,0.40623124709243946,null,null,4.1029355956336389E-2,null,null,null,null,5.1671022862507812,0.93716142653302958,"",84]
[76,2.6760000000000002,null,null,null,null,37.999446095758707,null,null,null,null,null,null,1.1115369005911058E-2,null,0.42237786537458427,null,null,null,null,null,0.42237786537458427,null,null,4.2660164402833017E-2,null,null,null,null,5.2097624506536144,0.94489873427595439,"",85]
[77,2.7770000000000001,null,null,null,null,49.53176684767763,null,null,null,null,null,null,8.4397462735252959E-3,null,0.4180355446738111,null,null,null,null,null,0.4180355446738111,null,null,4.2221590012054923E-2,null,null,null,null,5.2519840406656693,0.95255649743490689,"",86]
[78,2.8780000000000001,null,null,null,null,62.757846552442572,null,null,null,null,null,null,6.3431452761899725E-3,null,0.39808213790298125,null,null,null,null,null,0.39808213790298125,null,null,4.0206295928201109E-2,null,null,null,null,5.2921903365938707,0.95984874511267104,"",87]
[79,2.9790000000000001,null,null,null,null,77.808905799030057,null,null,null,null,null,null,4.7189968525847836E-3,null,0.36717998156868875,null,null,null,null,null,0.36717998156868875,null,null,3.7085178138437563E-2,null,null,null,null,5.3292755147323083,0.96657491318949218,"",88]
[80,3.08,null,null,null,null,94.820508941365659,null,null,null,null,null,null,3.4750773778549375E-3,null,0.3295086055788316,null,null,null,null,null,0.3295086055788316,null,null,3.3280369163461991E-2,null,null,null,null,5.3625558838957703,0.97261100005461343,"",89]
[81,3.1810000000000009,null,null,null,null,113.93256409832426,null,null,null,null,null,null,2.5330807400485967E-3,null,0.2886003837818174,null,null,null,null,null,0.2886003837818174,null,null,2.9148638761963559E-2,null,null,null,null,5.3917045226577338,0.97789771171045692,"",90]
[82,3.282,null,null,null,null,135.28932315372879,null,null,null,null,null,null,1.8276934202903908E-3,null,0.24726740576361053,null,null,null,null,null,0.24726740576361053,null,null,2.4974007982124666E-2,null,null,null,null,5.4166785306398584,0.9824272672814881,"",91]
[83,3.3830000000000009,null,null,null,null,159.03938175635273,null,null,null,null,null,null,1.305351359820449E-3,null,0.20760227324065852,null,null,null,null,null,0.20760227324065852,null,null,2.0967829597306514E-2,null,null,null,null,5.4376463602371645,0.98623021911176256,"",92]
[84,3.484,null,null,null,null,185.33567931991695,null,null,null,null,null,null,9.2282906723667468E-4,null,0.17103315207247441,null,null,null,null,null,0.17103315207247441,null,null,1.7274348359319916E-2,null,null,null,null,5.4549207085964841,0.9893632813300054,"",93]
[85,3.5850000000000009,null,null,null,null,214.33549902309286,null,null,null,null,null,null,6.4578041088110192E-4,null,0.13841366662553892,null,null,null,null,null,0.13841366662553892,null,null,1.3979780329179431E-2,null,null,null,null,5.4689004889256632,0.99189880514008621,"x",94]
[86,3.6859999999999999,null,null,null,null,246.2004678094994,null,null,null,null,null,null,4.4731991169886799E-4,null,0.11013037152076527,null,null,null,null,null,0.11013037152076527,null,null,1.1123167523597292E-2,null,null,null,null,5.4800236564492604,0.99391622282731062,"x",95]
[87,3.7870000000000008,null,null,null,null,281.09655638770619,null,null,null,null,null,null,3.0670535307791695E-4,null,8.621381857587801E-2,null,null,null,null,null,8.621381857587801E-2,null,null,8.7075956761636791E-3,null,null,null,null,5.4887312521254241,0.99549552633892502,"x",96]
[88,3.8879999999999999,null,null,null,null,319.19407923122992,null,null,null,null,null,null,2.0815854496572918E-4,null,6.6442975094448492E-2,null,null,null,null,null,6.6442975094448492E-2,null,null,6.7107404845392982E-3,null,null,null,null,5.4954419926099636,0.99671265864581171,"x",97]
[89,3.9890000000000008,null,null,null,null,360.66769457853854,null,null,null,null,null,null,1.3984176379239904E-4,null,5.0436406552801107E-2,null,null,null,null,null,5.0436406552801107E-2,null,null,5.0940770618329119E-3,null,null,null,null,5.5005360696717966,0.99763657542966167,"x",98]
[90,4.09,null,null,null,null,405.6964044330465,null,null,null,null,null,null,9.2992795718445907E-5,null,3.7726842861150307E-2,null,null,null,null,null,3.7726842861150307E-2,null,null,3.8104111289761814E-3,null,null,null,null,5.5043464808007725,0.99832767270846157,"x",99]
[91,4.1910000000000007,null,null,null,null,454.46355456312006,null,null,null,null,null,null,6.1211282356604617E-5,null,2.7818296959149329E-2,null,null,null,null,null,2.7818296959149329E-2,null,null,2.8096479928740822E-3,null,null,null,null,5.5071561287936461,0.99883726078610879,"x",100]
[92,4.2919999999999998,null,null,null,null,507.15683450207132,null,null,null,null,null,null,3.988259546153366E-5,null,2.0226730865998088E-2,null,null,null,null,null,2.0226730865998088E-2,null,null,2.0428998174658068E-3,null,null,null,null,5.5091990286111123,0.9992077831410261,"x",101]
[93,4.3930000000000007,null,null,null,null,563.96827754816513,null,null,null,null,null,null,2.5722022324537423E-5,null,1.4506404625424822E-2,null,null,null,null,null,1.4506404625424822E-2,null,null,1.465146867167907E-3,null,null,null,null,5.5106641754782801,0.99947351798660278,"x",102]
[94,4.4939999999999998,null,null,null,null,625.09426076461136,null,null,null,null,null,null,1.6420885402344505E-5,null,1.0264601221678936E-2,null,null,null,null,null,1.0264601221678936E-2,null,null,1.0367247233895726E-3,null,null,null,null,5.5117009002016699,0.99966154956927133,"x",103]
[95,4.5950000000000006,null,null,null,null,690.73550497957262,null,null,null,null,null,null,1.0376664891989014E-5,null,7.167530864171834E-3,null,null,null,null,null,7.167530864171834E-3,null,null,7.2392061728135523E-4,null,null,null,null,5.5124248208189517,0.9997928476239264,"x",104]
[96,4.6960000000000015,null,null,null,null,761.09707478615837,null,null,null,null,null,null,6.4906587297709424E-6,null,4.9400213726639068E-3,null,null,null,null,null,4.9400213726639068E-3,null,null,4.9894215863905463E-4,null,null,null,null,5.5129237629775911,{"$f":"AD105/SUM($Y$9:$Y$108)","v":0.99988334115767974},"x",105]
[97,{"$f":"$B$9+A106*$A$7","v":4.7970000000000006},null,null,null,null,836.38837854242558,null,null,null,null,null,null,4.0187363995916616E-6,null,3.361224421043895E-3,null,null,null,null,null,3.361224421043895E-3,null,null,3.3948366652543339E-4,null,null,null,null,5.5132632466441169,{"$f":"AD106/SUM($Y$9:$Y$108)","v":0.99994491357865789},"x",106]
[98,{"$f":"$B$9+A107*$A$7","v":4.8980000000000015},null,null,null,null,916.82316837138569,null,null,null,null,null,null,2.4629751376704828E-6,null,2.2581126693390018E-3,null,null,null,null,null,2.2581126693390018E-3,null,null,2.2806937960323921E-4,null,null,null,null,5.5134913160237202,{"$f":"AD107/SUM($Y$9:$Y$108)","v":0.99998627870233781},"x",107]
[99,{"$f":"$B$9+A108*$A$7","v":4.9990000000000006},null,null,null,null,1002.6195401609917,null,null,null,null,null,null,1.4941709802283004E-6,null,1.4980850211183969E-3,null,null,null,null,null,1.4980850211183969E-3,null,null,{"$f":"($A$7/2)*V108","v":7.5653293566479044E-5},null,null,null,null,5.5135669693172868,{"$f":"AD108/SUM($Y$9:$Y$108)","v":1},"x",108]
[]
[null,null,null,null,null,null,null,null,null,null,null,null,null,null,null,null,null,null,null,null,null,null,null,null,null,null,null,null,null,{"$f":"SUM($AD$9:$AD$108)","v":267.76868624143674}]

{"sheet":"HCl_QA_Calcs","index":4,"n_rows":207,"n_cols":101,"rows_kept":207,"cut":false,"hidden":false,"merged":[[8,6,8,18],[8,20,8,26],[8,28,8,36],[8,37,8,44],[8,0,8,4]]}
[null,null,null,null,null,null,null,null,"Anthracite",null,null,null,null,"fPM","30B",null,"μg/dscm","No",null,"μg/dscm",{"$f":"1/453592370","v":2.2046226218487758E-9},"lbs/μg",2.8316846592000001E-2,null,null,null,"cm/cf",null,null,null,null,null,"lb/hr",null,null,"lb/MMBtu",null,null,null,null,null,null,"Round to",null,null,null,"From ",null,"original database export===>"]
[null,null,null,null,null,null,null,null,"Bituminous",null,null,null,null,"Se","M5",null,"lb/dscf","Yes",null,"ppm",{"$f":"U1/1000","v":2.2046226218487757E-12},"lb/mg",null,null,null,null,null,null,null,null,null,null,"lb/MMBtu",null,null,null,null,null,null,null,null,null,"Same ",null,null,null,"Min ",null,"original database export===>"]
[null,null,null,null,null,null,null,null,"Lignite",null,null,null,null,"Pb","M5B",null,"ppmvd",null,null,null,null,"lb/scf",null,null,null,null,null,null,null,null,null,null,null,null,null,null,null,null,null,null,null,null,"Sig Figs ",null,null,null,"Test",null,"original database export===>"]
[null,null,null,null,null,null,null,null,"Oil",null,null,null,null,"Hg","M29",null,"ppmvd @ 3% O2",null,null,null,null,"(lb/dscf)/ppmvd",null,null,null,null,null,null,null,null,null,null,null,null,null,null,null,null,null,null,null,null,"as Submitted",null,null,null,"Sheet",null,"original database export===>"]
[null,null,null,null,null,null,null,null,"Pet Coke",null,null,null,null,"HCl","OTM27",null,"ppmvd @ 7% O2",null,null,null,null,null,null,null,null,null,null,null,null,null,null,null,null,null,null,null,null,null,null,null,null,null,"prior to ",null,null,null,null,null,"original database export===>"]
[null,null,null,null,null,null,null,null,"Subbituminous",null,null,null,null,"SO2","26A",null,null,null,null,null,null,null,null,null,null,null,null,null,null,null,null,null,null,null,null,null,null,null,null,null,null,null,"Calc % Diff.",null,null,null,null,null,"original database export===>"]
[null,null,null,null,null,null,null,null,null,null,null,null,null,null,"M6C",null,null,null,null,null,null,null,null,null,null,null,null,null,null,null,null,null,null,null,null,null,null,null,null,null,null,null,null,null,null,null,null,null,"original database export===>"]
[null,null,null,null,null,null,null,null,null,null,null,null,null,null,null,null,null,null,null,null,null,null,null,null,null,null,null,null,null,null,null,null,null,null,null,null,null,null,null,null,null,null,null,null,null,null,null,null,"original database export===>"]
["RTI",null,null,null,null,null,"As Submitted",null,null,null,null,null,null,null,null,null,null,null,null,null,"RTI-QA",null,null,null,null,null,null,null,"As Submitted",null,null,null,null,null,null,null,null,"RTI-QA",null,null,null,null,null,null,null,"Final for UPL",null,"Final for UPL","original database export===>"]
["Comments",null,"Use Run in UPL Calc?","Grade","Key","Facility_Name","Facility_ID","Boiler_ID","Fuel1 Used","Fuel1 Fraction","Fuel2 Used","Fuel2 Fraction","\"Fuel Used/Fraction\" Data Source","Pollutant","Reference Method","Concentration","Concentration UOM","Non-Detect?","MDL","MDL UOM","HAP Conversion Value to lbs","HAP Conversion UOM","Reserved","Reserve","Reserve","Reserve","Volume Conversion UOM","Submitted F Factor","Bws (percent)","%O2d","%CO2d","Emission Rate Value","Emission Rate UOM","Emission Rate MDL","Emission Factor Value","Emission Factor UOM","Emission Factor MDL","Fd","Fw","Fc","Calculated conc lb/dscf","19-1\nlb/MMBtu","%diff\n19-1","19-6\nlb/MMBtu","%diff\n19-6","lb/MMBtu Value Used for UPL Calcs","Unit Heat Rate (MMBtu/MWh)","lb/MWh Value Used in UPL Calcs","original database export===>","Key","RTI Calculated QA\nlb/MMBtu","Run Grade","Submitted Value","Submitted Value UOM","Use ?","Comment","facility_id","configuration_id","report_id","sampling_port_id","order","pollutant_id","pollutant_name","run_id","start_datetime","end_datetime","unit_load","fuel_flow_rate","fuel_heating_value","fg_moisture_content","fg_oxygen_content","fg_CO2_content","fg_temperature","test_method","conc","conc_units","conc_ND","conc_MDL","conc2","conc2_units","emission_rate","emission_rate_units","emission_rate_ND","emission_rate_MDL","Calculated conc lb/dscf","19-1\nlb/MMBtu","%diff","19-6\nlb/MMBtu","%diff","emission_factor","emission_factor_units","emission_factor_ND","emission_factor_MDL","run_pollutant_comment","Fuel1","Fuel1%Btu","Fuel2","Fuel2%Btu","QA Comment","Questions for EPA","Average of Test Runs"]
["BDL",null,"Yes","E","1_HCl_T2_R1","Logan","10043","B01","Bituminous",1,null,null,"Part II Submittal","HCl","26A",null,"ppmvd","Yes",{"$f":"BZ11","v":0.04},"ppm",{"$f":"$D$88","v":9.4479550421479867E-8},"(lb/dscf)/ppmvd",null,null,null,null,null,null,{"$f":"BR11","v":10.6},{"$f":"BS11","v":6.5},{"$f":"BT11","v":12.9},null,"lb/hr",{"$f":"CF11","v":0.1},null,null,null,{"$f":"VLOOKUP(I11,$A$98:$L$106,3,FALSE)","v":9780},{"$f":"VLOOKUP(I11,$A$98:$L$106,4,FALSE)","v":10640},{"$f":"VLOOKUP(I11,$A$98:$L$106,5,FALSE)","v":1800},{"$f":"S11*U11","v":3.7791820168591945E-9},{"$f":"IF(AD11<>\"\",AO11*AL11*20.9/(20.9-AD11),\"no O2 data for run\")","v":5.3643914070142569E-5},null,{"$f":"IF(AE11<>\"\",AO11*AN11*100/AE11,\"no CO2 data for run\")","v":5.273277232826783E-5},null,{"$f":"AP11","v":5.3643914070142569E-5},8.7546545304095993,{"$f":"AT11*AU11","v":4.6963393534307687E-4},"original database export===>","1_HCl_T2_R1",5.3643914070142569E-5,"E",0.04,"parts per million by volume (dry) (ppmvd)","Yes","BDL",10043,"Unit1","2005 Annual Stack Test 6","Flue 1",5,7,"Hydrogen Chloride (HCl)","1","2005-05-19","2005-05-19",null,null,null,10.6,6.5,12.9,186,"EPA 26A",null,"parts per million by volume (dry) (ppmvd)",true,0.04,null,"",null,"pound per hour (lb/hr)",true,0.1,null,null,null,null,null,null,"",false,null,"< the limit of detection","coal - bituminous",100,null,null,null,null,{"$f":"AVERAGE(AV11:AV13)","v":1.0367991870074685E-3}]
["BDL",null,"Yes","E","1_HCl_T2_R2","Logan","10043","B01","Bituminous",1,null,null,"Part II Submittal","HCl","26A",null,"ppmvd","Yes",{"$f":"BZ12","v":0.08},"ppm",9.4479550421479867E-8,"(lb/dscf)/ppmvd",null,null,null,null,null,null,{"$f":"BR12","v":11.3},{"$f":"BS12","v":5.7},{"$f":"BT12","v":13.7},null,"lb/hr",{"$f":"CF12","v":0.3},null,null,null,{"$f":"VLOOKUP(I12,$A$98:$L$106,3,FALSE)","v":9780},{"$f":"VLOOKUP(I12,$A$98:$L$106,4,FALSE)","v":10640},{"$f":"VLOOKUP(I12,$A$98:$L$106,5,FALSE)","v":1800},{"$f":"S12*U12","v":7.5583640337183889E-9},1.0164110034342802E-4,null,9.9306972705789058E-5,null,{"$f":"AP12","v":1.0164110034342802E-4},8.7546545304095993,8.898327195974088E-4,"original database export===>","1_HCl_T2_R2",1.0164110034342802E-4,"E",0.08,"parts per million by volume (dry) (ppmvd)","Yes","BDL",10043,"Unit1","2005 Annual Stack Test 6","Flue 1",5,7,"Hydrogen Chloride (HCl)","2","2005-05-19","2005-05-19",null,null,null,11.3,5.7,13.7,185,"EPA 26A",null,"parts per million by volume (dry) (ppmvd)",true,0.08,null,"",null,"pound per hour (lb/hr)",true,0.3,null,null,null,null,null,null,"",true,null,"","coal - bituminous",100]
["The 16 ppm entry in the Part II data base appears to be an error. However the facility provided both a ppm value (16 ppmvd @ 7% O2) and an emission rate of 0.0002 lb/MMBtu for this run. The reported lb/MMBtu emission rate corresponds to a 1.6 ppm at 7% O2. ",null,"Yes (Use reported lb/MMBtu value)","E","1_HCl_T2_R3","Logan","10043","B01","Bituminous",1,null,null,"Part II Submittal","HCl","26A",16,"ppmvd @ 7% O2","No",null,null,9.4479550421479867E-8,"(lb/dscf)/ppmvd",null,null,null,null,null,null,11.4,5.5,13.7,{"$f":"CL13","v":2.0000000000000001E-4},"lb/MMBtu",null,null,null,null,9780,10640,1800,{"$f":"P13*U13","v":1.5116728067436779E-6},{"$f":"IF(AD13<>\"\",AO13*AL13*20.9/(20.9-7),\"no O2 data for run\")","v":2.222942050676412E-2},null,1.9861394541157811E-2,null,{"$f":"AF13","v":2.0000000000000001E-4},8.7546545304095993,1.7509309060819199E-3,"original database export===>","1_HCl_T2_R3",2.0064217210650732E-2,"E",16,"parts per million by volume (dry) (ppmvd @ 7% O2)","?","extremely high run; should this be excluded?",10043,"Unit1","2005 Annual Stack Test 6","Flue 1",5,7,"Hydrogen Chloride (HCl)","3","2005-05-19","2005-05-19",null,null,null,11.4,5.5,13.7,168.8,"EPA 26A",16,"parts per million by volume (dry) (ppmvd @ 7% O2)",false,null,null,"",0.5,"pound per hour (lb/hr)",false,null,null,null,null,null,null,2.0000000000000001E-4,"pound per million British Thermal Unit (lb/MMBtu)",false,null,"","coal - bituminous",100]
["BDL",null,"Yes","E","1_HCl_T3_R1","Logan","10043","B01","Bituminous",1,null,null,"Part II Submittal","HCl","26A",null,null,"Yes",0.06,"ppm@7%O2",9.4479550421479867E-8,"(lb/dscf)/ppmvd",null,null,null,null,null,null,10.5,10,10,null,"lb/hr",{"$f":"CF14","v":1.47},null,null,null,9780,10640,1800,5.6687730252887921E-9,{"$f":"IF(AD14<>\"\",AO14*AL14*20.9/(20.9-7),\"no O2 data for run\")","v":8.3360326900365435E-5},null,1.0203791445519826E-4,null,8.3360326900365435E-5,8.7546545304095993,7.2979086355470942E-4,"original database export===>","1_HCl_T3_R1",8.3360326900365435E-5,"E",0.06,"parts per million by volume (dry) (ppmvd @ 7% O2)","Yes","BDL",10043,"Unit1","2006 Annual Stack Test 2","Flue 1",5,7,"Hydrogen Chloride (HCl)","1","2006-06-15","2006-06-15",null,null,null,10.5,10,10,189,"EPA 26A",null,"parts per million by volume (dry) (ppmvd @ 7% O2)",true,0.06,null,"",null,"pound per hour (lb/hr)",true,1.47,null,null,null,null,null,null,"",true,null,"< limit of detection","coal - bituminous",100,null,null,null,null,{"$f":"AVERAGE(AV14:AV16)","v":6.8924692669055895E-4}]
["BDL",null,"Yes","E","1_HCl_T3_R2","Logan","10043","B01","Bituminous",1,null,null,"Part II Submittal","HCl","26A",null,null,"Yes",0.06,"ppm@7%O2",9.4479550421479867E-8,"(lb/dscf)/ppmvd",null,null,null,null,null,null,10.7,5,13.9,null,"lb/hr",1.67,null,null,null,9780,10640,1800,5.6687730252887921E-9,{"$f":"IF(AD15<>\"\",AO15*AL15*20.9/(20.9-7),\"no O2 data for run\")","v":8.3360326900365435E-5},null,7.3408571550502346E-5,null,8.3360326900365435E-5,8.7546545304095993,7.2979086355470942E-4,"original database export===>","1_HCl_T3_R2",8.3360326900365435E-5,"E",0.06,"parts per million by volume (dry) (ppmvd @ 7% O2)","Yes","BDL",10043,"Unit1","2006 Annual Stack Test 2","Flue 1",5,7,"Hydrogen Chloride (HCl)","2","2006-06-15","2006-06-15",null,null,null,10.7,5,13.9,189,"EPA 26A",null,"parts per million by volume (dry) (ppmvd @ 7% O2)",true,0.06,null,"",null,"pound per hour (lb/hr)",true,1.67,null,null,null,null,null,null,"",true,null,"< Limit of detection","coal - bituminous",100]
["BDL",null,"Yes","E","1_HCl_T3_R3","Logan","10043","B01","Bituminous",1,null,null,"Part II Submittal","HCl","26A",null,null,"Yes",0.05,"ppm@7%O2",9.4479550421479867E-8,"(lb/dscf)/ppmvd",null,null,null,null,null,null,10.7,6.9,12.2,null,"lb/hr",1.35,null,null,null,9780,10640,1800,4.7239775210739937E-9,{"$f":"IF(AD16<>\"\",AO16*AL16*20.9/(20.9-7),\"no O2 data for run\")","v":6.946693908363788E-5},null,6.9698028999452371E-5,null,6.946693908363788E-5,8.7546545304095993,6.0815905296225799E-4,"original database export===>","1_HCl_T3_R3",6.946693908363788E-5,"E",0.05,"parts per million by volume (dry) (ppmvd @ 7% O2)","Yes","BDL",10043,"Unit1","2006 Annual Stack Test 2","Flue 1",5,7,"Hydrogen Chloride (HCl)","3","2006-06-16","2006-06-16",null,null,null,10.7,6.9,12.2,186,"EPA 26A",null,"parts per million by volume (dry) (ppmvd @ 7% O2)",true,0.05,null,"",null,"pound per hour (lb/hr)",true,1.35,null,null,null,null,null,null,"",true,null,"< limit of detection","coal - bituminous",100]
["BDL",null,"Yes","E","1_HCl_T4_R1","Logan","10043","B01","Bituminous",1,null,null,"Part II Submittal","HCl","26A",null,null,"Yes",0.15,"ppm",9.4479550421479867E-8,"(lb/dscf)/ppmvd",null,null,null,null,null,null,11.9,5.8,12.1,null,"lb/hr",0.46,null,null,null,9780,10640,1800,1.4171932563221979E-8,1.9183916289984765E-4,null,2.1082213730412862E-4,null,{"$f":"AP17","v":1.9183916289984765E-4},8.7546545304095993,1.6794855965911364E-3,"original database export===>","1_HCl_T4_R1",1.9183916289984765E-4,"E",0.15,"parts per million by volume (dry) (ppmvd)","Yes","BDL",10043,"Unit1","2007 Annual Stack Test 3","Flue 1",5,7,"Hydrogen Chloride (HCl)","1","2007-07-12","2007-07-12",null,null,null,11.9,5.8,12.1,185,"EPA 26A",null,"parts per million by volume (dry) (ppmvd)",true,0.15,null,"",null,"pound per hour (lb/hr)",true,0.46,null,null,null,null,null,null,"",true,null,"< limit of detection","coal - bituminous",100,null,null,null,null,{"$f":"AVERAGE(AV17:AV19)","v":1.6421636944446668E-3}]
["BDL",null,"Yes","E","1_HCl_T4_R2","Logan","10043","B01","Bituminous",1,null,null,"Part II Submittal","HCl","26A",null,null,"Yes",0.15,"ppm",9.4479550421479867E-8,"(lb/dscf)/ppmvd",null,null,null,null,null,null,11.9,5.8,12.1,null,"lb/hr",0.43,null,null,null,9780,10640,1800,1.4171932563221979E-8,1.9183916289984765E-4,null,2.1082213730412862E-4,null,{"$f":"AP18","v":1.9183916289984765E-4},8.7546545304095993,1.6794855965911364E-3,"original database export===>","1_HCl_T4_R2",1.9183916289984765E-4,"E",0.15,"parts per million by volume (dry) (ppmvd)","Yes","BDL",10043,"Unit1","2007 Annual Stack Test 3","Flue 1",5,7,"Hydrogen Chloride (HCl)","2","2007-07-12","2007-07-12",null,null,null,11.9,5.8,12.1,185,"EPA 26A",null,"parts per million by volume (dry) (ppmvd)",true,0.15,null,"",null,"pound per hour (lb/hr)",true,0.43,null,null,null,null,null,null,"",true,null,"< limit of detection","coal - bituminous",100]
["BDL",null,"Yes","E","1_HCl_T4_R3","Logan","10043","B01","Bituminous",1,null,null,"Part II Submittal","HCl","26A",null,null,"Yes",0.14000000000000001,"ppm",9.4479550421479867E-8,"(lb/dscf)/ppmvd",null,null,null,null,null,null,11.1,5.8,12.1,null,"lb/hr",0.41,null,null,null,9780,10640,1800,1.3227137059007183E-8,1.7904988537319113E-4,null,1.9676732815052006E-4,null,1.7904988537319113E-4,8.7546545304095993,1.5675198901517271E-3,"original database export===>","1_HCl_T4_R3",1.7904988537319113E-4,"E",0.14000000000000001,"parts per million by volume (dry) (ppmvd)","Yes","BDL",10043,"Unit1","2007 Annual Stack Test 3","Flue 1",5,7,"Hydrogen Chloride (HCl)","3","2007-07-12","2007-07-12",null,null,null,11.1,5.8,12.1,184,"EPA 26A",null,"parts per million by volume (dry) (ppmvd)",true,0.14000000000000001,null,"",null,"pound per hour (lb/hr)",true,0.41,null,null,null,null,null,null,"",true,null,"< limit of detection","coal - bituminous",100]
["BDL",null,"Yes","E","1_HCl_T5_R1","Logan","10043","B01","Bituminous",1,null,null,"Part II Submittal","HCl","26A",null,null,"Yes",0.32,"ppm",9.4479550421479867E-8,"(lb/dscf)/ppmvd",null,null,null,null,null,null,10.9,6,13.2,null,"lb/hr",1.01,null,null,null,9780,10640,1800,3.0233456134873556E-8,4.1475026180405529E-4,null,4.1227440183918488E-4,null,{"$f":"AP20","v":4.1475026180405529E-4},8.7546545304095993,3.6309952584914402E-3,"original database export===>","1_HCl_T5_R1",4.1475026180405529E-4,"E",0.32,"parts per million by volume (dry) (ppmvd)","Yes","BDL",10043,"Unit1","2008 Annual Stack Test 3","Flue 1",5,7,"Hydrogen Chloride (HCl)","1","2008-06-27","2008-06-27",null,null,null,10.9,6,13.2,188,"EPA 26A",null,"parts per million by volume (dry) (ppmvd)",true,0.32,null,"",null,"pound per hour (lb/hr)",true,1.01,null,null,null,null,null,null,"",true,null,"< limit of detection","coal - bituminous",100,null,null,null,null,{"$f":"AVERAGE(AV20:AV22)","v":3.6122985057306756E-3}]
["BDL",null,"Yes","E","1_HCl_T5_R2","Logan","10043","B01","Bituminous",1,null,null,"Part II Submittal","HCl","26A",null,null,"Yes",0.32,"ppm",9.4479550421479867E-8,"(lb/dscf)/ppmvd",null,null,null,null,null,null,11.5,5.7,13.5,null,"lb/hr",0.99,null,null,null,9780,10640,1800,3.0233456134873556E-8,4.0656440137371209E-4,null,4.0311274846498076E-4,null,{"$f":"AP21","v":4.0656440137371209E-4},8.7546545304095993,3.5593308783896352E-3,"original database export===>","1_HCl_T5_R2",4.0656440137371209E-4,"E",0.32,"parts per million by volume (dry) (ppmvd)","Yes","BDL",10043,"Unit1","2008 Annual Stack Test 3","Flue 1",5,7,"Hydrogen Chloride (HCl)","2","2008-06-27","2008-06-27",null,null,null,11.5,5.7,13.5,188,"EPA 26A",null,"parts per million by volume (dry) (ppmvd)",true,0.32,null,"",null,"pound per hour (lb/hr)",true,0.99,null,null,null,null,null,null,"",true,null,"< limit of detection","coal - bituminous",100]
["BDL",null,"Yes","E","1_HCl_T5_R3","Logan","10043","B01","Bituminous",1,null,null,"Part II Submittal","HCl","26A",null,null,"Yes",0.33,"ppm",9.4479550421479867E-8,"(lb/dscf)/ppmvd",null,null,null,null,null,null,11.6,5.6,13.7,null,"lb/hr",1.02,null,null,null,9780,10640,1800,3.1178251639088357E-8,4.1652921513287176E-4,null,4.0964126241137987E-4,null,4.1652921513287176E-4,8.7546545304095993,3.6465693803109504E-3,"original database export===>","1_HCl_T5_R3",4.1652921513287176E-4,"E",0.33,"parts per million by volume (dry) (ppmvd)","Yes","BDL",10043,"Unit1","2008 Annual Stack Test 3","Flue 1",5,7,"Hydrogen Chloride (HCl)","3","2008-06-27","2008-06-27",null,null,null,11.6,5.6,13.7,188,"EPA 26A",null,"parts per million by volume (dry) (ppmvd)",true,0.33,null,"",null,"pound per hour (lb/hr)",true,1.02,null,null,null,null,null,null,"",true,null,"< limit of detection","coal - bituminous",100]
["BDL",null,"Yes","E","1_HCl_T6_R1","Logan","10043","B01","Bituminous",1,null,null,"Part II Submittal","HCl","26A",null,null,"Yes",0.06,"ppm",9.4479550421479867E-8,"(lb/dscf)/ppmvd",null,null,null,null,null,null,12.1,6.1,13.6,null,"lb/hr",0.17,null,null,null,9780,10640,1800,5.6687730252887921E-9,7.8291117832099966E-5,null,7.5027878275881084E-5,null,{"$f":"AP23","v":7.8291117832099966E-5},8.7546545304095993,6.8541168941962569E-4,"original database export===>","1_HCl_T6_R1",7.8291117832099966E-5,"E",0.06,"parts per million by volume (dry) (ppmvd)","Yes","BDL",10043,"Unit1","2009 Annual Stack Test 3","Flue 1",5,7,"Hydrogen Chloride (HCl)","1","2009-06-24","2009-06-24",null,null,null,12.1,6.1,13.6,190,"EPA 26A",null,"parts per million by volume (dry) (ppmvd)",true,0.06,null,"",null,"pound per hour (lb/hr)",true,0.17,null,null,null,null,null,null,"",true,null,"< limit of detection","coal - bituminous",100,null,null,null,null,{"$f":"AVERAGE(AV23:AV25)","v":6.8387832993546552E-4}]
["BDL",null,"Yes","E","1_HCl_T6_R2","Logan","10043","B01","Bituminous",1,null,null,"Part II Submittal","HCl","26A",null,null,"Yes",0.06,"ppm",9.4479550421479867E-8,"(lb/dscf)/ppmvd",null,null,null,null,null,null,12.1,6.1,13.5,null,"lb/hr",0.17,null,null,null,9780,10640,1800,5.6687730252887921E-9,7.8291117832099966E-5,null,7.5583640337183896E-5,null,{"$f":"AP24","v":7.8291117832099966E-5},8.7546545304095993,6.8541168941962569E-4,"original database export===>","1_HCl_T6_R2",7.8291117832099966E-5,"E",0.06,"parts per million by volume (dry) (ppmvd)","Yes","BDL",10043,"Unit1","2009 Annual Stack Test 3","Flue 1",5,7,"Hydrogen Chloride (HCl)","2","2009-06-24","2009-06-24",null,null,null,12.1,6.1,13.5,190,"EPA 26A",null,"parts per million by volume (dry) (ppmvd)",true,0.06,null,"",null,"pound per hour (lb/hr)",true,0.17,null,null,null,null,null,null,"",true,null,"< less than the limit of detection","coal - bituminous",100]
["BDL",null,"Yes","E","1_HCl_T6_R3","Logan","10043","B01","Bituminous",1,null,null,"Part II Submittal","HCl","26A",null,null,"Yes",0.06,"ppm",9.4479550421479867E-8,"(lb/dscf)/ppmvd",null,null,null,null,null,null,12.6,6,13.6,null,"lb/hr",0.17,null,null,null,9780,10640,1800,5.6687730252887921E-9,7.7765674088260374E-5,null,7.5027878275881084E-5,null,7.7765674088260374E-5,8.7546545304095993,6.8081161096714506E-4,"original database export===>","1_HCl_T6_R3",7.7765674088260374E-5,"E",0.06,"parts per million by volume (dry) (ppmvd)","Yes","BDL",10043,"Unit1","2009 Annual Stack Test 3","Flue 1",5,7,"Hydrogen Chloride (HCl)","3","2009-06-24","2009-06-24",null,null,null,12.6,6,13.6,189,"EPA 26A",null,"parts per million by volume (dry) (ppmvd)",true,0.06,null,"",null,"pound per hour (lb/hr)",true,0.17,null,null,null,null,null,null,"",true,null,"< limit of detection","coal - bituminous",100]
[null,null,null,null,null,"Logan",null,"B01",null,null,null,null,null,null,null,null,null,null,null,null,9.4479550421479867E-8,"(lb/dscf)/ppmvd",null,null,null,null,null,null,null,null,null,null,null,null,null,null,null,{"$error":"#N/A"},{"$error":"#N/A"},{"$error":"#N/A"},0,null,null,null,null,null,8.7546545304095993,null,"original database export===>","Key","RTI Calculated QA\nlb/MMBtu","Run Grade","Submitted Value","Submitted Value UOM","Use ?","Comment","facility_id","configuration_id","submittal_id","Compound","RunDate","Method","RunNumber","RunStartTime","RunEndTime","NetTravPts","Mass_TOOL","mass","units","Vmstd","Cd","Vwstd","PercH20","PercCO2","PercO2","Fd","19-1","19-5","Fc","19-6","19-9","Fw","FuelType","lb/mmBtuO2","CountOfComments","AvgOfStackTemp","AvgOfDryGasInlet","AvgOfDryGasOutlet","AvgOfOrificePresDesired","AvgOfOrificePresActual","AvgOfProbeTemp","AvgOfFilterTemp","AvgOfImpingTemp","CountOfNotes","M29 Isokinetic (+/- 10%)","OTM27 includes all fractions?","QA Comment","Questions for EPA"]
[null,null,null,null,null,"Logan",null,"B01",null,null,null,null,null,null,null,null,null,null,null,null,9.4479550421479867E-8,"(lb/dscf)/ppmvd",null,null,null,null,null,null,null,null,null,null,null,null,null,null,null,{"$error":"#N/A"},{"$error":"#N/A"},{"$error":"#N/A"},0,null,null,null,null,null,8.7546545304095993,null,"original database export===>",null,null,null,null,null,null,null,null,null,null,null,null,null,null,null,null,null,null,null,null,"DSCF","lb/dscf"]
["F-factor in ERT submittal is inconsistent with fuel analyses. During QA of submission, revised reported f-Factor to be consistent with runs 2 and 3 and consistent with the submitted fuel analysis for run 1.",null,"Yes","A","1_HCl_T1_R1","Logan","10043","B01","Bituminous",1,null,null,"ERT","HCl","26A","ND","ppmvd","Yes",0.01,"ppmvd",9.4479550421479867E-8,"(lb/dscf)/ppmvd",null,null,null,null,null,{"$f":"BX28","v":7885},{"$f":"BU28","v":"13.06"},{"$f":"BW28","v":5.09},{"$f":"BV28","v":13.8},"ND","lb/hr",0.03,"ND","lb/MMBtu",1.0000000000000001E-5,{"$f":"AL29","v":9533},10640,1800,9.4479550421479862E-10,{"$f":"IF(AD28<>\"\",AO28*AL28*20.9/(20.9-AD28),\"no O2 data for run\")","v":1.1906437243586668E-5},{"$f":"(AP28-AK28)/AP28","v":0.1601181952740362},null,null,{"$f":"AP28","v":1.1906437243586668E-5},8.7546545304095993,{"$f":"AT28*AU28","v":1.0423674475560361E-4},"original database export===>","HCl_T1_R1",9.9488614595897456E-6,"A",9.9578103287838942E-6,"lb/mmBtuO2","Yes",null,10043,"Unit1",1266,"Hydrogen Chloride","2010-04-08","Method 26A","1","","11:25",12,0.05,0.05,"mg","115.387",9.5445898229703841E-10,"17.34","13.06",13.8,5.09,7885,9.9488614595897456E-6,8.6495401529673251E-6,1800,1.244946498648311E-7,1.0823564859248413E-5,10640,"Override",9.9578103287838942E-6,0,178.41666666666666,84.666666666666671,84.666666666666671,1.5125,1.5125,178.41666666666666,254.83333333333334,60.833333333333336,0,null,null,null,null,null,null,{"$f":"AVERAGE(AV28:AV30)","v":1.19373908712494E-4}]
["BDL",null,"Yes","A","1_HCl_T1_R2","Logan","10043","B01","Bituminous",1,null,null,"ERT","HCl","26A","ND","ppmvd","Yes",0.01,"ppmvd",9.4479550421479867E-8,"(lb/dscf)/ppmvd",null,null,null,null,null,{"$f":"BX29","v":9533},{"$f":"BU29","v":"12.73"},{"$f":"BW29","v":5.23},{"$f":"BV29","v":14.05},"ND","lb/hr",0.04,"ND","lb/MMBtu",1.5E-5,{"$f":"AB29","v":9533},10640,1800,9.4479550421479862E-10,{"$f":"IF(AD29<>\"\",AO29*AL29*20.9/(20.9-AD29),\"no O2 data for run\")","v":1.2012812560376849E-5},{"$f":"(AP29-AK29)/AP29","v":-0.24866678178898025},null,null,{"$f":"AK29","v":1.5E-5},8.7546545304095993,{"$f":"AT29*AU29","v":1.31319817956144E-4},"original database export===>","HCl_T1_R2",1.4550081293976729E-5,"A",1.4563168899507567E-5,"lb/mmBtuO2","Yes",null,10043,"Unit1",1266,"Hydrogen Chloride","2010-04-08","Method 26A","2","","15:16",12,0.06,0.06,"mg","115.488",1.1443491125343762E-9,"16.85","12.73",14.05,5.23,9533,1.4550081293976729E-5,1.2697855945253493E-5,1800,1.4660700374105888E-7,1.2794393216482209E-5,10640,"Override",1.4563168899507567E-5,0,179.41666666666666,85,85,1.4749999999999999,1.4749999999999999,179.41666666666666,258.75,55.333333333333336,0]
["BDL",null,"Yes","A","1_HCl_T1_R3","Logan","10043","B01","Bituminous",1,null,null,"ERT","HCl","26A","ND","ppmvd","Yes",0.01,"ppmvd",9.4479550421479867E-8,"(lb/dscf)/ppmvd",null,null,null,null,null,9537,"12.50",5.13,14.11,"ND","lb/hr",0.04,"ND","lb/MMBtu",1.4E-5,{"$f":"AB30","v":9537},10640,1800,9.4479550421479862E-10,{"$f":"IF(AD30<>\"\",AO30*AL30*20.9/(20.9-AD30),\"no O2 data for run\")","v":1.1941646019356853E-5},-0.1723676934743042,null,null,{"$f":"AK30","v":1.4E-5},8.7546545304095993,1.2256516342573439E-4,"original database export===>","HCl_T1_R3",1.4084833956365961E-5,"A",1.4097503078074893E-5,"lb/mmBtuO2","Yes",null,10043,"Unit1",1266,"Hydrogen Chloride","2010-04-08","Method 26A","3","","19:17",12,0.06,0.06,"mg","118.596",1.1143595931428548E-9,"16.95","12.50",14.11,5.13,9537,1.4084833956365961E-5,1.2324229711820216E-5,1800,1.4215785029462358E-7,1.2438811900779565E-5,10640,"Override",1.4097503078074893E-5,0,181.16666666666666,86.75,86.75,1.5125,1.5125,181.16666666666666,257.66666666666669,55.833333333333336,0]
[null,null,null,null,null,null,null,null,null,null,null,null,null,null,null,null,null,null,null,null,null,null,null,null,null,null,null,null,null,null,null,null,null,null,null,null,null,null,null,null,null,null,null,null,null,null,null,null,"original database export===>"]
[]
[]
[null,null,null,null,null,null,null,null,null,null,null,null,null,null,null,null,null,null,null,null,null,null,null,null,null,null,null,null,null,null,null,null,null,null,null,null,null,null,null,null,null,null,null,null,null,null,null,null,null,null,null,null,null,null,null,null,null,null,null,null,null,null,null,null,null,null,null,null,null,null,null,null,null,null,null,null,{"$f":"BY28*AU28","v":8.7098845049614823E-5}]
[null,null,null,null,null,null,null,null,null,null,null,null,null,null,null,null,null,null,null,null,null,null,null,null,null,null,null,null,null,null,null,null,null,null,null,null,null,null,null,null,null,null,null,null,null,null,null,null,null,null,null,null,null,null,null,null,null,null,null,null,null,null,null,null,null,null,null,null,null,null,null,null,null,null,null,null,{"$f":"BY29*AU29","v":1.2738093511814133E-4}]
[null,null,null,null,null,null,null,null,null,null,null,null,null,null,null,null,null,null,null,null,null,null,null,null,null,null,null,null,null,null,null,null,null,null,null,null,null,null,null,null,null,null,null,null,null,null,null,null,null,null,null,null,null,null,null,null,null,null,null,null,null,null,null,null,null,null,null,null,null,null,null,null,null,null,null,null,1.2330785540616622E-4]
[]
[]
[]
[]
[]
[]
[]
[]
[]
[]
[]
[]
[]
[]
[]
[]
[]
[]
[]
[null,null,null,null,null,null,null,null,null,null,null,null,null,null,null,null,null,null,null,null,null,null,null,null,null,null,null,null,null,null,null,null,null,null,null,null,null,null,null,null,null,null,null,null,null,null,null,null,null,"1_HCl_T6_R1"]
[null,null,null,null,null,null,null,null,null,null,null,null,null,null,null,null,null,null,null,null,null,null,null,null,null,null,null,null,null,null,null,null,null,null,null,null,null,null,null,null,null,null,null,null,null,null,null,null,null,"1_HCl_T6_R2"]
[null,null,null,null,null,null,null,null,null,null,null,null,null,null,null,null,null,null,null,null,null,null,null,null,null,null,null,null,null,null,null,null,null,null,null,null,null,null,null,null,null,null,null,null,null,null,null,null,null,"1_HCl_T6_R3"]
[]
[]
[]
[]
[]
[]
[]
[]
[]
[]
[]
[]
[]
[]
[]
[]
[]
[]
[]
[]
[]
[]
[]
[]
[]
[]
[]
[]
["Conversions"]
[null,null,"ppm HCl=",9.4479550421479867E-8,"lb/scf"]
[1,null,"ppm SO2=",1.66E-7,"lb/scf"]
[1,null,"ppm Hg=",{"$f":"D89*A95/A96","v":5.1979300655635339E-7},"lb/scf"]
[1000,null,"mg=",1,"g"]
[1000000,null,"ug=",1,"g"]
[454,null,"g=",1,"lb"]
[1,null,"m^3=",35.314500000000002,"ft^3"]
[200.59,null,"Hg molecular weight"]
[64.06,null,"SO2 molecular weight"]
[]
["Table 19-2",null,"Fd","Fw","Fc"]
["Fuel Type",null,"dscf/MMBtu","wscf/MMBtu","scf/MMBtu"]
["Coal"]
["Anthracite",null,10100,10540,1970]
["Bituminous",null,9780,10640,1800]
["Lignite",null,9860,11950,1910]
["Oil",null,9190,10320,1420]
["Subbituminous",null,9820,null,1840]
[]
["QA Calcs"]
["RTI",null,null,null,null,null,null,"As Submitted",null,null,null,null,null,null,null,null,null,null,null,null,null,"RTI-QA",null,null,null,null,null,null,null,"Using Available Representative Diluent Per Comment",null,null,null,null,null,null,null,null,"RTI-QA",null,null,null,null,null,null,null,"Final for UPL",null,"Final for UPL","original database export===>"]
["Comments",null,null,"Use Run in UPL Calc?","Grade","Key",null,"Facility_ID","Boiler_ID","Fuel1 Used","Fuel1 Fraction","Fuel2 Used","Fuel2 Fraction","\"Fuel Used/Fraction\" Data Source","Pollutant","Reference Method","Concentration","Concentration UOM","Non-Detect?","MDL",null,"Mass Conversion Value to lbs","Mass Conversion UOM","Volume Conversion Value to cubic feet","Reserve","Reserve","Reserve",null,"Volume Conversion UOM","Bws (percent)","%O2d","%CO2d","Emission Rate Value","Emission Rate UOM","Emission Rate MDL","Emission Factor Value","Emission Factor UOM","Emission Factor MDL","Fd","Fw","Fc","Calculated conc lb/dscf","19-1\nlb/MMBtu","%diff\n19-1","19-6\nlb/MMBtu","%diff\n19-6","lb/MMBtu Value Used for UPL Calcs","Unit Heat Rate (MMBtu/MWh)","lb/MWh Value Used in UPL Calcs","original database export===>"]
[]
[]
[]
[]
[]
[]
[]
[]
[]
[]
[]
[]
[]
[]
[]
[]
[]
[]
[]
[]
[]
[]
[]
[]
[]
[]
[]
[]
[]
[]
[]
[]
[]
[]
[]
[]
[]
[]
[]
[]
[]
[]
[]
[]
[]
[]
[]
[]
[]
[]
[]
[]
[]
[]
[]
[]
[]
[]
[]
[]
[]
[]
[]
[]
[]
[]
[]
[]
[]
[]
[]
[]
[]
[]
[]
[]
[]
[]
[]
[]
[]
[]
[]
[]
[]
[]
[]
[1,2,3,4,5,6,7,8,9,10,11,12,13,14,15,16,17,18,19,20,21,22,23,24,25,26,27,28,29,30,31,32,33,34,35,36,37,38,39,40,41,42,43,44,45,46,47]
[]
[null,"Column Source==>",44,44,44,44,44,44,44,44,44,44]
[null,"Test Avgs for UPL","R1","R2","R3","R4","R5","R6","R7","R8","R9","R10"]
["Test_IDs","lb/MW","lb/MW","lb/MW","lb/MW","lb/MW","lb/MW","lb/MW","lb/MW","lb/MW","lb/MW","lb/MW","Test_IDs"]
["1_HCl_T1",{"$f":"AVERAGE(C202:E202)","v":1.19373908712494E-4},{"$f":"IFERROR(VLOOKUP($A202&\"_\"&C$200,$E:DD,C$199,FALSE),\"\")","v":1.0423674475560361E-4},{"$f":"IFERROR(VLOOKUP($A202&\"_\"&D$200,$E:AV,D$199,FALSE),\"\")","v":1.31319817956144E-4},{"$f":"IFERROR(VLOOKUP($A202&\"_\"&E$200,$E$11:$AW$100,E$199,FALSE),\"\")","v":1.2256516342573439E-4},null,null,null,null,null,null,null,{"$f":"A202","v":"1_HCl_T1"}]
["1_HCl_T6",6.8387832993546552E-4,{"$f":"IFERROR(VLOOKUP($A203&\"_\"&C$200,$E:DD,C$199,FALSE),\"\")","v":6.8541168941962569E-4},{"$f":"IFERROR(VLOOKUP($A203&\"_\"&D$200,$E:AV,D$199,FALSE),\"\")","v":6.8541168941962569E-4},6.8081161096714506E-4,{"$f":"IFERROR(VLOOKUP($A203&\"_\"&F$200,$E:AX,F$199,FALSE),\"\")","v":""},{"$f":"IFERROR(VLOOKUP($A203&\"_\"&G$200,$E:AY,G$199,FALSE),\"\")","v":""},{"$f":"IFERROR(VLOOKUP($A203&\"_\"&H$200,$E:AZ,H$199,FALSE),\"\")","v":""},{"$f":"IFERROR(VLOOKUP($A203&\"_\"&I$200,$E:BA,I$199,FALSE),\"\")","v":""},{"$f":"IFERROR(VLOOKUP($A203&\"_\"&J$200,$E:BB,J$199,FALSE),\"\")","v":""},{"$f":"IFERROR(VLOOKUP($A203&\"_\"&K$200,$E:BC,K$199,FALSE),\"\")","v":""},null,"1_HCl_T6"]
["1_HCl_T3",6.8924692669055895E-4,{"$f":"IFERROR(VLOOKUP($A204&\"_\"&C$200,$E:DD,C$199,FALSE),\"\")","v":7.2979086355470942E-4},{"$f":"IFERROR(VLOOKUP($A204&\"_\"&D$200,$E:AV,D$199,FALSE),\"\")","v":7.2979086355470942E-4},6.0815905296225799E-4,{"$f":"IFERROR(VLOOKUP($A204&\"_\"&F$200,$E:AX,F$199,FALSE),\"\")","v":""},{"$f":"IFERROR(VLOOKUP($A204&\"_\"&G$200,$E:AY,G$199,FALSE),\"\")","v":""},{"$f":"IFERROR(VLOOKUP($A204&\"_\"&H$200,$E:AZ,H$199,FALSE),\"\")","v":""},{"$f":"IFERROR(VLOOKUP($A204&\"_\"&I$200,$E:BA,I$199,FALSE),\"\")","v":""},{"$f":"IFERROR(VLOOKUP($A204&\"_\"&J$200,$E:BB,J$199,FALSE),\"\")","v":""},{"$f":"IFERROR(VLOOKUP($A204&\"_\"&K$200,$E:BC,K$199,FALSE),\"\")","v":""},null,"1_HCl_T3"]
["1_HCl_T2",1.0367991870074685E-3,{"$f":"IFERROR(VLOOKUP($A205&\"_\"&C$200,$E:DD,C$199,FALSE),\"\")","v":4.6963393534307687E-4},{"$f":"IFERROR(VLOOKUP($A205&\"_\"&D$200,$E:AV,D$199,FALSE),\"\")","v":8.898327195974088E-4},1.7509309060819199E-3,{"$f":"IFERROR(VLOOKUP($A205&\"_\"&F$200,$E:AX,F$199,FALSE),\"\")","v":""},{"$f":"IFERROR(VLOOKUP($A205&\"_\"&G$200,$E:AY,G$199,FALSE),\"\")","v":""},{"$f":"IFERROR(VLOOKUP($A205&\"_\"&H$200,$E:AZ,H$199,FALSE),\"\")","v":""},{"$f":"IFERROR(VLOOKUP($A205&\"_\"&I$200,$E:BA,I$199,FALSE),\"\")","v":""},{"$f":"IFERROR(VLOOKUP($A205&\"_\"&J$200,$E:BB,J$199,FALSE),\"\")","v":""},{"$f":"IFERROR(VLOOKUP($A205&\"_\"&K$200,$E:BC,K$199,FALSE),\"\")","v":""},null,"1_HCl_T2"]
["1_HCl_T4",1.6421636944446668E-3,{"$f":"IFERROR(VLOOKUP($A206&\"_\"&C$200,$E:DD,C$199,FALSE),\"\")","v":1.6794855965911364E-3},{"$f":"IFERROR(VLOOKUP($A206&\"_\"&D$200,$E:AV,D$199,FALSE),\"\")","v":1.6794855965911364E-3},1.5675198901517271E-3,{"$f":"IFERROR(VLOOKUP($A206&\"_\"&F$200,$E:AX,F$199,FALSE),\"\")","v":""},{"$f":"IFERROR(VLOOKUP($A206&\"_\"&G$200,$E:AY,G$199,FALSE),\"\")","v":""},{"$f":"IFERROR(VLOOKUP($A206&\"_\"&H$200,$E:AZ,H$199,FALSE),\"\")","v":""},{"$f":"IFERROR(VLOOKUP($A206&\"_\"&I$200,$E:BA,I$199,FALSE),\"\")","v":""},{"$f":"IFERROR(VLOOKUP($A206&\"_\"&J$200,$E:BB,J$199,FALSE),\"\")","v":""},{"$f":"IFERROR(VLOOKUP($A206&\"_\"&K$200,$E:BC,K$199,FALSE),\"\")","v":""},null,"1_HCl_T4"]
["1_HCl_T5",3.6122985057306756E-3,{"$f":"IFERROR(VLOOKUP($A207&\"_\"&C$200,$E:DD,C$199,FALSE),\"\")","v":3.6309952584914402E-3},{"$f":"IFERROR(VLOOKUP($A207&\"_\"&D$200,$E:AV,D$199,FALSE),\"\")","v":3.5593308783896352E-3},3.6465693803109504E-3,{"$f":"IFERROR(VLOOKUP($A207&\"_\"&F$200,$E:AX,F$199,FALSE),\"\")","v":""},{"$f":"IFERROR(VLOOKUP($A207&\"_\"&G$200,$E:AY,G$199,FALSE),\"\")","v":""},{"$f":"IFERROR(VLOOKUP($A207&\"_\"&H$200,$E:AZ,H$199,FALSE),\"\")","v":""},{"$f":"IFERROR(VLOOKUP($A207&\"_\"&I$200,$E:BA,I$199,FALSE),\"\")","v":""},{"$f":"IFERROR(VLOOKUP($A207&\"_\"&J$200,$E:BB,J$199,FALSE),\"\")","v":""},{"$f":"IFERROR(VLOOKUP($A207&\"_\"&K$200,$E:BC,K$199,FALSE),\"\")","v":""},null,"1_HCl_T5"]

{"sheet":"UPL Normal","index":5,"n_rows":107,"n_cols":6,"rows_kept":107,"cut":false,"hidden":false,"merged":[[47,16,48,16]]}
["Emissions (lb/MW)","HCl"]
[null,10043]
["ORIS/Facility/Unit","Logan"]
["Averages","Unit1"]
[1,1.1873905735104945E-4]
[2,6.8387832993546552E-4]
[3,6.8924692669055895E-4]
[4,1.0367991870074685E-3]
[5,1.6421636944446668E-3]
[6,3.6122985057306756E-3]
[7]
[8]
[9]
[10]
[11]
[12]
[13]
[14]
[15]
[16]
[17]
[18]
[19]
[20]
[21]
[22]
[23]
[24]
[25]
[26]
[27]
[28]
[29]
[30]
[31]
[32]
[33]
[34]
[35]
[]
["ni = number test Averages =",{"$f":"COUNT(B5:B39)","v":6}]
[]
[]
[]
["Total Number of sources =",null,{"$f":"COUNTA(B2:Q2)","v":1}]
[]
[]
["n =Total # test Averages =",null,{"$f":"SUM(B41:B41)","v":6}]
[]
[]
[]
[]
[null,null,{"$f":"C48-1","v":5}]
[]
[]
[]
[]
["This step is for QC only:"]
[]
["means",{"$f":"AVERAGE(B5:B39)","v":1.2971876168599808E-3}]
[]
[]
[]
[]
[]
[]
[null,null,{"$f":"AVERAGE(B5:B39)","v":1.2971876168599808E-3}]
["UPL Mean ="]
[]
[]
[]
["Pooled Variance = ",null,{"$f":"VAR(B5:H39)","v":1.536206045574927E-6}]
[]
[]
[]
[]
[]
["m= number future Averages =",null,1]
[]
[]
["Term1",null,{"$f":"1/C48+1/C78","v":1.1666666666666667}]
[]
[]
[]
["Term2",null,{"$f":"C72*C81","v":1.7922403865040817E-6}]
[]
[]
[]
[]
[]
["Squared root Term2",null,{"$f":"SQRT(C85)","v":1.3387458259520668E-3}]
[]
[]
["NOTE: the pvalue for the t-statistic is calculated as: 2*alpha, where 1-alpha is desired confidence, so if 99% confidence is desired then alpha=0.01 and 2*alpha=2*(0.01)"]
[]
[]
["t-statistic","= quantile t-distribution with df degrees of freedom at .99 confidence level =",{"$f":"TINV(2*0.01,C53)","v":3.3649299989072183}]
[]
[]
["UPL  POOLED VARIANCE = ",null,{"$f":"C67+C97*C91","v":5.801973607517912E-3},{"$f":"IFERROR(IF(FIND(\"MM\",A$1,1)>0,\"lb/MMBtu\",\"lb/MW\"),\"lb/MW\")","v":"lb/MW"},{"$f":"C100*1000","v":5.8019736075179118},"lb/GWhr"]
[]
[]
[]
[null,"Normal UPL",{"$f":"'UPL Pooled Template '!F107","v":5.8019736054336964E-3},"lb/MW"]
[null,"Lognormal UPL",{"$f":"'Lognormal Template'!D165","v":1.1719882176499559E-2},"lb/MW"]
[]
[null,"Final UPL",{"$f":"C105","v":1.1719882176499559E-2},"lb/MW"]

{"sheet":"UPL Pooled Template ","index":6,"n_rows":107,"n_cols":12,"rows_kept":107,"cut":false,"hidden":false,"merged":[[0,1,0,11],[37,0,37,3]]}
[{"$f":"'UPL Normal'!B1","v":"HCl"},"Emissions (lb/MW)"]
["Averages","10043\nLogan\nUnit1"]
[1,1.1873905735104945E-4]
[2,{"$f":"'UPL Normal'!B6","v":6.8387832993546552E-4}]
[3,{"$f":"'UPL Normal'!B7","v":6.8924692669055895E-4}]
[4,{"$f":"'UPL Normal'!B8","v":1.0367991870074685E-3}]
[5,{"$f":"'UPL Normal'!B9","v":1.6421636944446668E-3}]
[6,{"$f":"'UPL Normal'!B10","v":3.6122985057306756E-3}]
[7]
[8]
[9]
[10]
[11]
[12]
[13]
[14]
[15]
[16]
[17]
[18]
[19]
[20]
[21]
[22]
[23]
[24]
[25]
[26]
[27]
[28]
[29]
[30]
[31]
[32]
[33]
[34]
[35]
["Use for large sample sets and small sample sets that are Normal."]
[]
["Testing Normality","Raw Data"]
["Sample Size",{"$f":"COUNT(B3:L37)","v":6}]
["Kurtosis",{"$f":"KURT(B3:L37)","v":2.931026325548034}]
["SE Kurtosis",{"$f":"SQRT((B41^2-1)/((B41-3)*(B41+5)))","v":1.0298573010888745}]
["Result Kurtosis",{"$f":"IF(ABS(B42/B43)>NORMSINV(1-0.05/2),\"non normal\",\"normal\")","v":"non normal"}]
["Skewness",{"$f":"SKEW(B3:L37)","v":1.6291498586989204}]
["SE Skewness",{"$f":"SQRT((6*B41*(B41-1))/((B41-2)*(B41+1)*(B41+3)))","v":0.84515425472851657}]
["Result Skewness",{"$f":"IF(ABS(B45/B46)>NORMSINV(1-0.05/2),\"non normal\",\"normal\")","v":"normal"}]
[]
[]
["ni = number test Averages =",{"$f":"COUNT(B3:B37)","v":6},0,0,0,0,0,0,0,0,0,0]
[]
["Total Number of sources =",{"$f":"COUNTA(B2:L2)","v":1}]
[]
[]
["n =Total # test Averages =",{"$f":"SUM(B50:L50)","v":6}]
[]
[]
[]
[]
[null,{"$f":"B55-1","v":5}]
[]
[]
[]
[]
["This step is for QC only:"]
[]
["means",{"$f":"AVERAGE(B3:B37)","v":1.2971876168599808E-3},{"$error":"#DIV/0!"},{"$error":"#DIV/0!"},{"$error":"#DIV/0!"},{"$error":"#DIV/0!"},{"$error":"#DIV/0!"},{"$error":"#DIV/0!"},{"$error":"#DIV/0!"},{"$error":"#DIV/0!"},{"$error":"#DIV/0!"},{"$error":"#DIV/0!"}]
[]
[]
[]
[]
[]
[]
[null,{"$f":"AVERAGE(B3:L37)","v":1.2971876168599808E-3}]
["Mean ="]
[]
[]
[]
["Pooled Variance = ",null,null,{"$f":"VAR(B3:L37)","v":1.536206045574927E-6}]
[]
[]
[]
[]
[]
["m= number future Averages =",{"$f":"'UPL Normal'!C78","v":1}]
[]
[]
["Term1",{"$f":"1/B55+1/B85","v":1.1666666666666667}]
[]
[]
[]
["Term2",{"$f":"D79*B88","v":1.7922403865040817E-6}]
[]
[]
[]
[]
[]
["Squared root Term2",null,{"$f":"SQRT(B92)","v":1.3387458259520668E-3}]
[]
[]
["NOTE: the pvalue for the t-statistic is calculated as: 2*alpha, where 1-alpha is desired confidence, so if 99% confidence is desired then alpha=0.01 and 2*alpha=2*(0.01)"]
[]
[]
["t-statistic","= quantile t-distribution with df degrees of freedom at .99 confidence level =",null,null,null,null,null,{"$f":"TINV(2*0.01,B60)","v":3.3649299973503766}]
[]
[]
["UPL  POOLED VARIANCE = ",null,null,null,null,{"$f":"B74+H104*C98","v":5.8019736054336964E-3}]