{"text_format":"1","workbook":"xlsx","n_sheets":7,"sheets":["HCl_Min_Tests","HCl_Variability","Lognormal Template","lognormal distribution 99 %","HCl_QA_Calcs","UPL Normal","UPL Pooled Template "],"not_rendered":{"charts":1,"images":31,"macros":0,"external_links":0,"defined_names":20,"comments":4,"pivot_tables":0},"unopened":[],"bounds":{"document_bytes":16777216,"sheet_cells":100000,"rows_first":2000,"rows_last":500,"rows_between":2000,"halvings":0,"cell_chars":16384,"cell_head_chars":4096},"cells_cut":0,"cells_raw":0,"read":"whole","date_system":"1900"}

{"sheet":"HCl_Min_Tests","index":0,"n_rows":342,"n_cols":96,"rows_kept":342,"cut":false,"hidden":false,"merged":[]}
[{"$f":"E1&\"_\"&I1","v":"ORIS code_boiler_id"},"primary_fuel","HCl_Min_lb_per_MWh_Rank","Reason_for_Removal","ORIS code","Plant Name","State","Unit Number","boiler_id","Unit Type","boiler_type","MWe_capacity","max_heat_input","Unit_heat_rate","Fuel types","fuel","Fuel_Cl_lb/MMBtu","Fuel_F_lb/MMBtu","Chlorine - ERT","Chlorine MW - ERT","Chlorine - ETTS","Chlorine MW - ETTS","Chlorine - Part II","Chlorine MW - Part II","Chlorine - min","Chlorine MW - min","HCN - ERT","HCN MW - ERT","HCN - ETTS","HCN MW - ETTS","HCN - Part II","HCN MW - Part II","HCN - min","HCN MW - min","Hydrogen Chloride - ERT (lb/MMBtu)","Hydrogen Chloride MW - ERT (lb/MWh)","Hydrogen Chloride - ETTS (lb/MMBtu)","Hydrogen Chloride (lb/MWh) ETTS","Hydrogen Chloride - Part II (lb/MMBtu)","Hydrogen Chloride MW - Part II (lb/MWh)","Hydrogen Chloride - min (lb/MMBtu)","Hydrogen Chloride MW - min (lb/MWh)","Hydrogen Fluoride - ERT","Hydrogen Fluoride MW - ERT","Hydrogen Fluoride - ETTS","Hydrogen Fluoride MW - ETTS","Hydrogen Fluoride - Part II","Hydrogen Fluoride MW - Part II","Hydrogen Fluoride - min","Hydrogen Fluoride MW - min","Sulfur Dioxide - CEMS","Sulfur Dioxide MW - CEMS","Sulfur Dioxide - ERT","Sulfur Dioxide MW - ERT","Sulfur Dioxide - ETTS","Sulfur Dioxide MW - ETTS","Sulfur Dioxide - Part II","Sulfur Dioxide MW - Part II","Sulfur Dioxide - min","Sulfur Dioxide MW - min","control_group_1","control_type_1","install_date_1","control_group_2","control_type_2","install_date_2","control_group_3","control_type_3","install_date_3","control_group_4","control_type_4","install_date_4","control_group_5","control_type_5","install_date_5","control_group_6","control_type_6","install_date_6","control_group_7","control_type_7","install_date_7","control_group_8","control_type_8","install_date_8","control_group_9","control_type_9","install_date_9","control_group_10","control_type_10","install_date_10","control_group_11","control_type_11","install_date_11","control_group_12","control_type_12","install_date_12"]
["10043_B01","coal",1,null,10043,"Logan Generating Plant","NJ","Unit1","B01","Conventional Boiler","Wall firing - opposed firing",241.7,2116,8.7546545304095993,"bituminous","bituminous",8.3600141955312082E-2,4.0859762134706802E-3,null,null,null,null,null,null,null,null,null,null,2.4666666666666666E-6,2.1594814508343679E-5,null,null,2.4666666666666666E-6,2.1594814508343679E-5,1.2872827435455452E-5,1.1269715702699106E-4,null,null,7.8076156813452146E-5,6.8352977996385912E-4,{"$f":"AVERAGE(HCl_QA_Calcs!AT28:AT30)","v":1.3635479081195558E-5},{"$f":"AVERAGE(HCl_QA_Calcs!AV28:AV30)","v":1.19373908712494E-4},8.3606002829973271E-6,7.3194167144486326E-5,null,null,6.7369783626588435E-6,5.8979918143922692E-5,6.7369783626588435E-6,5.8979918143922692E-5,null,null,9.0995908666725925E-2,0.79663774405789023,null,null,0.10625,0.93018204385601988,9.0995908666725925E-2,0.79663774405789023,"NOx control","Selective Catalytic Reduction","1994-09-01","SO2 control","Dry FGD - Spray Dryer","1994-09-01","PM control","Fabric Filter, reverse air","1994-09-01","","",null,"","",null,"","",null,"","",null,"","",null,"","",null,"","",null,"","",null,"",""]
["3130_1","coal",2,null,3130,"Seward","PA","SEW-1","1","Fluidized bed firing","Fluidized bed firing",292.5,3100,10.598290598290598,"coal refuse (culm or gob)","coal refuse (culm or gob)",3.3530032143849454E-2,2.7762918225458077E-2,null,null,null,null,null,null,null,null,null,null,1.2193333333333333E-4,1.2922849002849003E-3,null,null,1.2193333333333333E-4,1.2922849002849003E-3,1.4741923934699305E-4,1.5623919383783878E-3,null,null,1.9266666666666666E-5,2.0419373219373219E-4,1.9266666666666666E-5,2.0419373219373219E-4,1.0263154519556084E-4,1.0877189405341491E-3,null,null,5.6866666666666667E-6,6.0268945868945871E-5,5.6866666666666667E-6,6.0268945868945871E-5,null,null,0.33537253472545636,3.5543755817056915,null,null,null,null,0.33537253472545636,3.5543755817056915,"NOx control","Selective Noncatalytic Reduction","2004-03-01","PM control","Fabric Filter, pulse","2004-03-01","","",null,"","",null,"","",null,"","",null,"","",null,"","",null,"","",null,"","",null,"","",null,"",""]
["3130_2","coal",3,null,3130,"Seward","PA","SEW-1","2","Fluidized bed firing","Fluidized bed firing",292.5,3100,10.598290598290598,"coal refuse (culm or gob)","coal refuse (culm or gob)",3.3530032143849454E-2,2.7762918225458077E-2,null,null,null,null,null,null,null,null,null,null,1.2193333333333333E-4,1.2922849002849003E-3,null,null,1.2193333333333333E-4,1.2922849002849003E-3,1.4741923934699305E-4,1.5623919383783878E-3,null,null,1.9266666666666666E-5,2.0419373219373219E-4,1.9266666666666666E-5,2.0419373219373219E-4,1.0263154519556084E-4,1.0877189405341491E-3,null,null,5.6866666666666667E-6,6.0268945868945871E-5,5.6866666666666667E-6,6.0268945868945871E-5,null,null,0.33537253472545636,3.5543755817056915,null,null,null,null,0.33537253472545636,3.5543755817056915,"NOx control","Selective Noncatalytic Reduction","2004-03-01","PM control","Fabric Filter, pulse","2004-03-01","","",null,"","",null,"","",null,"","",null,"","",null,"","",null,"","",null,"","",null,"","",null,"",""]
["54081_3A","coal",4,null,54081,"Spruance Genco, LLC","VA","GEN3","3A","Conventional Boiler","Stoker - underfeed",28.7,375,13.066202090592334,"bituminous","bituminous",9.1094017434645069E-2,4.0189496915779988E-3,null,null,null,null,null,null,null,null,null,null,1.6190731328433334E-5,2.1155136753179442E-4,null,null,1.6190731328433334E-5,2.1155136753179442E-4,1.61175568615607E-5,2.1059525515976525E-4,null,null,null,null,1.61175568615607E-5,2.1059525515976525E-4,1.7660200256702297E-5,2.3075174551440283E-4,null,null,null,null,1.7660200256702297E-5,2.3075174551440283E-4,2.2700000000000008E-2,0.29660278745644608,6.5271065175803791E-2,0.85284492825527602,null,null,2.5246942176443497E-2,0.32988164864690978,2.2700000000000008E-2,0.29660278745644608,"SO2 control","Dry FGD - Spray Dryer","1992-05-01","SO2 control","Dry FGD - Spray Dryer","1992-05-01","PM control","Fabric Filter, pulse","1992-05-01","PM control","Fabric Filter, pulse","1992-05-01","","",null,"","",null,"","",null,"","",null,"","",null,"","",null,"","",null,"",""]
["54081_3B","coal",5,null,54081,"Spruance Genco, LLC","VA","GEN3","3B","Conventional Boiler","Stoker - underfeed",28.7,375,13.066202090592334,"bituminous","bituminous",9.1094017434645069E-2,4.0189496915779988E-3,null,null,null,null,null,null,null,null,null,null,1.6190731328433334E-5,2.1155136753179442E-4,null,null,1.6190731328433334E-5,2.1155136753179442E-4,1.61175568615607E-5,2.1059525515976525E-4,null,null,null,null,1.61175568615607E-5,2.1059525515976525E-4,1.7660200256702297E-5,2.3075174551440283E-4,null,null,null,null,1.7660200256702297E-5,2.3075174551440283E-4,2.2700000000000008E-2,0.29660278745644608,6.5271065175803791E-2,0.85284492825527602,null,null,2.5246942176443497E-2,0.32988164864690978,2.2700000000000008E-2,0.29660278745644608,"SO2 control","Dry FGD - Spray Dryer","1992-05-01","SO2 control","Dry FGD - Spray Dryer","1992-05-01","PM control","Fabric Filter, pulse","1992-05-01","PM control","Fabric Filter, pulse","1992-05-01","","",null,"","",null,"","",null,"","",null,"","",null,"","",null,"","",null,"",""]
["54081_2A","coal",6,null,54081,"Spruance Genco, LLC","VA","GEN2","2A","Conventional Boiler","Stoker - underfeed",28.7,375,13.066202090592334,"bituminous","bituminous",8.5779456368863707E-2,5.9170479426858642E-3,null,null,null,null,null,null,null,null,null,null,2.8317405026333334E-6,3.7000093675522646E-5,null,null,2.8317405026333334E-6,3.7000093675522646E-5,1.6932996545912427E-5,2.2124995486819373E-4,null,null,null,null,1.6932996545912427E-5,2.2124995486819373E-4,1.5312389030036015E-4,2.000747695562197E-3,null,null,null,null,1.5312389030036015E-4,2.000747695562197E-3,2.410000000000001E-2,0.31489547038327537,6.5675669546852847E-2,0.85813157073413993,null,null,null,null,2.410000000000001E-2,0.31489547038327537,"SO2 control","Dry FGD - Spray Dryer","1992-05-01","SO2 control","Dry FGD - Spray Dryer","1992-05-01","PM control","Fabric Filter, pulse","1992-05-01","PM control","Fabric Filter, pulse","1992-05-01","","",null,"","",null,"","",null,"","",null,"","",null,"","",null,"","",null,"",""]
["54081_2B","coal",7,null,54081,"Spruance Genco, LLC","VA","GEN2","2B","Conventional Boiler","Stoker - underfeed",28.7,375,13.066202090592334,"bituminous","bituminous",8.5779456368863707E-2,5.9170479426858642E-3,null,null,null,null,null,null,null,null,null,null,2.8317405026333334E-6,3.7000093675522646E-5,null,null,2.8317405026333334E-6,3.7000093675522646E-5,1.6932996545912427E-5,2.2124995486819373E-4,null,null,null,null,1.6932996545912427E-5,2.2124995486819373E-4,1.5312389030036015E-4,2.000747695562197E-3,null,null,null,null,1.5312389030036015E-4,2.000747695562197E-3,2.410000000000001E-2,0.31489547038327537,6.5675669546852847E-2,0.85813157073413993,null,null,null,null,2.410000000000001E-2,0.31489547038327537,"SO2 control","Dry FGD - Spray Dryer","1992-05-01","SO2 control","Dry FGD - Spray Dryer","1992-05-01","PM control","Fabric Filter, pulse","1992-05-01","PM control","Fabric Filter, pulse","1992-05-01","","",null,"","",null,"","",null,"","",null,"","",null,"","",null,"","",null,"",""]
["52071_5A","coal",8,null,52071,"Sandow Station","TX","5A","5A","Fluidized bed firing","Fluidized bed firing",282.35000000000002,2960,10.483442535859748,"lignite","lignite",null,null,null,null,null,null,null,null,null,null,null,null,2.6596666666666669E-5,2.7882462664541644E-4,null,null,2.6596666666666669E-5,2.7882462664541644E-4,9.2435416955243219E-5,9.690413819285281E-4,null,null,2.1185903639433637E-5,2.2210120337426442E-4,2.1185903639433637E-5,2.2210120337426442E-4,9.4701052907068646E-5,9.9279304623666777E-4,null,null,2.2410026789463284E-5,2.3493422807441586E-4,2.2410026789463284E-5,2.3493422807441586E-4,null,null,1.1155325630951158E-2,0.11694621522087985,null,null,2.5666666666666667E-2,0.26907502508706688,1.1155325630951158E-2,0.11694621522087985,"NOx control","Selective Noncatalytic Reduction","2009-08-01","Other control","Activated carbon injection","2009-08-01","SO2 control","Dry FGD - Circulating Dry Scrubber","2009-08-01","PM control","Fabric Filter, pulse","2009-08-01","","",null,"","",null,"","",null,"","",null,"","",null,"","",null,"","",null,"",""]
["108_SGU1","coal",9,null,108,"HOLCOMB","KS","SGU1","SGU1","Conventional Boiler","Wall firing - opposed firing",387,3389,8.7571059431524549,"","subbituminous",null,null,null,null,null,null,null,null,null,null,null,null,null,null,9.9999999999999995E-7,8.7571059431524554E-6,9.9999999999999995E-7,8.7571059431524554E-6,null,null,null,null,2.5999999999999998E-5,2.2768475452196381E-4,2.5999999999999998E-5,2.2768475452196381E-4,null,null,null,null,2.8E-5,2.4519896640826875E-4,2.8E-5,2.4519896640826875E-4,null,null,null,null,null,null,null,null,null,null,"SO2 control","Dry FGD - Spray Dryer","1983-08-01","PM control","Fabric Filter, reverse air","1983-08-01","","",null,"","",null,"","",null,"","",null,"","",null,"","",null,"","",null,"","",null,"","",null,"",""]
{"$rows_left_out":333}
{"sheet":"HCl_Variability","index":1,"n_rows":345,"n_cols":15,"rows_kept":345,"cut":false,"hidden":false,"merged":[]}
["facility_name","facility_id","boiler_id","configuration_id","compound","Final_EF","Final_EF_Units","Final_Output_EF","Final_Output_EF_Units","From","Report_id","HCl_Min_lb_per_MWh_Rank","New Souce MACT Floor Test_ID","New Source MACT Floor QA Calc","New Source Floor Agreement of QA Calc"]
[{"$f":"VLOOKUP(B2&\"_\"&C2,HCl_Min_Tests!A:BV,6,FALSE)","v":"Logan Generating Plant"},10043,"B01","Unit1","Hydrogen Chloride",1.2872827435455452E-5,"lb/MMBtu",1.1269715702699106E-4,"lb/MW","ERT",null,1,"1_HCl_T1",1.19373908712494E-4,{"$f":"N2/H2","v":1.0592450764654504}]
[{"$f":"VLOOKUP(B3&\"_\"&C3,HCl_Min_Tests!A:BV,6,FALSE)","v":"Logan Generating Plant"},10043,"B01","Unit1","Hydrogen Chloride",7.8076156813452146E-5,"lb/MMBtu",6.8352977996385912E-4,"lb/MW","Part II","2009 Annual Stack Test 3",1,"1_HCl_T6",6.8387832993546552E-4,1.0005099265340347]
[{"$f":"VLOOKUP(B4&\"_\"&C4,HCl_Min_Tests!A:BV,6,FALSE)","v":"Logan Generating Plant"},10043,"B01","Unit1","Hydrogen Chloride",7.8689071982380551E-5,"lb/MMBtu",6.8889564052427492E-4,"lb/MW","Part II","2006 Annual Stack Test 2",1,"1_HCl_T3",6.8924692669055895E-4,1.0005099265340345]
[{"$f":"VLOOKUP(B5&\"_\"&C5,HCl_Min_Tests!A:BV,6,FALSE)","v":"Logan Generating Plant"},10043,"B01","Unit1","Hydrogen Chloride",1.1840195694060023E-4,"lb/MMBtu",1.036568228739388E-3,"lb/MW","Part II","2005 Annual Stack Test 6",1,"1_HCl_T2",1.0367991870074685E-3,1.0002228104833595]
[{"$f":"VLOOKUP(B6&\"_\"&C6,HCl_Min_Tests!A:BV,6,FALSE)","v":"Logan Generating Plant"},10043,"B01","Unit1","Hydrogen Chloride",1.8748046912514158E-4,"lb/MMBtu",1.6413267383897378E-3,"lb/MW","Part II","2007 Annual Stack Test 3",1,"1_HCl_T4",1.6421636944446668E-3,1.0005099265340367]
[{"$f":"VLOOKUP(B7&\"_\"&C7,HCl_Min_Tests!A:BV,6,FALSE)","v":"Logan Generating Plant"},10043,"B01","Unit1","Hydrogen Chloride",4.1240433019282984E-4,"lb/MMBtu",3.610457437683194E-3,"lb/MW","Part II","2008 Annual Stack Test 3",1,"1_HCl_T5",3.6122985057306756E-3,1.0005099265340358]
[{"$f":"VLOOKUP(B8&\"_\"&C8,HCl_Min_Tests!A:BV,6,FALSE)","v":"Seward"},3130,"1","SEW-1","Hydrogen Chloride",1.9266666666666666E-5,"lb/MMBtu",2.0419373219373219E-4,"lb/MW","Part II","SE111",2]
[{"$f":"VLOOKUP(B9&\"_\"&C9,HCl_Min_Tests!A:BV,6,FALSE)","v":"Seward"},3130,"1","SEW-1","Hydrogen Chloride",1.4741923934699305E-4,"lb/MMBtu",1.5623919383783878E-3,"lb/MW","ERT","",2]
[{"$f":"VLOOKUP(B10&\"_\"&C10,HCl_Min_Tests!A:BV,6,FALSE)","v":"Seward"},3130,"2","SEW-1","Hydrogen Chloride",1.9266666666666666E-5,"lb/MMBtu",2.0419373219373219E-4,"lb/MW","Part II","SE111",3]
{"$rows_left_out":336}
{"sheet":"Lognormal Template","index":2,"n_rows":172,"n_cols":13,"rows_kept":172,"cut":false,"hidden":false,"merged":[[116,0,116,2],[0,1,0,11],[37,0,37,3],[48,1,48,11],[86,0,86,1],[113,0,113,2],[127,0,127,3],[132,0,132,8],[133,0,133,4],[135,0,135,8],[137,0,137,2]]}
[null,"Emissions (lb/MW)"]
[{"$f":"'UPL Pooled Template '!A1","v":"HCl"},"10043\nLogan\nUnit1",null,null,null,null,null,null,null,null,null,null,"Outliers Removed"]
[1,{"$f":"'UPL Normal'!B5","v":1.1873905735104945E-4}]
[2,6.8352977996385912E-4]
[3,6.8889564052427492E-4]
[4,1.036568228739388E-3]
[5,1.6413267383897378E-3]
[6,3.610457437683194E-3]
[7]
[8]
{"$rows_left_out":163}
{"sheet":"lognormal distribution 99 %","index":3,"n_rows":110,"n_cols":33,"rows_kept":110,"cut":false,"hidden":false,"merged":[]}
[]
[null,null,null,null,null,null,null,null,null,null,null,null,null,null,null,"distribution of Z"]
[null,null,null,null,null,null,null,null,null,null,null,null,null,"Normal "]
[null,null,null,null,null,null,null,null,null,null,null,null,null,"distribution"]
["∆z","z",null,null,null,null,null,null,null,null,null,null,null,null,null,null,null,null,null,null,null,"Absolute values"]
[null,null,null,null,null,null,null,null,null,null,null,null,null,null,null,null,null,null,null,null,null,null,null,null,null,null,null,null,null,"Cumulative","normalization"]
[0.10100000000000001,null,null,{"$f":"'Lognormal Template'!C121","v":44.742727370615896},null,{"$f":"'Lognormal Template'!F125","v":9.3338492254951362}]
[]
[null,-5,"=f(a)",null,null,null,{"$f":"(1-($F$7/6)*(3*B9-B9^3)+(($D$7-3)*(3-6*B9^2+B9^4))/24)","v":661.25541766402239},null,null,null,null,null,null,{"$f":"NORMDIST(B9,0,1,FALSE)","v":1.4867195147342977E-6},null,{"$f":"G9*N9","v":9.8310133366488078E-4},null,null,null,null,null,{"$f":"ABS(P9)","v":9.8310133366488078E-4},null,null,{"$f":"($A$7/2)*V9","v":4.9646617350076481E-5},null,null,null,null,{"$f":"Y9","v":4.9646617350076481E-5},{"$f":"AD9/SUM($Y$9:$Y$108)","v":9.0044462371378314E-6},{"$f":"IF(AE9>0.99,\"x\",\"\")","v":""},9]
[1,{"$f":"$B$9+A10*$A$7","v":-4.899},null,null,null,null,597.55723908341542,null,null,null,null,null,null,2.4509397556839956E-6,null,1.4645767935663092E-3,null,null,null,null,null,1.4645767935663092E-3,null,null,{"$f":"($A$7)*V10","v":1.4792225615019723E-4},null,null,null,null,{"$f":"Y10+AD9","v":1.975688735002737E-4},3.5833222775697514E-5,{"$f":"IF(AE10>0.99,\"x\",\"\")","v":""},10]
{"$rows_left_out":101}
{"sheet":"HCl_QA_Calcs","index":4,"n_rows":207,"n_cols":101,"rows_kept":207,"cut":false,"hidden":false,"merged":[[8,6,8,18],[8,20,8,26],[8,28,8,36],[8,37,8,44],[8,0,8,4]]}
[null,null,null,null,null,null,null,null,"Anthracite",null,null,null,null,"fPM","30B",null,"μg/dscm","No",null,"μg/dscm",{"$f":"1/453592370","v":2.2046226218487758E-9},"lbs/μg",2.8316846592000001E-2,null,null,null,"cm/cf",null,null,null,null,null,"lb/hr",null,null,"lb/MMBtu",null,null,null,null,null,null,"Round to",null,null,null,"From ",null,"original database export===>"]
[null,null,null,null,null,null,null,null,"Bituminous",null,null,null,null,"Se","M5",null,"lb/dscf","Yes",null,"ppm",{"$f":"U1/1000","v":2.2046226218487757E-12},"lb/mg",null,null,null,null,null,null,null,null,null,null,"lb/MMBtu",null,null,null,null,null,null,null,null,null,"Same ",null,null,null,"Min ",null,"original database export===>"]
[null,null,null,null,null,null,null,null,"Lignite",null,null,null,null,"Pb","M5B",null,"ppmvd",null,null,null,null,"lb/scf",null,null,null,null,null,null,null,null,null,null,null,null,null,null,null,null,null,null,null,null,"Sig Figs ",null,null,null,"Test",null,"original database export===>"]
[null,null,null,null,null,null,null,null,"Oil",null,null,null,null,"Hg","M29",null,"ppmvd @ 3% O2",null,null,null,null,"(lb/dscf)/ppmvd",null,null,null,null,null,null,null,null,null,null,null,null,null,null,null,null,null,null,null,null,"as Submitted",null,null,null,"Sheet",null,"original database export===>"]
[null,null,null,null,null,null,null,null,"Pet Coke",null,null,null,null,"HCl","OTM27",null,"ppmvd @ 7% O2",null,null,null,null,null,null,null,null,null,null,null,null,null,null,null,null,null,null,null,null,null,null,null,null,null,"prior to ",null,null,null,null,null,"original database export===>"]
[null,null,null,null,null,null,null,null,"Subbituminous",null,null,null,null,"SO2","26A",null,null,null,null,null,null,null,null,null,null,null,null,null,null,null,null,null,null,null,null,null,null,null,null,null,null,null,"Calc % Diff.",null,null,null,null,null,"original database export===>"]
[null,null,null,null,null,null,null,null,null,null,null,null,null,null,"M6C",null,null,null,null,null,null,null,null,null,null,null,null,null,null,null,null,null,null,null,null,null,null,null,null,null,null,null,null,null,null,null,null,null,"original database export===>"]
[null,null,null,null,null,null,null,null,null,null,null,null,null,null,null,null,null,null,null,null,null,null,null,null,null,null,null,null,null,null,null,null,null,null,null,null,null,null,null,null,null,null,null,null,null,null,null,null,"original database export===>"]
["RTI",null,null,null,null,null,"As Submitted",null,null,null,null,null,null,null,null,null,null,null,null,null,"RTI-QA",null,null,null,null,null,null,null,"As Submitted",null,null,null,null,null,null,null,null,"RTI-QA",null,null,null,null,null,null,null,"Final for UPL",null,"Final for UPL","original database export===>"]
["Comments",null,"Use Run in UPL Calc?","Grade","Key","Facility_Name","Facility_ID","Boiler_ID","Fuel1 Used","Fuel1 Fraction","Fuel2 Used","Fuel2 Fraction","\"Fuel Used/Fraction\" Data Source","Pollutant","Reference Method","Concentration","Concentration UOM","Non-Detect?","MDL","MDL UOM","HAP Conversion Value to lbs","HAP Conversion UOM","Reserved","Reserve","Reserve","Reserve","Volume Conversion UOM","Submitted F Factor","Bws (percent)","%O2d","%CO2d","Emission Rate Value","Emission Rate UOM","Emission Rate MDL","Emission Factor Value","Emission Factor UOM","Emission Factor MDL","Fd","Fw","Fc","Calculated conc lb/dscf","19-1\nlb/MMBtu","%diff\n19-1","19-6\nlb/MMBtu","%diff\n19-6","lb/MMBtu Value Used for UPL Calcs","Unit Heat Rate (MMBtu/MWh)","lb/MWh Value Used in UPL Calcs","original database export===>","Key","RTI Calculated QA\nlb/MMBtu","Run Grade","Submitted Value","Submitted Value UOM","Use ?","Comment","facility_id","configuration_id","report_id","sampling_port_id","order","pollutant_id","pollutant_name","run_id","start_datetime","end_datetime","unit_load","fuel_flow_rate","fuel_heating_value","fg_moisture_content","fg_oxygen_content","fg_CO2_content","fg_temperature","test_method","conc","conc_units","conc_ND","conc_MDL","conc2","conc2_units","emission_rate","emission_rate_units","emission_rate_ND","emission_rate_MDL","Calculated conc lb/dscf","19-1\nlb/MMBtu","%diff","19-6\nlb/MMBtu","%diff","emission_factor","emission_factor_units","emission_factor_ND","emission_factor_MDL","run_pollutant_comment","Fuel1","Fuel1%Btu","Fuel2","Fuel2%Btu","QA Comment","Questions for EPA","Average of Test Runs"]
{"$rows_left_out":198}
{"sheet":"UPL Normal","index":5,"n_rows":107,"n_cols":6,"rows_kept":107,"cut":false,"hidden":false,"merged":[[47,16,48,16]]}
["Emissions (lb/MW)","HCl"]
[null,10043]
["ORIS/Facility/Unit","Logan"]
["Averages","Unit1"]
[1,1.1873905735104945E-4]
[2,6.8387832993546552E-4]
[3,6.8924692669055895E-4]
[4,1.0367991870074685E-3]
[5,1.6421636944446668E-3]
[6,3.6122985057306756E-3]
{"$rows_left_out":98}
{"sheet":"UPL Pooled Template ","index":6,"n_rows":107,"n_cols":12,"rows_kept":107,"cut":false,"hidden":false,"merged":[[0,1,0,11],[37,0,37,3]]}
[{"$f":"'UPL Normal'!B1","v":"HCl"},"Emissions (lb/MW)"]
["Averages","10043\nLogan\nUnit1"]
[1,1.1873905735104945E-4]
[2,{"$f":"'UPL Normal'!B6","v":6.8387832993546552E-4}]
[3,{"$f":"'UPL Normal'!B7","v":6.8924692669055895E-4}]
[4,{"$f":"'UPL Normal'!B8","v":1.0367991870074685E-3}]
[5,{"$f":"'UPL Normal'!B9","v":1.6421636944446668E-3}]
[6,{"$f":"'UPL Normal'!B10","v":3.6122985057306756E-3}]
[7]
[8]
{"$rows_left_out":97}