{"text_format":"1","workbook":"xlsx","n_sheets":23,"sheets":["Lists","Welcome","Company_Information","Compliance_Options","Notification_of_Compliance","NOCS_Addon_Control","NOCS_Certification","Semiannual_Report","Deviation_Compliant_Coating","Deviation_Without_Addon","Deviation_w_Addon_Malfunction","Deviation_w_Addon_EmLimits","Deviation_w_Addon_CPMS1","Deviation_w_Addon_CPMS2","Deviation_w_Addon_CPMSSummary","Deviation_w_Addon_OpLimit","Deviation_w_Addon_OpLimSummary","Deviation_w_Addon_WorkPrac","Deviation_Equiv_ER","Description_of_Changes","Number_of_Deviations","Semiannual_Certification","Revisions"],"not_rendered":{"charts":0,"images":1,"macros":1,"external_links":0,"defined_names":16,"comments":0,"pivot_tables":0},"unopened":[],"bounds":{"document_bytes":16777216,"sheet_cells":100000,"rows_first":2000,"rows_last":500,"rows_between":2000,"halvings":0,"cell_chars":16384,"cell_head_chars":4096},"cells_cut":0,"cells_raw":0,"read":"whole","date_system":"1900"}

{"sheet":"Lists","index":0,"n_rows":501,"n_cols":31,"rows_kept":501,"cut":false,"hidden":true,"merged":[]}
["Rank","Company Name","Company List","Column1",null,"Rank","Operation Name","Operation List","Column1",null,"Rank","CPMS Name","CPMS List","Column1",null,null,null,"Column5","Column1","Column2","Column22","Column3","Column4","Column42","Column43","Column44","Company ID","Process Name","Column6",null,"State"]
[{"$f":"+IF(D2=\"\",\"\",MAX(A1:A$1)+1)","v":""},{"$f":"IF(Company_Information!A24=\"\",\"\",Company_Information!A24)","v":""},{"$f":"+IFERROR(INDEX($B$2:$B$101,MATCH(ROW()-ROW($C$1),$A$2:$A$101,0)),\"\")","v":""},{"$f":"IF(COUNTIF(B$2:B2,B2)=1,B2,\"\")","v":""},null,{"$f":"+IF(I2=\"\",\"\",MAX(F1:F$1)+1)","v":""},{"$f":"IF(Compliance_Options!B24=\"\",\"\",Compliance_Options!B24)","v":""},{"$f":"+IFERROR(INDEX($G$2:$G$191,MATCH(ROW()-ROW($H$1),$F$2:$F$191,0)),\"\")","v":""},{"$f":"IF(COUNTIF(G$2:G2,G2)=1,G2,\"\")","v":""},null,{"$f":"+IF(N2=\"\",\"\",MAX(K1:K$1)+1)","v":""},{"$f":"IF(Deviation_w_Addon_CPMS1!C24=\"\",\"\",Deviation_w_Addon_CPMS1!C24)","v":""},{"$f":"+IFERROR(INDEX($L$2:$L$501,MATCH(ROW()-ROW($M$1),$K$2:$K$501,0)),\"\")","v":""},{"$f":"IF(COUNTIF(L$2:L2,L2)=1,L2,\"\")","v":""},null,"WebCoatingandPrinting",null,{"$f":"+IF(W2=\"\",\"\",MAX(R1:R$1)+1)","v":""},{"$f":"IF(Compliance_Options!A24=\"\",\"\",Compliance_Options!A24)","v":""},{"$f":"IF(Compliance_Options!B24=\"\",\"\",Compliance_Options!B24)","v":""},{"$f":"IF(Compliance_Options!D24=\"\",\"\",Compliance_Options!D24)","v":""},{"$f":"S2&T2&Table29[[#This Row],[Column22]]","v":""},{"$f":"IF(COUNTIF(V$2:V2,V2)=1,V2,\"\")","v":""},{"$f":"IF(R2=\"\",\"\",S2)","v":""},{"$f":"IF(R2=\"\",\"\",T2)","v":""},{"$f":"IF(S2=\"\",\"\",U2)","v":""},{"$f":"IFERROR(INDEX($X$2:$X$78,MATCH(ROW()-ROW($AA$1),$R$2:$R$78,0)),\"\")","v":""},{"$f":"IFERROR(INDEX($Y$2:$Y$78,MATCH(ROW()-ROW($AA$1),$R$2:$R$78,0)),\"\")","v":""},{"$f":"IFERROR(INDEX($Z$2:$Z$78,MATCH(ROW()-ROW($AA$1),$R$2:$R$78,0)),\"\")","v":""},null,"AK"]
[{"$f":"+IF(D3=\"\",\"\",MAX(A$1:A2)+1)","v":""},{"$f":"IF(Company_Information!A25=\"\",\"\",Company_Information!A25)","v":""},"",{"$f":"IF(COUNTIF(B$2:B3,B3)=1,B3,\"\")","v":""},null,{"$f":"+IF(I3=\"\",\"\",MAX(F$1:F2)+1)","v":""},{"$f":"IF(Compliance_Options!B25=\"\",\"\",Compliance_Options!B25)","v":""},{"$f":"+IFERROR(INDEX($G$2:$G$191,MATCH(ROW()-ROW($H$1),$F$2:$F$191,0)),\"\")","v":""},{"$f":"IF(COUNTIF(G$2:G3,G3)=1,G3,\"\")","v":""},null,{"$f":"+IF(N3=\"\",\"\",MAX(K$1:K2)+1)","v":""},{"$f":"IF(Deviation_w_Addon_CPMS1!C25=\"\",\"\",Deviation_w_Addon_CPMS1!C25)","v":""},"",{"$f":"IF(COUNTIF(L$2:L3,L3)=1,L3,\"\")","v":""},null,"Compliant Material 63.4291(a)(1)",null,{"$f":"+IF(W3=\"\",\"\",MAX(R$1:R2)+1)","v":""},{"$f":"IF(Compliance_Options!A25=\"\",\"\",Compliance_Options!A25)","v":""},{"$f":"IF(Compliance_Options!B25=\"\",\"\",Compliance_Options!B25)","v":""},{"$f":"IF(Compliance_Options!D25=\"\",\"\",Compliance_Options!D25)","v":""},{"$f":"S3&T3&Table29[[#This Row],[Column22]]","v":""},{"$f":"IF(COUNTIF(V$2:V3,V3)=1,V3,\"\")","v":""},{"$f":"IF(R3=\"\",\"\",S3)","v":""},{"$f":"IF(R3=\"\",\"\",T3)","v":""},{"$f":"IF(S3=\"\",\"\",U3)","v":""},{"$f":"IFERROR(INDEX($X$2:$X$78,MATCH(ROW()-ROW($AA$1),$R$2:$R$78,0)),\"\")","v":""},{"$f":"IFERROR(INDEX($Y$2:$Y$78,MATCH(ROW()-ROW($AA$1),$R$2:$R$78,0)),\"\")","v":""},"",null,"AL"]
[{"$f":"+IF(D4=\"\",\"\",MAX(A$1:A3)+1)","v":""},{"$f":"IF(Company_Information!A26=\"\",\"\",Company_Information!A26)","v":""},"",{"$f":"IF(COUNTIF(B$2:B4,B4)=1,B4,\"\")","v":""},null,{"$f":"+IF(I4=\"\",\"\",MAX(F$1:F3)+1)","v":""},{"$f":"IF(Compliance_Options!B26=\"\",\"\",Compliance_Options!B26)","v":""},"",{"$f":"IF(COUNTIF(G$2:G4,G4)=1,G4,\"\")","v":""},null,{"$f":"+IF(N4=\"\",\"\",MAX(K$1:K3)+1)","v":""},{"$f":"IF(Deviation_w_Addon_CPMS1!C26=\"\",\"\",Deviation_w_Addon_CPMS1!C26)","v":""},"",{"$f":"IF(COUNTIF(L$2:L4,L4)=1,L4,\"\")","v":""},null,"Emission Rate Without Add-on Controls 63.4291(a)(2)",null,{"$f":"+IF(W4=\"\",\"\",MAX(R$1:R3)+1)","v":""},{"$f":"IF(Compliance_Options!A26=\"\",\"\",Compliance_Options!A26)","v":""},{"$f":"IF(Compliance_Options!B26=\"\",\"\",Compliance_Options!B26)","v":""},{"$f":"IF(Compliance_Options!D26=\"\",\"\",Compliance_Options!D26)","v":""},{"$f":"S4&T4&Table29[[#This Row],[Column22]]","v":""},{"$f":"IF(COUNTIF(V$2:V4,V4)=1,V4,\"\")","v":""},"","","","","","",null,"AR"]
[{"$f":"+IF(D5=\"\",\"\",MAX(A$1:A4)+1)","v":""},{"$f":"IF(Company_Information!A27=\"\",\"\",Company_Information!A27)","v":""},"",{"$f":"IF(COUNTIF(B$2:B5,B5)=1,B5,\"\")","v":""},null,{"$f":"+IF(I5=\"\",\"\",MAX(F$1:F4)+1)","v":""},{"$f":"IF(Compliance_Options!B27=\"\",\"\",Compliance_Options!B27)","v":""},"",{"$f":"IF(COUNTIF(G$2:G5,G5)=1,G5,\"\")","v":""},null,{"$f":"+IF(N5=\"\",\"\",MAX(K$1:K4)+1)","v":""},{"$f":"IF(Deviation_w_Addon_CPMS1!C27=\"\",\"\",Deviation_w_Addon_CPMS1!C27)","v":""},"",{"$f":"IF(COUNTIF(L$2:L5,L5)=1,L5,\"\")","v":""},null,"Emission Rate With Add-on Controls 63.4291(a)(3)",null,{"$f":"+IF(W5=\"\",\"\",MAX(R$1:R4)+1)","v":""},{"$f":"IF(Compliance_Options!A27=\"\",\"\",Compliance_Options!A27)","v":""},{"$f":"IF(Compliance_Options!B27=\"\",\"\",Compliance_Options!B27)","v":""},{"$f":"IF(Compliance_Options!D27=\"\",\"\",Compliance_Options!D27)","v":""},{"$f":"S5&T5&Table29[[#This Row],[Column22]]","v":""},{"$f":"IF(COUNTIF(V$2:V5,V5)=1,V5,\"\")","v":""},"","","","","","",null,"AS"]
[{"$f":"+IF(D6=\"\",\"\",MAX(A$1:A5)+1)","v":""},{"$f":"IF(Company_Information!A28=\"\",\"\",Company_Information!A28)","v":""},"",{"$f":"IF(COUNTIF(B$2:B6,B6)=1,B6,\"\")","v":""},null,{"$f":"+IF(I6=\"\",\"\",MAX(F$1:F5)+1)","v":""},{"$f":"IF(Compliance_Options!B28=\"\",\"\",Compliance_Options!B28)","v":""},"",{"$f":"IF(COUNTIF(G$2:G6,G6)=1,G6,\"\")","v":""},null,{"$f":"+IF(N6=\"\",\"\",MAX(K$1:K5)+1)","v":""},{"$f":"IF(Deviation_w_Addon_CPMS1!C28=\"\",\"\",Deviation_w_Addon_CPMS1!C28)","v":""},"",{"$f":"IF(COUNTIF(L$2:L6,L6)=1,L6,\"\")","v":""},null,"Organic HAP Overall Control Efficiency 63.4291(a)(4)",null,{"$f":"+IF(W6=\"\",\"\",MAX(R$1:R5)+1)","v":""},{"$f":"IF(Compliance_Options!A28=\"\",\"\",Compliance_Options!A28)","v":""},{"$f":"IF(Compliance_Options!B28=\"\",\"\",Compliance_Options!B28)","v":""},{"$f":"IF(Compliance_Options!D28=\"\",\"\",Compliance_Options!D28)","v":""},{"$f":"S6&T6&Table29[[#This Row],[Column22]]","v":""},{"$f":"IF(COUNTIF(V$2:V6,V6)=1,V6,\"\")","v":""},"","","","","","",null,"AZ"]
{"$rows_left_out":496}
{"sheet":"Welcome","index":1,"n_rows":24,"n_cols":2,"rows_kept":24,"cut":false,"hidden":false,"merged":[]}
["DO NOT REMOVE OR EDIT INFORMATION IN THIS SECTION\nFOR INTERNAL USE ONLY"]
["Template Name","63.4310(c) and 63.4311(a) Notification of Compliance and Semiannual Compliance Report (Spreadsheet Template)"]
["CitationID","63.4310(c) and 63.4311(a)"]
["Template Version","v1.00"]
["Last Updated Date",43537]
[null,"OMB Control Number: 2060-0522, Expiration: March 31, 2019"]
{"$rows_left_out":19}
{"sheet":"Company_Information","index":2,"n_rows":33,"n_cols":15,"rows_kept":33,"cut":false,"hidden":false,"merged":[]}
["DO NOT REMOVE OR EDIT INFORMATION IN THIS SECTION FOR INTERNAL USE ONLY"]
["Template Name",{"$f":"+Welcome!B2","v":"63.4310(c) and 63.4311(a) Notification of Compliance and Semiannual Compliance Report (Spreadsheet Template)"}]
["CitationID",{"$f":"+Welcome!B3","v":"63.4310(c) and 63.4311(a)"}]
["Template Version",{"$f":"+Welcome!B4","v":"v1.00"}]
["Last Updated Date",{"$f":"+Welcome!B5","v":43537}]
[{"$f":"+Welcome!B6","v":"OMB Control Number: 2060-0522, Expiration: March 31, 2019"}]
{"$rows_left_out":28}
{"sheet":"Compliance_Options","index":3,"n_rows":15,"n_cols":6,"rows_kept":15,"cut":false,"hidden":false,"merged":[]}
["DO NOT REMOVE OR EDIT INFORMATION IN THIS SECTION\nFOR INTERNAL USE ONLY"]
["Template Name",{"$f":"+Welcome!B2","v":"63.4310(c) and 63.4311(a) Notification of Compliance and Semiannual Compliance Report (Spreadsheet Template)"}]
["CitationID",{"$f":"+Welcome!B3","v":"63.4310(c) and 63.4311(a)"}]
["Template Version",{"$f":"+Welcome!B4","v":"v1.00"}]
["Last Updated Date",{"$f":"+Welcome!B5","v":43537}]
[{"$f":"+Welcome!B6","v":"OMB Control Number: 2060-0522, Expiration: March 31, 2019"}]
{"$rows_left_out":10}
{"sheet":"Notification_of_Compliance","index":4,"n_rows":100,"n_cols":21,"rows_kept":100,"cut":false,"hidden":true,"merged":[]}
["DO NOT REMOVE OR EDIT INFORMATION IN THIS SECTION\nFOR INTERNAL USE ONLY"]
["Template Name",{"$f":"+Welcome!B2","v":"63.4310(c) and 63.4311(a) Notification of Compliance and Semiannual Compliance Report (Spreadsheet Template)"}]
["CitationID",{"$f":"+Welcome!B3","v":"63.4310(c) and 63.4311(a)"}]
["Template Version",{"$f":"+Welcome!B4","v":"v1.00"}]
["Last Updated Date",{"$f":"+Welcome!B5","v":43537}]
[{"$f":"+Welcome!B6","v":"OMB Control Number: 2060-0522, Expiration: March 31, 2019"}]
{"$rows_left_out":95}
{"sheet":"NOCS_Addon_Control","index":5,"n_rows":14,"n_cols":20,"rows_kept":14,"cut":false,"hidden":true,"merged":[]}
["DO NOT REMOVE OR EDIT INFORMATION IN THIS SECTION\nFOR INTERNAL USE ONLY"]
["Template Name",{"$f":"+Welcome!B2","v":"63.4310(c) and 63.4311(a) Notification of Compliance and Semiannual Compliance Report (Spreadsheet Template)"}]
["CitationID",{"$f":"+Welcome!B3","v":"63.4310(c) and 63.4311(a)"}]
["Template Version",{"$f":"+Welcome!B4","v":"v1.00"}]
["Last Updated Date",{"$f":"+Welcome!B5","v":43537}]
[{"$f":"+Welcome!B6","v":"OMB Control Number: 2060-0522, Expiration: March 31, 2019"}]
{"$rows_left_out":9}
{"sheet":"NOCS_Certification","index":6,"n_rows":14,"n_cols":2,"rows_kept":14,"cut":false,"hidden":true,"merged":[]}
["DO NOT REMOVE OR EDIT INFORMATION IN THIS SECTION\nFOR INTERNAL USE ONLY"]
["Template Name",{"$f":"+Welcome!B2","v":"63.4310(c) and 63.4311(a) Notification of Compliance and Semiannual Compliance Report (Spreadsheet Template)"}]
["CitationID",{"$f":"+Welcome!B3","v":"63.4310(c) and 63.4311(a)"}]
["Template Version",{"$f":"+Welcome!B4","v":"v1.00"}]
["Last Updated Date",{"$f":"+Welcome!B5","v":43537}]
[{"$f":"+Welcome!B6","v":"OMB Control Number: 2060-0522, Expiration: March 31, 2019"}]
{"$rows_left_out":9}
{"sheet":"Semiannual_Report","index":7,"n_rows":14,"n_cols":8,"rows_kept":14,"cut":false,"hidden":false,"merged":[]}
["DO NOT REMOVE OR EDIT INFORMATION IN THIS SECTION\nFOR INTERNAL USE ONLY"]
["Template Name",{"$f":"+Welcome!B2","v":"63.4310(c) and 63.4311(a) Notification of Compliance and Semiannual Compliance Report (Spreadsheet Template)"}]
["CitationID",{"$f":"+Welcome!B3","v":"63.4310(c) and 63.4311(a)"}]
["Template Version",{"$f":"+Welcome!B4","v":"v1.00"}]
["Last Updated Date",{"$f":"+Welcome!B5","v":43537}]
[{"$f":"+Welcome!B6","v":"OMB Control Number: 2060-0522, Expiration: March 31, 2019"}]
{"$rows_left_out":9}
{"sheet":"Deviation_Compliant_Coating","index":8,"n_rows":23,"n_cols":11,"rows_kept":23,"cut":false,"hidden":false,"merged":[]}
["DO NOT REMOVE OR EDIT INFORMATION IN THIS SECTION\nFOR INTERNAL USE ONLY"]
["Template Name",{"$f":"+Welcome!B2","v":"63.4310(c) and 63.4311(a) Notification of Compliance and Semiannual Compliance Report (Spreadsheet Template)"}]
["CitationID",{"$f":"+Welcome!B3","v":"63.4310(c) and 63.4311(a)"}]
["Template Version",{"$f":"+Welcome!B4","v":"v1.00"}]
["Last Updated Date",{"$f":"+Welcome!B5","v":43537}]
[{"$f":"+Welcome!B6","v":"OMB Control Number: 2060-0522, Expiration: March 31, 2019"}]
{"$rows_left_out":18}
{"sheet":"Deviation_Without_Addon","index":9,"n_rows":708,"n_cols":8,"rows_kept":708,"cut":false,"hidden":false,"merged":[]}
["DO NOT REMOVE OR EDIT INFORMATION IN THIS SECTION\nFOR INTERNAL USE ONLY"]
["Template Name",{"$f":"+Welcome!B2","v":"63.4310(c) and 63.4311(a) Notification of Compliance and Semiannual Compliance Report (Spreadsheet Template)"}]
["CitationID",{"$f":"+Welcome!B3","v":"63.4310(c) and 63.4311(a)"}]
["Template Version",{"$f":"+Welcome!B4","v":"v1.00"}]
["Last Updated Date",{"$f":"+Welcome!B5","v":43537}]
[{"$f":"+Welcome!B6","v":"OMB Control Number: 2060-0522, Expiration: March 31, 2019"}]
{"$rows_left_out":703}
{"sheet":"Deviation_w_Addon_Malfunction","index":10,"n_rows":14,"n_cols":6,"rows_kept":14,"cut":false,"hidden":false,"merged":[]}
["DO NOT REMOVE OR EDIT INFORMATION IN THIS SECTION\nFOR INTERNAL USE ONLY"]
["Template Name",{"$f":"+Welcome!B2","v":"63.4310(c) and 63.4311(a) Notification of Compliance and Semiannual Compliance Report (Spreadsheet Template)"}]
["CitationID",{"$f":"+Welcome!B3","v":"63.4310(c) and 63.4311(a)"}]
["Template Version",{"$f":"+Welcome!B4","v":"v1.00"}]
["Last Updated Date",{"$f":"+Welcome!B5","v":43537}]
[{"$f":"+Welcome!B6","v":"OMB Control Number: 2060-0522, Expiration: March 31, 2019"}]
{"$rows_left_out":9}
{"sheet":"Deviation_w_Addon_EmLimits","index":11,"n_rows":708,"n_cols":9,"rows_kept":708,"cut":false,"hidden":false,"merged":[]}
["DO NOT REMOVE OR EDIT INFORMATION IN THIS SECTION FOR INTERNAL USE ONLY"]
["Template Name",{"$f":"+Welcome!B2","v":"63.4310(c) and 63.4311(a) Notification of Compliance and Semiannual Compliance Report (Spreadsheet Template)"}]
["CitationID",{"$f":"+Welcome!B3","v":"63.4310(c) and 63.4311(a)"}]
["Template Version",{"$f":"+Welcome!B4","v":"v1.00"}]
["Last Updated Date",{"$f":"+Welcome!B5","v":43537}]
[{"$f":"+Welcome!B6","v":"OMB Control Number: 2060-0522, Expiration: March 31, 2019"}]
{"$rows_left_out":703}
{"sheet":"Deviation_w_Addon_CPMS1","index":12,"n_rows":14,"n_cols":4,"rows_kept":14,"cut":false,"hidden":false,"merged":[]}
["DO NOT REMOVE OR EDIT INFORMATION IN THIS SECTION\nFOR INTERNAL USE ONLY"]
["Template Name",{"$f":"+Welcome!B2","v":"63.4310(c) and 63.4311(a) Notification of Compliance and Semiannual Compliance Report (Spreadsheet Template)"}]
["CitationID",{"$f":"+Welcome!B3","v":"63.4310(c) and 63.4311(a)"}]
["Template Version",{"$f":"+Welcome!B4","v":"v1.00"}]
["Last Updated Date",{"$f":"+Welcome!B5","v":43537}]
[{"$f":"+Welcome!B6","v":"OMB Control Number: 2060-0522, Expiration: March 31, 2019"}]
{"$rows_left_out":9}
{"sheet":"Deviation_w_Addon_CPMS2","index":13,"n_rows":14,"n_cols":9,"rows_kept":14,"cut":false,"hidden":false,"merged":[]}
["DO NOT REMOVE OR EDIT INFORMATION IN THIS SECTION\nFOR INTERNAL USE ONLY"]
["Template Name",{"$f":"+Welcome!B2","v":"63.4310(c) and 63.4311(a) Notification of Compliance and Semiannual Compliance Report (Spreadsheet Template)"}]
["CitationID",{"$f":"+Welcome!B3","v":"63.4310(c) and 63.4311(a)"}]
["Template Version",{"$f":"+Welcome!B4","v":"v1.00"}]
["Last Updated Date",{"$f":"+Welcome!B5","v":43537}]
[{"$f":"+Welcome!B6","v":"OMB Control Number: 2060-0522, Expiration: March 31, 2019"}]
{"$rows_left_out":9}
{"sheet":"Deviation_w_Addon_CPMSSummary","index":14,"n_rows":100,"n_cols":6,"rows_kept":100,"cut":false,"hidden":false,"merged":[]}
["DO NOT REMOVE OR EDIT INFORMATION IN THIS SECTION FOR INTERNAL USE ONLY"]
["Template Name",{"$f":"+Welcome!B2","v":"63.4310(c) and 63.4311(a) Notification of Compliance and Semiannual Compliance Report (Spreadsheet Template)"}]
["CitationID",{"$f":"+Welcome!B3","v":"63.4310(c) and 63.4311(a)"}]
["Template Version",{"$f":"+Welcome!B4","v":"v1.00"}]
["Last Updated Date",{"$f":"+Welcome!B5","v":43537}]
[{"$f":"+Welcome!B6","v":"OMB Control Number: 2060-0522, Expiration: March 31, 2019"}]
{"$rows_left_out":95}
{"sheet":"Deviation_w_Addon_OpLimit","index":15,"n_rows":14,"n_cols":7,"rows_kept":14,"cut":false,"hidden":false,"merged":[]}
["DO NOT REMOVE OR EDIT INFORMATION IN THIS SECTION\nFOR INTERNAL USE ONLY"]
["Template Name",{"$f":"+Welcome!B2","v":"63.4310(c) and 63.4311(a) Notification of Compliance and Semiannual Compliance Report (Spreadsheet Template)"}]
["CitationID",{"$f":"+Welcome!B3","v":"63.4310(c) and 63.4311(a)"}]
["Template Version",{"$f":"+Welcome!B4","v":"v1.00"}]
["Last Updated Date",{"$f":"+Welcome!B5","v":43537}]
[{"$f":"+Welcome!B6","v":"OMB Control Number: 2060-0522, Expiration: March 31, 2019"}]
{"$rows_left_out":9}
{"sheet":"Deviation_w_Addon_OpLimSummary","index":16,"n_rows":100,"n_cols":10,"rows_kept":100,"cut":false,"hidden":false,"merged":[]}
["DO NOT REMOVE OR EDIT INFORMATION IN THIS SECTION FOR INTERNAL USE ONLY"]
["Template Name",{"$f":"+Welcome!B2","v":"63.4310(c) and 63.4311(a) Notification of Compliance and Semiannual Compliance Report (Spreadsheet Template)"}]
["CitationID",{"$f":"+Welcome!B3","v":"63.4310(c) and 63.4311(a)"}]
["Template Version",{"$f":"+Welcome!B4","v":"v1.00"}]
["Last Updated Date",{"$f":"+Welcome!B5","v":43537}]
[{"$f":"+Welcome!B6","v":"OMB Control Number: 2060-0522, Expiration: March 31, 2019"}]
{"$rows_left_out":95}
{"sheet":"Deviation_w_Addon_WorkPrac","index":17,"n_rows":14,"n_cols":9,"rows_kept":14,"cut":false,"hidden":false,"merged":[]}
["DO NOT REMOVE OR EDIT INFORMATION IN THIS SECTION FOR INTERNAL USE ONLY"]
["Template Name",{"$f":"+Welcome!B2","v":"63.4310(c) and 63.4311(a) Notification of Compliance and Semiannual Compliance Report (Spreadsheet Template)"}]
["CitationID",{"$f":"+Welcome!B3","v":"63.4310(c) and 63.4311(a)"}]
["Template Version",{"$f":"+Welcome!B4","v":"v1.00"}]
["Last Updated Date",{"$f":"+Welcome!B5","v":43537}]
[{"$f":"+Welcome!B6","v":"OMB Control Number: 2060-0522, Expiration: March 31, 2019"}]
{"$rows_left_out":9}
{"sheet":"Deviation_Equiv_ER","index":18,"n_rows":14,"n_cols":13,"rows_kept":14,"cut":false,"hidden":false,"merged":[]}
["DO NOT REMOVE OR EDIT INFORMATION IN THIS SECTION \nFOR INTERNAL USE ONLY"]
["Template Name",{"$f":"+Welcome!B2","v":"63.4310(c) and 63.4311(a) Notification of Compliance and Semiannual Compliance Report (Spreadsheet Template)"}]
["CitationID",{"$f":"+Welcome!B3","v":"63.4310(c) and 63.4311(a)"}]
["Template Version",{"$f":"+Welcome!B4","v":"v1.00"}]
["Last Updated Date",{"$f":"+Welcome!B5","v":43537}]
[{"$f":"+Welcome!B6","v":"OMB Control Number: 2060-0522, Expiration: March 31, 2019"}]
{"$rows_left_out":9}
{"sheet":"Description_of_Changes","index":19,"n_rows":14,"n_cols":2,"rows_kept":14,"cut":false,"hidden":false,"merged":[]}
["DO NOT REMOVE OR EDIT INFORMATION IN THIS SECTION \nFOR INTERNAL USE ONLY"]
["Template Name",{"$f":"+Welcome!B2","v":"63.4310(c) and 63.4311(a) Notification of Compliance and Semiannual Compliance Report (Spreadsheet Template)"}]
["CitationID",{"$f":"+Welcome!B3","v":"63.4310(c) and 63.4311(a)"}]
["Template Version",{"$f":"+Welcome!B4","v":"v1.00"}]
["Last Updated Date",{"$f":"+Welcome!B5","v":43537}]
[{"$f":"+Welcome!B6","v":"OMB Control Number: 2060-0522, Expiration: March 31, 2019"}]
{"$rows_left_out":9}
{"sheet":"Number_of_Deviations","index":20,"n_rows":100,"n_cols":7,"rows_kept":100,"cut":false,"hidden":false,"merged":[]}
["DO NOT REMOVE OR EDIT INFORMATION IN THIS SECTION\nFOR INTERNAL USE ONLY"]
["Template Name",{"$f":"+Welcome!B2","v":"63.4310(c) and 63.4311(a) Notification of Compliance and Semiannual Compliance Report (Spreadsheet Template)"}]
["CitationID",{"$f":"+Welcome!B3","v":"63.4310(c) and 63.4311(a)"}]
["Template Version",{"$f":"+Welcome!B4","v":"v1.00"}]
["Last Updated Date",{"$f":"+Welcome!B5","v":43537}]
[{"$f":"+Welcome!B6","v":"OMB Control Number: 2060-0522, Expiration: March 31, 2019"}]
{"$rows_left_out":95}
{"sheet":"Semiannual_Certification","index":21,"n_rows":14,"n_cols":3,"rows_kept":14,"cut":false,"hidden":false,"merged":[]}
["DO NOT REMOVE OR EDIT INFORMATION IN THIS SECTION\nFOR INTERNAL USE ONLY"]
["Template Name",{"$f":"+Welcome!B2","v":"63.4310(c) and 63.4311(a) Notification of Compliance and Semiannual Compliance Report (Spreadsheet Template)"}]
["CitationID",{"$f":"+Welcome!B3","v":"63.4310(c) and 63.4311(a)"}]
["Template Version",{"$f":"+Welcome!B4","v":"v1.00"}]
["Last Updated Date",{"$f":"+Welcome!B5","v":43537}]
[{"$f":"+Welcome!B6","v":"OMB Control Number: 2060-0522, Expiration: March 31, 2019"}]
{"$rows_left_out":9}
{"sheet":"Revisions","index":22,"n_rows":2,"n_cols":2,"rows_kept":2,"cut":false,"hidden":true,"merged":[]}
["Date","Description"]
[43537,"Updated the State dropdown to include VI, PR, AS, MP, and GU."]