{"text_format":"1","workbook":"xlsx","n_sheets":4,"sheets":["Read Me","Effects Code","VLOOKUP","Effects Code Array Order"],"not_rendered":{"charts":0,"images":0,"macros":1,"external_links":0,"defined_names":1,"comments":0,"pivot_tables":0},"unopened":[],"bounds":{"document_bytes":16777216,"sheet_cells":100000,"rows_first":2000,"rows_last":500,"rows_between":2000,"halvings":0,"cell_chars":16384,"cell_head_chars":4096},"cells_cut":0,"cells_raw":0,"read":"whole","date_system":"1900"}

{"sheet":"Read Me","index":0,"n_rows":59,"n_cols":16,"rows_kept":59,"cut":false,"hidden":false,"merged":[[0,0,0,12]]}
["Data Array Builder v 1.0"]
[]
["This tool will generate data arrays based on formatted ECOTOX data reports."]
["The following are instructions on how to use this tool."]
[]
["Step 1. Import your ECOTOX data table into the tool.",null,null,null,null,null,null,null,null,null,null,null,null,null,null,"  "]
["   1. Open your Excel ECOTOX file and the data array builder v 1.0.xlsm"]
["   2. Select \"Move or Copy…\" from the worksheet tab in your ECOTOX file."]
["   3. This will open a dialog box. Select your worksheet, the To book: should read data array builder v 1.0.xlsm"]
["        and the Copy checkbox should be checked. This will make sure you only copy the data to the worksheet."]
[]
["Step 2. Insert VLOOKUP COLUMN (This function converts the measurement endpoint acronyms to words)"]
["   1.  Insert a column in the same location as shown in the sample VLOOKUP worksheet (between the \"Effect\" and \"Meas\" columns) in your data."]
["   2. Copy the first two lines (The column title and first cell) from \"Measured Endpoint\" column in the VLOOKUP worksheet into your new inserted column"]
["   3. Copy the cell all the way down the column for as many rows of data you have"]
[]
["Note: If VLOOKUP cannot find the acronym in the effects code list, it just returns the original acronym."]
[]
["Step 3. Run Data Array Generator"]
["   1. In the newly imported worksheet, hit Ctl-q. This will start the data array builder."]
["   2. A pop-up box should appear that asks you for the following information"]
["   - Class column - select the column that has the information on the various taxa"]
["   - Family checkbox and column - if you want to also refine your analyses to include family level data, select the column that has the information on the various families"]
["   - Effects endpoint columns - select the 3 columns that have the information on the various effects codes. The first two columns will be used as the y-axis,"]
["      while the third level of effects is incorporated into the data label."]
["   - Endpoint descriptor - select the column that has the information on the various endpoints (e.g., NOAECs, LOAECs, LC50s, etc)"]
["   - Endpoint value - select the column that has the information on the various endpoints"]
["   - Endpoint Units - select the column that has the information on the various endpoint units"]
["   - Endpoint Duration - select the column that has the duration of the endpoint. This will be displayed as a data label for the endpoint. The user is"]
["      advised to standardize the duration to days before running the data array generator."]
["   - Trial IDs - select the column that has the information on the various trial ids. This will be used to try and link LOAECs and NOAECs."]
["   - Reference # column - - select the column that has the information on the various reference numbers. "]
["   - Remove duplicates checkbox - this allows you to automatically remove any duplicates that may appear in the data, based on Reference #, Effect, and Endpoint value."]
["   Note: It's easiest to click on the Column letter, than to highlight all of the cells in the column."]
["If your LOAECs and NOAECs are in separate columns, click on the \"Are secondary endpoints (e.g., LOAELS) in a separate column?\" checkbox"]
["and you can select a second set of columns for the additional data."]
[]
["Once you've entered the appropriate information, click on the Run Analysis button and the data arrays should automatically generate."]
[]
["Notes:"]
["1. When selecting columns for Effects Descriptors, they should be right next to each other, with the more general descriptor to the left."]
["2. If you have registrant submitted studies, start the Reference # with \"MRID\". These studies will appear with a red marker in the generated data arrays."]
["3. If you need to change the scale of the x-axis, follow these instructions:"]
["  a. Click on the chart and select Chart Tools, Format menu tab."]
["  b. On the far left of the Ribbon, select Horizontal (Value) Axis and click Format Selection."]
["  c. Make appropriate revisions to x-axis parameters and select Ok."]
["  d. On the far left of the Ribbon, select Secondary Horizontal (Value) Axis and click Format Selection."]
["  e. Make appropriate revisions to secondary x-axis parameters and select Ok."]
["  f. If your chart has divider lines in it, you will need to go into the appropriate data worksheet (usually it is the sheet just to the right of your chart)"]
["      and fix the Value and Dif values in the worksheet to match your chart revisions so that the line goes across the chart."]
["4. If you have a significant amount of data being displayed on the data array, you can copy the chart and paste it into an empty spreadsheet,"]
["    which will allow you to lengthen the chart in the empty spreadsheet and view the presentation of the data array a little easier."]
["5. If you wish to see a subset of the data displayed in a data array, go to the worksheet that the array references and use the Filter feature in Excel. Allow time for "]
["    the Height column to update before trying to review the data array."]
["6. Although data labels are displayed on the data arrays, they cannot be updated by changing the underlying data. To change a data label, the user"]
["    will have to change the label on the data array itself, or change the original data and rerun the data array builder."]
["7. If you filter your data to refine your data array, this may affect the presentation of the summary arrays. Make sure to turn filters"]
["    off before reviewing the different summary charts."]
["8. The tool uses the Trial IDs to link NOAECs and LOAECs. Any  NOAEC that is not associated with a LOAEC via the Trial ID is not displayed in the data array."]

{"sheet":"Effects Code","index":1,"n_rows":2732,"n_cols":7,"rows_kept":2732,"cut":false,"hidden":true,"merged":[]}
["Effect Code","Code 2","Code","Definition"]
["ACC",null,"ASML","Assimilation efficiency"]
["ACC",null,"BDBN","Body burden"]
["ACC",null,"BDCN","Body concentration"]
["ACC",null,"ELIM","Elimination"]
["ACC",null,"GACC","Accumulation, general"]
["ACC",null,"LBCN","Lethal body concentration"]
["ACC",null,"RATO","Ratio"]
["ACC",null,"RSDE","Residue"]
["ACC",null,"TSLC","Translocation"]
["ACC",null,"UPTK","Uptake"]
["BEH","AVO","CHEM","Chemical avoidance"]
["BEH","AVO","FOOD","Food avoidance"]
["BEH","AVO","GAVO","Avoidance, general"]
["BEH","AVO","STIM","Stimulus avoidance"]
["BEH","AVO","WATR","Water avoidance"]
["BEH","BEH","ACTP","Accuracy of learned task, performance"]
["BEH","BEH","ACTV","Activity, general"]
["BEH","BEH","ADOT","Adopt/Adoption"]
["BEH","BEH","AGCL","Aggregation/Clumping"]
["BEH","BEH","AGGT","Aggression"]
["BEH","BEH","ALRT","Alert"]
["BEH","BEH","APCH","Approach"]
["BEH","BEH","ATCL","Antennal cleaning"]
["BEH","BEH","ATSK","Acquired task"]
["BEH","BEH","ATTK","Attack"]
["BEH","BEH","BATH","Bathing"]
["BEH","BEH","BBBH","Burrowing behavior, burrowing length"]
["BEH","BEH","BITE","Bite or biting"]
["BEH","BEH","BOBB","Bob, bobbing"]
["BEH","BEH","BOWW","Bow, bowing"]
["BEH","BEH","BWAX","Bees wax produced"]
["BEH","BEH","CASE","Case Leaving Behavior"]
["BEH","BEH","CMST","Compactness of swimming track"]
["BEH","BEH","CNBL","Cannibalism"]
["BEH","BEH","COMA","Colony maintenance (bees)"]
["BEH","BEH","COMB","Comb built"]
["BEH","BEH","CRDN","Coordination"]
["BEH","BEH","CRTP","Continual reinforcement task performed"]
["BEH","BEH","DHST","Diameter of helix of swimming track"]
["BEH","BEH","DIGG","Dig/digging"]
["BEH","BEH","DPLY","Displaying behavior"]
["BEH","BEH","DRMT","Dormant, adverse condition response"]
["BEH","BEH","DTCH","Ability to detach from substrate"]
["BEH","BEH","DUMV","Diurnal movements"]
["BEH","BEH","ECMB","Empty combs"]
["BEH","BEH","Code","Definition"]
["BEH","BEH","EQUL","Equilibrium"]
["BEH","BEH","ERRR","Errors in trained behavior"]
["BEH","BEH","EXTN","Extinction"]
["BEH","BEH","FLHM","Flehmen response"]
["BEH","BEH","FLIT","Flight"]
["BEH","BEH","FLTR","Filtration rate"]
["BEH","BEH","FLYG","Flying behavior"]
["BEH","BEH","FOOT","Foot retraction"]
["BEH","BEH","FRTP","Fixed ratio task performed"]
["BEH","BEH","FRZG","Freezing behavior"]
["BEH","BEH","FTTR","Flutter"]
["BEH","BEH","GBHV","Behavioral changes, general"]
["BEH","BEH","GPST","Grip strength"]
["BEH","BEH","GRAB","Grab, grabbing"]
["BEH","BEH","GROM","Grooming"]
["BEH","BEH","HDLF","Head lift"]
["BEH","BEH","HMVT","Horizontal movements"]
["BEH","BEH","HONY","Honey produced"]
["BEH","BEH","INST","Sleeping time, induced"]
["BEH","BEH","JUMP","Jumping"]
["BEH","BEH","KILL","Kill"]
["BEH","BEH","LOCO","Distance moved, change in direct movement"]
["BEH","BEH","MIGR","Migration"]
["BEH","BEH","MOTL","Motility"]
["BEH","BEH","NACT","Non-social activity"]
["BEH","BEH","NCMV","Nocturnal movements"]
["BEH","BEH","NGRX","Negative geotaxis reflex"]
["BEH","BEH","NMVM","Movements, number of"]
["BEH","BEH","NRES","No response"]
["BEH","BEH","NRSP","Neuroresponse"]
["BEH","BEH","NVOC","Vocalizations, number of"]
["BEH","BEH","ORNT","Orientation"]
["BEH","BEH","PALR","Palmar grasp"]
{"$rows_left_out":2653}
{"sheet":"VLOOKUP","index":2,"n_rows":323,"n_cols":7,"rows_kept":323,"cut":false,"hidden":false,"merged":[]}
[null,null,null,"Effect Group","Effect","Measured Endpoint","Meas"]
[null,null,null,"BCM","ENZ",{"$f":"IFERROR(VLOOKUP(G2,'Effects Code'!$C:$D,2,FALSE), G2)","v":"Cholinesterase"},"CEST"]
[null,null,null,"BCM","ENZ",{"$f":"IFERROR(VLOOKUP(G3,'Effects Code'!$C:$D,2,FALSE), G3)","v":"Cholinesterase"},"CEST"]
[null,null,null,"BCM","ENZ",{"$f":"IFERROR(VLOOKUP(G4,'Effects Code'!$C:$D,2,FALSE), G4)","v":"Cholinesterase"},"CEST"]
[null,null,null,"BCM","ENZ",{"$f":"IFERROR(VLOOKUP(G5,'Effects Code'!$C:$D,2,FALSE), G5)","v":"Cholinesterase"},"CEST"]
[null,null,null,"BCM","ENZ",{"$f":"IFERROR(VLOOKUP(G6,'Effects Code'!$C:$D,2,FALSE), G6)","v":"Acetylcholinesterase"},"ACHE"]
[null,null,null,"BCM","ENZ",{"$f":"IFERROR(VLOOKUP(G7,'Effects Code'!$C:$D,2,FALSE), G7)","v":"Acetylcholinesterase"},"ACHE"]
[null,null,null,"BCM","ENZ",{"$f":"IFERROR(VLOOKUP(G8,'Effects Code'!$C:$D,2,FALSE), G8)","v":"Acetylcholinesterase"},"ACHE"]
[null,null,null,"BCM","ENZ",{"$f":"IFERROR(VLOOKUP(G9,'Effects Code'!$C:$D,2,FALSE), G9)","v":"Acetylcholinesterase"},"ACHE"]
[null,null,null,"BCM","ENZ",{"$f":"IFERROR(VLOOKUP(G10,'Effects Code'!$C:$D,2,FALSE), G10)","v":"Acetylcholinesterase"},"ACHE"]
[null,null,null,"GRO","MPH",{"$f":"IFERROR(VLOOKUP(G11,'Effects Code'!$C:$D,2,FALSE), G11)","v":"Weight"},"WGHT"]
[null,null,null,"BCM","ENZ",{"$f":"IFERROR(VLOOKUP(G12,'Effects Code'!$C:$D,2,FALSE), G12)","v":"Acetylcholinesterase"},"ACHE"]
[null,null,null,"GRO","MPH",{"$f":"IFERROR(VLOOKUP(G13,'Effects Code'!$C:$D,2,FALSE), G13)","v":"Organ weight in relationship to body weight"},"SMIX"]
[null,null,null,"GRO","MPH",{"$f":"IFERROR(VLOOKUP(G14,'Effects Code'!$C:$D,2,FALSE), G14)","v":"Weight"},"WGHT"]
[null,null,null,"GRO","MPH",{"$f":"IFERROR(VLOOKUP(G15,'Effects Code'!$C:$D,2,FALSE), G15)","v":"Organ weight in relationship to body weight"},"SMIX"]
[null,null,null,"BCM","ENZ",{"$f":"IFERROR(VLOOKUP(G16,'Effects Code'!$C:$D,2,FALSE), G16)","v":"Acetylcholinesterase"},"ACHE"]
[null,null,null,"GRO","GRO",{"$f":"IFERROR(VLOOKUP(G17,'Effects Code'!$C:$D,2,FALSE), G17)","v":"Weight"},"WGHT"]
[null,null,null,"MOR","MOR",{"$f":"IFERROR(VLOOKUP(G18,'Effects Code'!$C:$D,2,FALSE), G18)","v":"Mortality"},"MORT"]
[null,null,null,"BCM","ENZ",{"$f":"IFERROR(VLOOKUP(G19,'Effects Code'!$C:$D,2,FALSE), G19)","v":"Cholinesterase"},"CEST"]
[null,null,null,"BCM","ENZ",{"$f":"IFERROR(VLOOKUP(G20,'Effects Code'!$C:$D,2,FALSE), G20)","v":"Cholinesterase"},"CEST"]
[null,null,null,"BCM","ENZ",{"$f":"IFERROR(VLOOKUP(G21,'Effects Code'!$C:$D,2,FALSE), G21)","v":"Cholinesterase"},"CEST"]
[null,null,null,"BCM","ENZ",{"$f":"IFERROR(VLOOKUP(G22,'Effects Code'!$C:$D,2,FALSE), G22)","v":"Cholinesterase"},"CEST"]
[null,null,null,"BEH","BEH",{"$f":"IFERROR(VLOOKUP(G23,'Effects Code'!$C:$D,2,FALSE), G23)","v":"Distance moved, change in direct movement"},"LOCO"]
[null,null,null,"BEH","BEH",{"$f":"IFERROR(VLOOKUP(G24,'Effects Code'!$C:$D,2,FALSE), G24)","v":"Distance moved, change in direct movement"},"LOCO"]
[null,null,null,"BCM","ENZ",{"$f":"IFERROR(VLOOKUP(G25,'Effects Code'!$C:$D,2,FALSE), G25)","v":"Cholinesterase"},"CEST"]
[null,null,null,"GRO","MPH",{"$f":"IFERROR(VLOOKUP(G26,'Effects Code'!$C:$D,2,FALSE), G26)","v":"Length"},"LGTH"]
[null,null,null,"GRO","MPH",{"$f":"IFERROR(VLOOKUP(G27,'Effects Code'!$C:$D,2,FALSE), G27)","v":"Length"},"LGTH"]
[null,null,null,"GRO","MPH",{"$f":"IFERROR(VLOOKUP(G28,'Effects Code'!$C:$D,2,FALSE), G28)","v":"Length"},"LGTH"]
[null,null,null,"GRO","MPH",{"$f":"IFERROR(VLOOKUP(G29,'Effects Code'!$C:$D,2,FALSE), G29)","v":"Length"},"LGTH"]
[null,null,null,"GRO","MPH",{"$f":"IFERROR(VLOOKUP(G30,'Effects Code'!$C:$D,2,FALSE), G30)","v":"Length"},"LGTH"]
[null,null,null,"GRO","MPH",{"$f":"IFERROR(VLOOKUP(G31,'Effects Code'!$C:$D,2,FALSE), G31)","v":"Length"},"LGTH"]
[null,null,null,"GRO","GRO",{"$f":"IFERROR(VLOOKUP(G32,'Effects Code'!$C:$D,2,FALSE), G32)","v":"Weight"},"WGHT"]
[null,null,null,"GRO","MPH",{"$f":"IFERROR(VLOOKUP(G33,'Effects Code'!$C:$D,2,FALSE), G33)","v":"Length"},"LGTH"]
[null,null,null,"GRO","MPH",{"$f":"IFERROR(VLOOKUP(G34,'Effects Code'!$C:$D,2,FALSE), G34)","v":"Length"},"LGTH"]
[null,null,null,"GRO","MPH",{"$f":"IFERROR(VLOOKUP(G35,'Effects Code'!$C:$D,2,FALSE), G35)","v":"Length"},"LGTH"]
[null,null,null,"GRO","GRO",{"$f":"IFERROR(VLOOKUP(G36,'Effects Code'!$C:$D,2,FALSE), G36)","v":"Weight"},"WGHT"]
[null,null,null,"GRO","MPH",{"$f":"IFERROR(VLOOKUP(G37,'Effects Code'!$C:$D,2,FALSE), G37)","v":"Length"},"LGTH"]
[null,null,null,"GRO","MPH",{"$f":"IFERROR(VLOOKUP(G38,'Effects Code'!$C:$D,2,FALSE), G38)","v":"Length"},"LGTH"]
[null,null,null,"GRO","MPH",{"$f":"IFERROR(VLOOKUP(G39,'Effects Code'!$C:$D,2,FALSE), G39)","v":"Length"},"LGTH"]
[null,null,null,"GRO","GRO",{"$f":"IFERROR(VLOOKUP(G40,'Effects Code'!$C:$D,2,FALSE), G40)","v":"Weight"},"WGHT"]
[null,null,null,"GRO","MPH",{"$f":"IFERROR(VLOOKUP(G41,'Effects Code'!$C:$D,2,FALSE), G41)","v":"Length"},"LGTH"]
[null,null,null,"GRO","MPH",{"$f":"IFERROR(VLOOKUP(G42,'Effects Code'!$C:$D,2,FALSE), G42)","v":"Length"},"LGTH"]
[null,null,null,"GRO","MPH",{"$f":"IFERROR(VLOOKUP(G43,'Effects Code'!$C:$D,2,FALSE), G43)","v":"Length"},"LGTH"]
[null,null,null,"GRO","GRO",{"$f":"IFERROR(VLOOKUP(G44,'Effects Code'!$C:$D,2,FALSE), G44)","v":"Weight"},"WGHT"]
[null,null,null,"GRO","MPH",{"$f":"IFERROR(VLOOKUP(G45,'Effects Code'!$C:$D,2,FALSE), G45)","v":"Length"},"LGTH"]
[null,null,null,"GRO","MPH",{"$f":"IFERROR(VLOOKUP(G46,'Effects Code'!$C:$D,2,FALSE), G46)","v":"Length"},"LGTH"]
[null,null,null,"GRO","MPH",{"$f":"IFERROR(VLOOKUP(G47,'Effects Code'!$C:$D,2,FALSE), G47)","v":"Length"},"LGTH"]
[null,null,null,"GRO","GRO",{"$f":"IFERROR(VLOOKUP(G48,'Effects Code'!$C:$D,2,FALSE), G48)","v":"Weight"},"WGHT"]
[null,null,null,"GRO","MPH",{"$f":"IFERROR(VLOOKUP(G49,'Effects Code'!$C:$D,2,FALSE), G49)","v":"Length"},"LGTH"]
[null,null,null,"GRO","MPH",{"$f":"IFERROR(VLOOKUP(G50,'Effects Code'!$C:$D,2,FALSE), G50)","v":"Length"},"LGTH"]
[null,null,null,"GRO","MPH",{"$f":"IFERROR(VLOOKUP(G51,'Effects Code'!$C:$D,2,FALSE), G51)","v":"Length"},"LGTH"]
[null,null,null,"GRO","GRO",{"$f":"IFERROR(VLOOKUP(G52,'Effects Code'!$C:$D,2,FALSE), G52)","v":"Weight"},"WGHT"]
[null,null,null,"GRO","GRO",{"$f":"IFERROR(VLOOKUP(G53,'Effects Code'!$C:$D,2,FALSE), G53)","v":"Weight"},"WGHT"]
[null,null,null,"GRO","MPH",{"$f":"IFERROR(VLOOKUP(G54,'Effects Code'!$C:$D,2,FALSE), G54)","v":"Length"},"LGTH"]
[null,null,null,"GRO","MPH",{"$f":"IFERROR(VLOOKUP(G55,'Effects Code'!$C:$D,2,FALSE), G55)","v":"Length"},"LGTH"]
[null,null,null,"GRO","MPH",{"$f":"IFERROR(VLOOKUP(G56,'Effects Code'!$C:$D,2,FALSE), G56)","v":"Length"},"LGTH"]
[null,null,null,"GRO","MPH",{"$f":"IFERROR(VLOOKUP(G57,'Effects Code'!$C:$D,2,FALSE), G57)","v":"Length"},"LGTH"]
[null,null,null,"GRO","MPH",{"$f":"IFERROR(VLOOKUP(G58,'Effects Code'!$C:$D,2,FALSE), G58)","v":"Length"},"LGTH"]
[null,null,null,"GRO","MPH",{"$f":"IFERROR(VLOOKUP(G59,'Effects Code'!$C:$D,2,FALSE), G59)","v":"Length"},"LGTH"]
[null,null,null,"GRO","GRO",{"$f":"IFERROR(VLOOKUP(G60,'Effects Code'!$C:$D,2,FALSE), G60)","v":"Weight"},"WGHT"]
[null,null,null,"GRO","MPH",{"$f":"IFERROR(VLOOKUP(G61,'Effects Code'!$C:$D,2,FALSE), G61)","v":"Length"},"LGTH"]
[null,null,null,"GRO","MPH",{"$f":"IFERROR(VLOOKUP(G62,'Effects Code'!$C:$D,2,FALSE), G62)","v":"Length"},"LGTH"]
[null,null,null,"GRO","MPH",{"$f":"IFERROR(VLOOKUP(G63,'Effects Code'!$C:$D,2,FALSE), G63)","v":"Length"},"LGTH"]
[null,null,null,"GRO","MPH",{"$f":"IFERROR(VLOOKUP(G64,'Effects Code'!$C:$D,2,FALSE), G64)","v":"Length"},"LGTH"]
[null,null,null,"GRO","MPH",{"$f":"IFERROR(VLOOKUP(G65,'Effects Code'!$C:$D,2,FALSE), G65)","v":"Length"},"LGTH"]
[null,null,null,"GRO","MPH",{"$f":"IFERROR(VLOOKUP(G66,'Effects Code'!$C:$D,2,FALSE), G66)","v":"Length"},"LGTH"]
[null,null,null,"GRO","GRO",{"$f":"IFERROR(VLOOKUP(G67,'Effects Code'!$C:$D,2,FALSE), G67)","v":"Weight"},"WGHT"]
[null,null,null,"GRO","MPH",{"$f":"IFERROR(VLOOKUP(G68,'Effects Code'!$C:$D,2,FALSE), G68)","v":"Length"},"LGTH"]
[null,null,null,"GRO","MPH",{"$f":"IFERROR(VLOOKUP(G69,'Effects Code'!$C:$D,2,FALSE), G69)","v":"Length"},"LGTH"]
[null,null,null,"GRO","MPH",{"$f":"IFERROR(VLOOKUP(G70,'Effects Code'!$C:$D,2,FALSE), G70)","v":"Length"},"LGTH"]
[null,null,null,"GRO","GRO",{"$f":"IFERROR(VLOOKUP(G71,'Effects Code'!$C:$D,2,FALSE), G71)","v":"Weight"},"WGHT"]
[null,null,null,"GRO","GRO",{"$f":"IFERROR(VLOOKUP(G72,'Effects Code'!$C:$D,2,FALSE), G72)","v":"Weight"},"WGHT"]
[null,null,null,"GRO","GRO",{"$f":"IFERROR(VLOOKUP(G73,'Effects Code'!$C:$D,2,FALSE), G73)","v":"Weight"},"WGHT"]
[null,null,null,"GRO","GRO",{"$f":"IFERROR(VLOOKUP(G74,'Effects Code'!$C:$D,2,FALSE), G74)","v":"Weight"},"WGHT"]
[null,null,null,"GRO","GRO",{"$f":"IFERROR(VLOOKUP(G75,'Effects Code'!$C:$D,2,FALSE), G75)","v":"Weight"},"WGHT"]
[null,null,null,"GRO","GRO",{"$f":"IFERROR(VLOOKUP(G76,'Effects Code'!$C:$D,2,FALSE), G76)","v":"Weight"},"WGHT"]
[null,null,null,"GRO","GRO",{"$f":"IFERROR(VLOOKUP(G77,'Effects Code'!$C:$D,2,FALSE), G77)","v":"Weight"},"WGHT"]
[null,null,null,"BEH","BEH",{"$f":"IFERROR(VLOOKUP(G78,'Effects Code'!$C:$D,2,FALSE), G78)","v":"Flying behavior"},"FLYG"]
[null,null,null,"BCM","ENZ",{"$f":"IFERROR(VLOOKUP(G79,'Effects Code'!$C:$D,2,FALSE), G79)","v":"Cholinesterase"},"CEST"]
[null,null,null,"BCM","ENZ",{"$f":"IFERROR(VLOOKUP(G80,'Effects Code'!$C:$D,2,FALSE), G80)","v":"Cholinesterase"},"CEST"]
{"$rows_left_out":244}
{"sheet":"Effects Code Array Order","index":3,"n_rows":29,"n_cols":8,"rows_kept":29,"cut":false,"hidden":true,"merged":[]}
["Major Effect Group","Major Effect Group Definition","Minor Effect Group","Minor Effect Group Definition","Rank","Singular","Combined",{"$f":"A1","v":"Major Effect Group"}]
["BCM","Biochemical","BCM","Biochemical Effects ",1,{"$f":"B2","v":"Biochemical"},{"$f":"B2&\", \"&D2","v":"Biochemical, Biochemical Effects "},{"$f":"A2","v":"BCM"}]
["BCM","Biochemical","ENZ","Enzyme Effects",2,{"$f":"B3","v":"Biochemical"},{"$f":"B3&\", \"&D3","v":"Biochemical, Enzyme Effects"},{"$f":"A3","v":"BCM"}]
["BCM","Biochemical","HRM","Hormone Effects",3,{"$f":"B4","v":"Biochemical"},{"$f":"B4&\", \"&D4","v":"Biochemical, Hormone Effects"},{"$f":"A4","v":"BCM"}]
["CEL","Cellular","CEL","Cellular",4,{"$f":"B5","v":"Cellular"},{"$f":"B5&\", \"&D5","v":"Cellular, Cellular"},{"$f":"A5","v":"CEL"}]
["CEL","Cellular","GEN","Genetic",5,{"$f":"B6","v":"Cellular"},{"$f":"B6&\", \"&D6","v":"Cellular, Genetic"},"CEL"]
["CEL","Cellular","HIS","Histological",6,"Cellular","Cellular, Histological","CEL"]
["PHY","Physiological","IMM","Immunity",7,"Physiological","Physiological, Immunity","PHY"]
["PHY","Physiological","INJ","Injury",8,"Physiological","Physiological, Injury","PHY"]
["PHY","Physiological","ITX","Intoxication",9,"Physiological","Physiological, Intoxication","PHY"]
["PHY","Physiological","PHY","General Physiological",10,"Physiological","Physiological, General Physiological","PHY"]
["BEH","Behavioral","AVO","Avoidance",11,"Behavioral","Behavioral, Avoidance","BEH"]
["BEH","Behavioral","BEH","General Behavior",12,"Behavioral","Behavioral, General Behavior","BEH"]
["BEH","Behavioral","FDB","Feeding Behavior",13,"Behavioral","Behavioral, Feeding Behavior","BEH"]
["REP","Reproduction","AEG","Avian or Reptilian Egg",14,"Reproduction","Reproduction, Avian or Reptilian Egg","REP"]
["REP","Reproduction","REP","Reproduction",15,"Reproduction","Reproduction, Reproduction","REP"]
["GRO","Growth","DVP","Development",16,"Growth","Growth, Development","GRO"]
["GRO","Growth","GRO","Growth",17,"Growth","Growth, Growth","GRO"]
["GRO","Growth","MPH","Morphology",18,"Growth","Growth, Morphology","GRO"]
["ACC","Accumulation","ACC","Accumulation",19,"Accumulation","Accumulation, Accumulation","ACC"]
["MOR","Mortality","MOR","Mortality",20,"Mortality","Mortality, Mortality","MOR"]
["POP","Population","POP","Population",21,"Population","Population, Population","POP"]
["SYS","Ecosystem Processes","PRS","Ecosystem Processes",22,"Ecosystem Processes","Ecosystem Processes, Ecosystem Processes","SYS"]
["NOC","No Code","NOC","No code",23,"No Code","No Code, No code","NOC"]
[]
[]
[]
["Major Effects groups listed in order from cellular to population level"]
["Minor Effects just sorted alphabetically within it's major group (not critical as long as they stay together)"]