{"text_format":"1","workbook":"xlsx","n_sheets":12,"sheets":["Min_Tests","Variability","Lognormal Template","QA_Calcs","lognormal distribution 99 %","Part II","ERT","SO2_CEMS","sampling_runs","sampling_run_pollutants1","UPL Normal","UPL Pooled Template "],"not_rendered":{"charts":2,"images":31,"macros":1,"external_links":0,"defined_names":27,"comments":1,"pivot_tables":0},"unopened":[],"bounds":{"document_bytes":16777216,"sheet_cells":100000,"rows_first":2000,"rows_last":500,"rows_between":2000,"halvings":0,"cell_chars":16384,"cell_head_chars":4096},"cells_cut":0,"cells_raw":0,"read":"whole","date_system":"1900"}

{"sheet":"Min_Tests","index":0,"n_rows":293,"n_cols":62,"rows_kept":293,"cut":false,"hidden":false,"merged":[]}
["Key f_b","Rank","Reason_for_Removal as top ranked unit for new source floor","primary_fuel","ORIS code","Plant Name","physical_state","Unit Number","boiler_id","Unit Type","boiler_type","MWe_capacity","max_heat_input","Unit_heat_rate","Fuel types","fuel","Sulfur Dioxide - CEMS","Sulfur Dioxide MW - CEMS","Sulfur Dioxide - ERT","Sulfur Dioxide MW - ERT","Sulfur Dioxide - ETTS","Sulfur Dioxide MW - ETTS","Sulfur Dioxide - Part II","Sulfur Dioxide MW - Part II","Sulfur Dioxide - min","Sulfur Dioxide MW - min","control_group_1","control_type_1","install_date_1","control_group_2","control_type_2","install_date_2","control_group_3","control_type_3","install_date_3","control_group_4","control_type_4","install_date_4","control_group_5","control_type_5","install_date_5","control_group_6","control_type_6","install_date_6","control_group_7","control_type_7","install_date_7","control_group_8","control_type_8","install_date_8","control_group_9","control_type_9","install_date_9","control_group_10","control_type_10","install_date_10","control_group_11","control_type_11","install_date_11","control_group_12","control_type_12","install_date_12"]
[{"$f":"E2&\"_\"&I2","v":"1008_2"},1,"No run level data submitted.","coal",1008,"R. Gallagher","IN","2-2007","2","Conventional Boiler","Wall firing - front firing",150,1460,9.7333333333333325,"coal - bituminous","bituminous",null,null,null,null,null,null,3.2359930321660475E-3,3.1496998846416192E-2,3.2359930321660475E-3,3.1496998846416192E-2,"PM control","Fabric Filter, shake and deflate","2007-12-01","","",null,"","",null,"","",null,"","",null,"","",null,"","",null,"","",null,"","",null,"","",null,"","",null,"",""]
["861_1",2,"No run level data submitted.","coal",861,"Coffeen","IL","001","1","Conventional Boiler","Cyclone firing",360,3282,9.1166666666666671,"subbituminous","subbituminous",8.4666666666666692E-3,7.71877777777778E-2,null,null,null,null,null,null,8.4666666666666692E-3,7.71877777777778E-2,"NOx control","Selective Catalytic Reduction","2003-04-01","PM control","Electrostatic precipitator, cold side, w/ flue gas conditioning","1973-01-01","SO2 control","Wet FGD - Unspecified","2009-11-01","","",null,"","",null,"","",null,"","",null,"","",null,"","",null,"","",null,"","",null,"",""]
["2824_10",3,"No run level data submitted.","coal",2824,"Stanton","ND","u10","10","Conventional Boiler","Tangential firing",60,642,10.7,"coal - subbituminous","subbituminous",null,null,null,null,null,null,7.6601195105882132E-3,8.1963278763293873E-2,7.6601195105882132E-3,8.1963278763293873E-2,"SO2 control","Dry FGD - Spray Dryer","2000-01-01","PM control","Fabric Filter, reverse air","2000-01-01","","",null,"","",null,"","",null,"","",null,"","",null,"","",null,"","",null,"","",null,"","",null,"",""]
["68029_BLR2",4,"No run level data submitted.","coal",68029,"AES Puerto Rico Cogeneration Facility","PR","Unit_2","BLR2","Fluidized bed firing","Fluidized bed firing",255,2461.4,9.652549019607843,"bituminous","bituminous",8.7100000000000025E-3,8.4073701960784342E-2,null,null,null,null,null,null,8.7100000000000025E-3,8.4073701960784342E-2,"NOx control","Selective Noncatalytic Reduction",null,"SO2 control","Dry FGD - Spray Dryer",null,"PM control","Electrostatic precipitator, cold side, w/o flue gas conditioning",null,"","",null,"","",null,"","",null,"","",null,"","",null,"","",null,"","",null,"","",null,"",""]
["56068_1",5,"Unit began operations February 2010; only 1 test available. Insufficient data to determine rate that is achievable in practice with long-term continuous unit operations.","coal",56068,"Elm Road Generating Station","WI","ERGS-B1","1","Conventional Boiler","Wall firing - unspecified",677,6515,9.6233382570162487,"bituminous","bituminous",null,null,null,null,8.9999999999999993E-3,8.6610044313146228E-2,null,null,8.9999999999999993E-3,8.6610044313146228E-2,"NOx control","Selective Catalytic Reduction","2009-10-01","PM control","Fabric Filter, pulse","2009-10-01","SO2 control","Wet FGD - Spray Type","2009-10-01","Other control","Wet electrostatic precipitator","2009-10-01","","",null,"","",null,"","",null,"","",null,"","",null,"","",null,"","",null,"",""]
{"$rows_left_out":288}
{"sheet":"Variability","index":1,"n_rows":493,"n_cols":15,"rows_kept":493,"cut":false,"hidden":false,"merged":[]}
["Key f_b","Rank","Reason_for_Removal as top ranked unit for new source floor","Plant Name","facility_id","boiler_id","configuration_id","compound","Final_EF","Final_EF_Units","Final_Output_EF","Final_Output_EF_Units","From","Report_id"]
[{"$f":"E2&\"_\"&F2","v":"1008_2"},{"$f":"VLOOKUP(A2,Min_Tests!A:AB,2,FALSE)","v":1},"No run level data submitted.",{"$f":"VLOOKUP(A2,Min_Tests!A:AB,5,FALSE)","v":1008},1008,"2","2-2007","Sulfur Dioxide",3.2359930321660475E-3,"lb/MMBtu",3.1496998846416192E-2,"lb/MW","Part II","U2091409-BASE","No run level data submitted."]
["1008_2",{"$f":"VLOOKUP(A3,Min_Tests!A:AB,2,FALSE)","v":1},"No run level data submitted.",{"$f":"VLOOKUP(A3,Min_Tests!A:AB,5,FALSE)","v":1008},1008,"2","2-2007","Sulfur Dioxide",3.4507534704218685E-3,"lb/MMBtu",3.3587333778772849E-2,"lb/MW","Part II","U2091409-BAGOUT"]
["861_1",{"$f":"VLOOKUP(A4,Min_Tests!A:AB,2,FALSE)","v":2},"No run level data submitted.",{"$f":"VLOOKUP(A4,Min_Tests!A:AB,5,FALSE)","v":861},861,"1","001","Sulfur Dioxide",8.4666666666666692E-3,"lb/MMBtu",7.71877777777778E-2,"lb/MW","CEMS","","30 Days of CEMS Data"]
["2824_10",{"$f":"VLOOKUP(A5,Min_Tests!A:AB,2,FALSE)","v":3},"No run level data submitted.",{"$f":"VLOOKUP(A5,Min_Tests!A:AB,5,FALSE)","v":2824},2824,"10","u10","Sulfur Dioxide",7.6601195105882132E-3,"lb/MMBtu",8.1963278763293873E-2,"lb/MW","Part II","2006 RATA B","No run level data submitted."]
["2824_10",{"$f":"VLOOKUP(A6,Min_Tests!A:AB,2,FALSE)","v":3},"No run level data submitted.",{"$f":"VLOOKUP(A6,Min_Tests!A:AB,5,FALSE)","v":2824},2824,"10","u10","Sulfur Dioxide",3.9461221721212067E-2,"lb/MMBtu",0.42223507241696911,"lb/MW","Part II","RATA 2007"]
{"$rows_left_out":488}
{"sheet":"Lognormal Template","index":2,"n_rows":165,"n_cols":13,"rows_kept":165,"cut":false,"hidden":false,"merged":[[116,0,116,2],[0,1,0,11],[37,0,37,3],[48,1,48,11],[86,0,86,1],[113,0,113,2],[127,0,127,3],[132,0,132,8],[133,0,133,4],[135,0,135,8],[137,0,137,2]]}
[null,"Emissions (lb/MW)"]
[{"$f":"'UPL Pooled Template '!A1","v":"SO2"},"52071\nSandow\n5A",null,null,null,null,null,null,null,null,null,null,"Outliers Removed"]
[1,0.22871142431791891]
[2,9.6752924775306018E-2]
[3,2.5374296569414579E-2]
[4,6.2900655215158488E-2]
{"$rows_left_out":160}
{"sheet":"QA_Calcs","index":3,"n_rows":105,"n_cols":97,"rows_kept":105,"cut":false,"hidden":false,"merged":[[8,0,8,3],[8,5,8,17],[8,19,8,25],[8,27,8,35],[8,37,8,44]]}
[null,null,null,null,null,null,null,"Anthracite",null,"Anthracite",null,null,"fPM","30B",null,"μg/dscm","No",null,"μg/dscm",{"$f":"1/453592370","v":2.2046226218487758E-9},"lbs/μg",2.8316846592000001E-2,null,null,null,"cm/cf",null,null,null,null,null,"lb/hr",null,null,"lb/MMBtu",null,null,null,null,null,null,null,"Round to",null,null,null,"From ",null,"original database export===>"]
[null,null,null,null,null,null,null,"Bituminous",null,"Bituminous",null,null,"Se","M5",null,"lb/dscf","Yes",null,"ppm",{"$f":"T1/1000","v":2.2046226218487757E-12},"lb/mg",null,null,null,null,null,null,null,null,null,null,null,null,null,null,null,null,null,null,null,null,null,"Same ",null,null,null,"Min ",null,"original database export===>"]
[null,null,null,null,null,null,null,"Lignite",null,"Lignite",null,null,"Pb","M5B",null,"ppm",null,null,null,null,"lb/scf",null,null,null,null,null,null,null,null,null,null,null,null,null,null,null,null,null,null,null,null,null,"Sig Figs ",null,null,null,"Test",null,"original database export===>"]
[null,null,null,null,null,null,null,"Oil",null,"Oil",null,null,"Hg","M29",null,"ppm @ 3% O2",null,null,null,null,null,null,null,null,null,null,null,null,null,null,null,null,null,null,null,null,null,null,null,null,null,null,"as Submitted",null,null,null,"Sheet",null,"original database export===>"]
[null,null,null,null,null,null,null,"Pet Coke",null,"Pet Coke",null,null,"HCl","OTM27",null,"ppm @ 7% O2",null,null,null,null,null,null,null,null,null,null,null,null,null,null,null,null,null,null,null,null,null,null,null,null,null,null,"prior to ",null,null,null,null,null,"original database export===>"]
[null,null,null,null,null,null,null,"Subbituminous",null,"Sub Bituminous",null,null,"SO2","26A",null,null,null,null,null,null,null,null,null,null,null,null,null,null,null,null,null,null,null,null,null,null,null,null,null,null,null,null,"Calc % Diff.",null,null,null,null,null,"original database export===>"]
{"$rows_left_out":100}
{"sheet":"lognormal distribution 99 %","index":4,"n_rows":110,"n_cols":33,"rows_kept":110,"cut":false,"hidden":false,"merged":[]}
[]
[null,null,null,null,null,null,null,null,null,null,null,null,null,null,null,"distribution of Z"]
[null,null,null,null,null,null,null,null,null,null,null,null,null,"Normal "]
[null,null,null,null,null,null,null,null,null,null,null,null,null,"distribution"]
["∆z","z",null,null,null,null,null,null,null,null,null,null,null,null,null,null,null,null,null,null,null,"Absolute values"]
[null,null,null,null,null,null,null,null,null,null,null,null,null,null,null,null,null,null,null,null,null,null,null,null,null,null,null,null,null,"Cumulative","normalization"]
{"$rows_left_out":105}
{"sheet":"Part II","index":5,"n_rows":36,"n_cols":48,"rows_kept":36,"cut":false,"hidden":false,"merged":[]}
["Key","RTI Calculated QA\nlb/MMBtu","Run Grade","Submitted Value","Submitted Value UOM","Use ?","Comment","facility_id","report_id","sampling_port_id","pollutant_id","pollutant_name","run_id","start_datetime","end_datetime","unit_load","fuel_flow_rate","fuel_heating_value","fg_moisture_content","fg_oxygen_content","fg_CO2_content","fg_temperature","test_method","conc","conc_units","conc_ND","conc_MDL","conc2","conc2_units","emission_rate","emission_rate_units","emission_rate_ND","emission_rate_MDL","Calculated conc lb/dscf","19-1\nlb/MMBtu","%diff\n19-1","19-6\nlb/MMBtu","%diff\n19-6","emission_factor","emission_factor_units","emission_factor_ND","emission_factor_MDL","run_pollutant_comment","Fuel1","Fuel1%Btu","Fuel2","Fuel2%Btu","QA Comment"]
[null,null,null,null,null,"No",{"$f":"AV2","v":"Scrubber inlet duct measurement; do not use"},52071,"3-Source Emissions Survey, Inlet Ducts and Stacks","SP03",6,"Sulfur Dioxide (SO2)","1","2009-10-28T12:07:00","2009-10-28T15:07:00",312,null,null,8.64,4.4000000000000004,15,266,"EPA Methods 1, 2, 3A, 4, 6C, 17, 26A, 30B",27.31,"parts per million by volume (dry) (ppmvd)",false,null,null,"",147.37,"pound per hour (lb/hr)",false,null,{"$f":"X2*$J$27","v":4.5334599999999996E-6},{"$f":"AH2*$I$34*20.9/(20.9-T2)","v":5.6619893093333325E-2},{"$f":"(AM2-AI2)/AM2","v":6.6685422222224093E-3},{"$f":"AH2*$K$34*100/U2","v":5.772605733333333E-2},{"$f":"(AM2-AK2)/AM2","v":-1.2737847953216287E-2},5.7000000000000002E-2,"pound per million British Thermal Unit (lb/MMBtu)",false,null,"",null,null,null,null,"Scrubber inlet duct measurement; do not use"]
[null,null,null,null,null,"No",{"$f":"AV3","v":"Scrubber inlet duct measurement; do not use"},52071,"3-Source Emissions Survey, Inlet Ducts and Stacks","SP03",6,"Sulfur Dioxide (SO2)","2","2009-10-28T17:28:00","2009-10-28T18:38:00",313,null,null,null,4.4000000000000004,14.8,null,"EPA Methods 1, 2, 3A, 4, 6C, 17, 26A, 30B",26.38,"parts per million by volume (dry) (ppmvd)",false,null,null,"",164.31,"pound per hour (lb/hr)",false,null,{"$f":"X3*$J$27","v":4.3790799999999996E-6},{"$f":"AH3*$I$34*20.9/(20.9-T3)","v":5.4691789813333329E-2},{"$f":"(AM3-AI3)/AM3","v":5.6038215757576622E-3},{"$f":"AH3*$K$34*100/U3","v":5.651380270270269E-2},{"$f":"(AM3-AK3)/AM3","v":-2.7523685503685259E-2},5.5E-2,"pound per million British Thermal Unit (lb/MMBtu)",false,null,"",null,null,null,null,"Scrubber inlet duct measurement; do not use"]
[null,null,null,null,null,"No","Scrubber inlet duct measurement; do not use",52071,"3-Source Emissions Survey, Inlet Ducts and Stacks","SP03",6,"Sulfur Dioxide (SO2)","3","2009-10-30T09:58:00","2009-10-30T11:50:00",311,null,null,null,4,14.9,null,"EPA Methods 1, 2, 3A, 4, 6C, 17, 26A, 30B",9.31,"parts per million by volume (dry) (ppmvd)",false,null,null,"",54.31,"pound per hour (lb/hr)",false,null,1.54546E-6,1.8844918582248522E-2,8.1621798816566907E-3,1.9810930201342281E-2,-4.2680536912751636E-2,1.9E-2,"pound per million British Thermal Unit (lb/MMBtu)",false,null,"",null,null,null,null,"Scrubber inlet duct measurement; do not use"]
[null,null,null,null,null,"No","Scrubber inlet duct measurement; do not use",52071,"3-Source Emissions Survey, Inlet Ducts and Stacks","SP03",6,"Sulfur Dioxide (SO2)","5","2009-10-30T15:35:00","2009-10-30T18:43:00",314,null,null,null,4.0999999999999996,14.9,null,"EPA Methods 1, 2, 3A, 4, 6C, 17, 26A, 30B",13.35,"parts per million by volume (dry) (ppmvd)",false,null,null,"",75.3,"pound per hour (lb/hr)",false,null,2.2160999999999998E-6,2.7183368535714285E-2,-6.7914272486772282E-3,2.8407724832214765E-2,-5.2137956748695001E-2,2.7E-2,"pound per million British Thermal Unit (lb/MMBtu)",false,null,"",null,null,null,null,"Scrubber inlet duct measurement; do not use"]
[null,null,null,null,null,"No","Scrubber inlet duct measurement; do not use",52071,"3-Source Emissions Survey, Inlet Ducts and Stacks","SP03",6,"Sulfur Dioxide (SO2)","7","2009-11-05T08:30:00","2009-11-05T11:44:00",297,null,null,null,4.0999999999999996,14.9,null,"EPA Methods 1, 2, 3A, 4, 6C, 17, 26A, 30B",null,"parts per million by volume (dry) (ppmvd)",true,0.01,null,"",null,"pound per hour (lb/hr)",true,0.06,{"$f":"AA6*$J$27","v":1.6600000000000001E-9},2.036207380952381E-5,{"$f":"(AP6-AI6)/AP6","v":0.97963792619047629},2.1279194630872485E-5,{"$f":"(AP6-AK6)/AP6","v":0.97872080536912742},null,"pound per million British Thermal Unit (lb/MMBtu)",true,1E-3,"",null,null,null,null,"Scrubber inlet duct measurement; do not use"]
{"$rows_left_out":31}
{"sheet":"ERT","index":6,"n_rows":21,"n_cols":27,"rows_kept":21,"cut":false,"hidden":false,"merged":[]}
["Key","RTI Calculated QA\nlb/MMBtu","Run Grade","Submitted Value","Submitted Value UOM","Use ?","Comment","facility_id","configuration_id","submittal_id","Location","Method","Run","RunDate","Compound","Fwt","DF","lb/dscf","ppm","ppm converted to lb/dscf","Estimated O2%, assuming lb/MMBtu is correct","ppm@7%O2","ng/dscm","ng/dscm@7%O2","ppm @ 7% converted to lb/dscf","Equation 19-1","lb/mmBtuO2"]
[null,{"$f":"Z2","v":2.1782318412605924E-2},"A",{"$f":"AA2","v":2.1816442789244734E-2},{"$f":"AA1","v":"lb/mmBtuO2"},"Yes",null,52071,"5A",834,"Stack","Method 6C","1","2010-03-03","Sulfur Dioxide",64.06,1.0971299999999999E-5,1.8240889644432909E-6,10.971299999999999,{"$f":"S2*$J$12","v":1.8212357999999999E-6},{"$f":"20.9-(S2/V2*(20.9-7))","v":3.6700000000000017},8.850903656413232,29223491.146290764,23575538.417495161,{"$f":"V2*$J$12","v":1.4692500069645966E-6},{"$f":"Y2*$I$19*20.9/(20.9-7)","v":2.1782318412605924E-2},2.1816442789244734E-2]
[null,{"$f":"Z3","v":9.2146818686114351E-3},"A",{"$f":"AA3","v":9.2291176724012356E-3},{"$f":"AA1","v":"lb/mmBtuO2"},"Yes",null,52071,"5A",834,"Stack","Method 6C","2","2010-03-04","Sulfur Dioxide",64.06,4.617E-6,7.6762268362315079E-7,4.617,{"$f":"S3*$J$12","v":7.6642200000000006E-7},{"$f":"20.9-(S3/V3*(20.9-7))","v":3.759999999999998},3.7442415402567093,12297982.793508925,9973276.5945025682,{"$f":"V3*$J$12","v":6.2154409568261376E-7},{"$f":"Y3*$I$19*20.9/(20.9-7)","v":9.2146818686114351E-3},9.2291176724012356E-3]
[null,2.4166305160278749E-3,"A",{"$f":"AA4","v":2.4204164312075023E-3},{"$f":"AA1","v":"lb/mmBtuO2"},"Yes",null,52071,"5A",834,"Stack","Method 6C","3","2010-03-05","Sulfur Dioxide",64.06,1.2164999999999999E-6,2.0225535946016088E-7,1.2164999999999999,{"$f":"S4*$J$12","v":2.0193899999999999E-7},3.6799999999999997,0.98195993031358875,3240306.7074515065,2615578.5849927953,1.6300534843205574E-7,2.4166305160278749E-3,2.4204164312075023E-3]
[null,null,null,null,null,null,null,52071,"5A",834,"Stack","Method 6C","1","2010-03-03","Sulfur Dioxide",null,null,null,11,{"$f":"S5*$J$12","v":1.826E-6},3.67,8.8699999999999992,null,null,1.47242E-6,2.1829315041726617E-2,2.18E-2]
[null,null,"Run 1",{"$f":"D2*B$21","v":0.22871142431791891},"lb/MWh",null,null,52071,"5A",834,"Stack","Method 6C","2","2010-03-04","Sulfur Dioxide",null,null,null,4.62,7.6692000000000004E-7,3.76,3.75,null,null,6.2249999999999997E-7,9.2288535971223017E-3,9.2300000000000004E-3]
{"$rows_left_out":16}
{"sheet":"SO2_CEMS","index":7,"n_rows":1444,"n_cols":13,"rows_kept":1444,"cut":false,"hidden":false,"merged":[]}
["facility_id","boiler_id","configuration_id","submittal_id","HAPs_group","CEMS_type","sample_date","emission_value_lb/MMBtu","emission_value_ppmvd","emission_value_hourly","emission_cem_units","oxygen_content","standard_fuel_f_factor"]
[68029,{"$f":"IF(D2=2027,\"BLR1\",\"BLR2\")","v":"BLR2"},{"$f":"IF(D2=2027,\"Unit_1\",\"Unit_2\")","v":"Unit_2"},2028,"acid gas","SO2","2010-03-01",0,"0.32","ppm @ 7% O2","0.32","0.0DN","9780"]
[68029,"BLR2","Unit_2",2028,"acid gas","SO2","2010-03-01T01:00:00",0,"-0.01","ppm @ 7% O2","-0.01","0.0DN","9780"]
[68029,"BLR2","Unit_2",2028,"acid gas","SO2","2010-03-01T02:00:00",0,"-0.02","ppm @ 7% O2","-0.02","0.0DN","9780"]
[68029,"BLR2","Unit_2",2028,"acid gas","SO2","2010-03-01T03:00:00",0,"-0.02","ppm @ 7% O2","-0.02","0.0DN","9780"]
[68029,"BLR2","Unit_2",2028,"acid gas","SO2","2010-03-01T04:00:00",0,"-0.02","ppm @ 7% O2","-0.02","0.0DN","9780"]
{"$rows_left_out":1439}
{"sheet":"sampling_runs","index":8,"n_rows":7,"n_cols":34,"rows_kept":7,"cut":false,"hidden":false,"merged":[]}
["facility_id","report_id","sampling_port_id","run_id","pollutant_name","conc","conc_units","start_datetime","end_datetime","unit_load","net_generation","fg_moisture_content","fg_flow_rate","fg_flow_rate_units","standard_temperature","standard_pressure","normal_temperature","normal_pressure","fg_oxygen_content","fg_CO2_content","fg_temperature","fg_pressure","Hg_loi","test_method","run_comments","fuel_id","fuel_unit_load","fuel_flow_rate","fuel_ash","fuel_heating_value","fuel_sulfur","O2 Based Calc","CO2 Based Calc"]
[2824,"2006 RATA A","bag10","average","Sulfur Dioxide (SO2)",21,"parts per million by volume (dry) (ppmvd)","2006-01-12","2006-01-12",55,55,15.8,157400,"dscfm",210,null,null,null,6.3,13.3,210,null,null,"6C",null,"subbituminous",55,null,4.5999999999999996,9742,0.32,{"$f":"F2*0.000000166*9820*20.9/(20.9-S2)","v":4.9004086849315079E-2},{"$f":"F2*0.000000166*1840*100/T2","v":4.822736842105263E-2},{"$f":"AG2/AF2","v":0.98414992548170899}]
[2824,"2006 RATA B","bag10","average","Sulfur Dioxide (SO2)",3.3,"parts per million by volume (dry) (ppmvd)","2006-08-17","2006-08-17",56,56,15.75,157787,"dscfm",204,null,null,null,6.29,13.32,204,null,null,"6C 7E",null,"subbituminous",56,null,4.63,9344,0.32,{"$f":"F3*0.000000166*9820*20.9/(20.9-S3)","v":7.6953714168377816E-3},7.5672072072072065E-3,{"$f":"AG3/AF3","v":0.98334528605725946}]
[2824,"RATA 2005","bag10","average","Sulfur Dioxide (SO2)",26.6,"parts per million by volume (dry) (ppmvd)","2005-09-22","2005-09-22",62,62,15.75,157387,"dscfm",218,null,null,null,15.75,13.32,218,null,null,"Method 6C 7E",null,"subbituminous",60,null,5.31,9304,0.32,0.17597066267961173,6.0996276276276289E-2,0.34662753067726798]
[2824,"RATA 2007","bag10","average","Sulfur Dioxide (SO2)",17,"parts per million by volume (dry) (ppmvd)","2007-07-11","2007-07-11",54,54,15.75,157387,"dscfm",206,null,null,null,6.29,13.32,206,null,null,"Methods 6C and 7E",null,"subbituminous",54,null,4.58,9352,0.33,3.964282245037646E-2,3.8982582582582588E-2,0.98334528605725946]
[2824,"RATA 2008","bag10","average","Sulfur Dioxide (SO2)",20,"parts per million by volume (dry) (ppmvd)","2008-08-13","2008-08-13",58,58,15.75,157387,"dscfm",205,null,null,null,6.29,13.32,205,null,null,"Methods 6C and 7E",null,"subbituminous",58,null,4.7699999999999996,9308,0.36,4.66386146475017E-2,4.5861861861861856E-2,0.98334528605725957]
{"$rows_left_out":2}
{"sheet":"sampling_run_pollutants1","index":9,"n_rows":7,"n_cols":18,"rows_kept":7,"cut":false,"hidden":false,"merged":[]}
["facility_id","report_id","sampling_port_id","run_id","pollutant_name","conc","conc_units","conc_ND","conc_MDL","emission_rate","emission_rate_units","emission_rate_ND","emission_rate_MDL","emission_factor","emission_factor_units","emission_factor_ND","emission_factor_MDL","run_pollutant_comment"]
[2824,"2006 RATA A","bag10","average","Sulfur Dioxide (SO2)",21,"parts per million by volume (dry) (ppmvd)",false,null,null,null,false,null,null,null,false]
[2824,"2006 RATA B","bag10","average","Sulfur Dioxide (SO2)",3.3,"parts per million by volume (dry) (ppmvd)",false,null,null,null,false,null,null,null,false]
[2824,"RATA 2005","bag10","average","Sulfur Dioxide (SO2)",26.6,"parts per million by volume (dry) (ppmvd)",false,null,null,null,false,null,null,null,false]
[2824,"RATA 2007","bag10","average","Sulfur Dioxide (SO2)",17,"parts per million by volume (dry) (ppmvd)",false,null,null,null,false,null,null,null,false]
[2824,"RATA 2008","bag10","average","Sulfur Dioxide (SO2)",20,"parts per million by volume (dry) (ppmvd)",false,null,null,null,false,null,null,null,false]
{"$rows_left_out":2}
{"sheet":"UPL Normal","index":10,"n_rows":108,"n_cols":6,"rows_kept":108,"cut":false,"hidden":false,"merged":[[47,16,48,16]]}
["Emissions (lb/MW)","SO2"]
[null,52071]
["ORIS/Facility/Unit","Sandow"]
["Runs","5A"]
[1,2.5374296569414579E-2]
[2,6.2900655215158488E-2]
{"$rows_left_out":103}
{"sheet":"UPL Pooled Template ","index":11,"n_rows":107,"n_cols":12,"rows_kept":107,"cut":false,"hidden":false,"merged":[[0,1,0,11],[37,0,37,3]]}
[{"$f":"'UPL Normal'!B1","v":"SO2"},"Emissions (lb/MW)"]
["Runs","52071\nSandow\n5A"]
[1,2.5374296569414579E-2]
[2,6.2900655215158488E-2]
[3,9.4350982822737725E-2]
[4,9.6752924775306018E-2]
{"$rows_left_out":101}