{"text_format":"1","workbook":"xlsx","n_sheets":12,"sheets":["Min_Tests","Variability","Lognormal Template","QA_Calcs","lognormal distribution 99 %","Part II","ERT","SO2_CEMS","sampling_runs","sampling_run_pollutants1","UPL Normal","UPL Pooled Template "],"not_rendered":{"charts":2,"images":31,"macros":1,"external_links":0,"defined_names":27,"comments":1,"pivot_tables":0},"unopened":[],"bounds":{"document_bytes":16777216,"sheet_cells":100000,"rows_first":2000,"rows_last":500,"rows_between":2000,"halvings":0,"cell_chars":16384,"cell_head_chars":4096},"cells_cut":0,"cells_raw":0,"read":"whole","date_system":"1900"}

{"sheet":"Min_Tests","index":0,"n_rows":293,"n_cols":62,"rows_kept":293,"cut":false,"hidden":false,"merged":[]}
["Key f_b","Rank","Reason_for_Removal as top ranked unit for new source floor","primary_fuel","ORIS code","Plant Name","physical_state","Unit Number","boiler_id","Unit Type","boiler_type","MWe_capacity","max_heat_input","Unit_heat_rate","Fuel types","fuel","Sulfur Dioxide - CEMS","Sulfur Dioxide MW - CEMS","Sulfur Dioxide - ERT","Sulfur Dioxide MW - ERT","Sulfur Dioxide - ETTS","Sulfur Dioxide MW - ETTS","Sulfur Dioxide - Part II","Sulfur Dioxide MW - Part II","Sulfur Dioxide - min","Sulfur Dioxide MW - min","control_group_1","control_type_1","install_date_1","control_group_2","control_type_2","install_date_2","control_group_3","control_type_3","install_date_3","control_group_4","control_type_4","install_date_4","control_group_5","control_type_5","install_date_5","control_group_6","control_type_6","install_date_6","control_group_7","control_type_7","install_date_7","control_group_8","control_type_8","install_date_8","control_group_9","control_type_9","install_date_9","control_group_10","control_type_10","install_date_10","control_group_11","control_type_11","install_date_11","control_group_12","control_type_12","install_date_12"]
[{"$f":"E2&\"_\"&I2","v":"1008_2"},1,"No run level data submitted.","coal",1008,"R. Gallagher","IN","2-2007","2","Conventional Boiler","Wall firing - front firing",150,1460,9.7333333333333325,"coal - bituminous","bituminous",null,null,null,null,null,null,3.2359930321660475E-3,3.1496998846416192E-2,3.2359930321660475E-3,3.1496998846416192E-2,"PM control","Fabric Filter, shake and deflate","2007-12-01","","",null,"","",null,"","",null,"","",null,"","",null,"","",null,"","",null,"","",null,"","",null,"","",null,"",""]
["861_1",2,"No run level data submitted.","coal",861,"Coffeen","IL","001","1","Conventional Boiler","Cyclone firing",360,3282,9.1166666666666671,"subbituminous","subbituminous",8.4666666666666692E-3,7.71877777777778E-2,null,null,null,null,null,null,8.4666666666666692E-3,7.71877777777778E-2,"NOx control","Selective Catalytic Reduction","2003-04-01","PM control","Electrostatic precipitator, cold side, w/ flue gas conditioning","1973-01-01","SO2 control","Wet FGD - Unspecified","2009-11-01","","",null,"","",null,"","",null,"","",null,"","",null,"","",null,"","",null,"","",null,"",""]
["2824_10",3,"No run level data submitted.","coal",2824,"Stanton","ND","u10","10","Conventional Boiler","Tangential firing",60,642,10.7,"coal - subbituminous","subbituminous",null,null,null,null,null,null,7.6601195105882132E-3,8.1963278763293873E-2,7.6601195105882132E-3,8.1963278763293873E-2,"SO2 control","Dry FGD - Spray Dryer","2000-01-01","PM control","Fabric Filter, reverse air","2000-01-01","","",null,"","",null,"","",null,"","",null,"","",null,"","",null,"","",null,"","",null,"","",null,"",""]
["68029_BLR2",4,"No run level data submitted.","coal",68029,"AES Puerto Rico Cogeneration Facility","PR","Unit_2","BLR2","Fluidized bed firing","Fluidized bed firing",255,2461.4,9.652549019607843,"bituminous","bituminous",8.7100000000000025E-3,8.4073701960784342E-2,null,null,null,null,null,null,8.7100000000000025E-3,8.4073701960784342E-2,"NOx control","Selective Noncatalytic Reduction",null,"SO2 control","Dry FGD - Spray Dryer",null,"PM control","Electrostatic precipitator, cold side, w/o flue gas conditioning",null,"","",null,"","",null,"","",null,"","",null,"","",null,"","",null,"","",null,"","",null,"",""]
["56068_1",5,"Unit began operations February 2010; only 1 test available. Insufficient data to determine rate that is achievable in practice with long-term continuous unit operations.","coal",56068,"Elm Road Generating Station","WI","ERGS-B1","1","Conventional Boiler","Wall firing - unspecified",677,6515,9.6233382570162487,"bituminous","bituminous",null,null,null,null,8.9999999999999993E-3,8.6610044313146228E-2,null,null,8.9999999999999993E-3,8.6610044313146228E-2,"NOx control","Selective Catalytic Reduction","2009-10-01","PM control","Fabric Filter, pulse","2009-10-01","SO2 control","Wet FGD - Spray Type","2009-10-01","Other control","Wet electrostatic precipitator","2009-10-01","","",null,"","",null,"","",null,"","",null,"","",null,"","",null,"","",null,"",""]
["68029_BLR1",6,"No run level data submitted.","coal",68029,"AES Puerto Rico Cogeneration Facility","PR","Unit_1","BLR1","Fluidized bed firing","Fluidized bed firing",255,2461.4,9.652549019607843,"bituminous","bituminous",9.0000000000000045E-3,8.6872941176470625E-2,null,null,null,null,null,null,9.0000000000000045E-3,8.6872941176470625E-2,"NOx control","Selective Noncatalytic Reduction",null,"SO2 control","Dry FGD - Spray Dryer",null,"PM control","Electrostatic precipitator, cold side, w/o flue gas conditioning",null,"","",null,"","",null,"","",null,"","",null,"","",null,"","",null,"","",null,"","",null,"",""]
["52071_5A",7,null,"coal",52071,"Sandow Station","TX","5A","5A","Fluidized bed firing","Fluidized bed firing",282.35000000000002,2960,10.483442535859748,"lignite","lignite",null,null,1.1155325630951158E-2,0.11694621522087985,null,null,2.5666666666666667E-2,0.26907502508706688,1.1155325630951158E-2,0.11694621522087985,"NOx control","Selective Noncatalytic Reduction","2009-08-01","Other control","Activated carbon injection","2009-08-01","SO2 control","Dry FGD - Circulating Dry Scrubber","2009-08-01","PM control","Fabric Filter, pulse","2009-08-01","","",null,"","",null,"","",null,"","",null,"","",null,"","",null,"","",null,"",""]
["1893_3",8,null,"coal",1893,"Boswell Energy Center","MN","BEC3","3","Conventional Boiler","Tangential firing",371.3,4115,11.08268246700781,"subbituminous","subbituminous",1.1666666666666669E-2,0.12929796211509115,null,null,null,null,null,null,1.1666666666666669E-2,0.12929796211509115,"NOx control","Selective Catalytic Reduction",null,"SO2 control","Wet FGD - Spray Type","2009-01-01","Other control","Activated carbon injection",null,"PM control","Fabric Filter, unspecified","2009-01-01","","",null,"","",null,"","",null,"","",null,"","",null,"","",null,"","",null,"",""]
["6016_1",9,null,"coal",6016,"Duck Creek","IL","001","1","Conventional Boiler","Wall firing - unspecified",400,4500,11.25,"subbituminous","subbituminous",null,null,null,null,null,null,1.3299999999999999E-2,0.14962499999999998,1.3299999999999999E-2,0.14962499999999998,"NOx control","Selective Catalytic Reduction","2003-06-01","PM control","Electrostatic precipitator, cold side, unspecified","2009-03-01","SO2 control","Wet FGD - Venturi Type","2009-03-01","","",null,"","",null,"","",null,"","",null,"","",null,"","",null,"","",null,"","",null,"",""]
["641_5",10,null,"coal",641,"Crist","FL","Unit 5","5","Conventional Boiler","Tangential firing",82,817.82999999999993,9.9735365853658529,"bituminous","bituminous",2.5000000000000012E-2,0.24933841463414644,null,null,null,null,null,null,2.5000000000000012E-2,0.24933841463414644,"NOx control","Selective Noncatalytic Reduction","2006-04-01","PM control","Electrostatic precipitator, hot side, w/ flue gas conditioning","2008-03-01","PM control","Electrostatic precipitator, cold side, w/o flue gas conditioning","1976-01-01","SO2 control","Wet FGD - Spray Type","2009-12-01","","",null,"","",null,"","",null,"","",null,"","",null,"","",null,"","",null,"",""]
["641_6",11,null,"coal",641,"Crist","FL","Unit 6","6","Conventional Boiler","Wall firing - front firing",320,3193.348,9.9792124999999992,"bituminous","bituminous",2.5000000000000012E-2,0.24948031250000011,null,null,null,null,null,null,2.5000000000000012E-2,0.24948031250000011,"NOx control","Selective Noncatalytic Reduction","2005-11-01","PM control","Electrostatic precipitator, cold side, w/o flue gas conditioning","1994-01-01","SO2 control","Wet FGD - Spray Type","2009-12-01","","",null,"","",null,"","",null,"","",null,"","",null,"","",null,"","",null,"","",null,"",""]
["641_7",12,null,"coal",641,"Crist","FL","Unit 7","7","Conventional Boiler","Wall firing - front firing",500,5279.7920000000004,10.559584000000001,"bituminous","bituminous",2.5000000000000012E-2,0.26398960000000016,null,null,null,null,null,null,2.5000000000000012E-2,0.26398960000000016,"NOx control","Selective Catalytic Reduction","2005-04-01","PM control","Electrostatic precipitator, cold side, w/o flue gas conditioning","2004-04-01","SO2 control","Wet FGD - Spray Type","2009-12-01","","",null,"","",null,"","",null,"","",null,"","",null,"","",null,"","",null,"","",null,"",""]
["641_4",13,null,"coal",641,"Crist","FL","Unit 4","4","Conventional Boiler","Tangential firing",82,868.84199999999998,10.595634146341464,"bituminous","bituminous",2.5000000000000012E-2,0.26489085365853671,null,null,null,null,null,null,2.5000000000000012E-2,0.26489085365853671,"NOx control","Selective Noncatalytic Reduction","2006-04-01","PM control","Electrostatic precipitator, hot side, w/o flue gas conditioning","2008-03-01","PM control","Electrostatic precipitator, cold side, w/o flue gas conditioning","1976-01-01","SO2 control","Wet FGD - Spray Type","2009-12-01","","",null,"","",null,"","",null,"","",null,"","",null,"","",null,"","",null,"",""]
["10768_S-1715-3-13",14,null,"coal",10768,"Rio Bravo Jasmin","CA","Config 1","S-1715-3-13","Fluidized bed firing","Fluidized bed firing",36,412.16,11.44888888888889,"bituminous","bituminous",2.3866666666666678E-2,0.273246814814815,null,null,null,null,2.3199999999999998E-2,0.26561422222222225,2.3199999999999998E-2,0.26561422222222225,"NOx control","Selective Noncatalytic Reduction","1990-03-01","PM control","Fabric Filter, reverse air","1990-03-01","","",null,"","",null,"","",null,"","",null,"","",null,"","",null,"","",null,"","",null,"","",null,"",""]
["3845_BD21",15,null,"coal",3845,"TransAlta Centralia Generation","WA","BW21CONFIG","BD21","Conventional Boiler","Tangential firing",603,7743,12.840796019900498,"subbituminous","subbituminous",5.7066666666666675E-2,0.73278142620232189,null,null,null,null,2.1299999999999999E-2,0.27350895522388058,2.1299999999999999E-2,0.27350895522388058,"PM control","Electrostatic precipitator, hot side, w/o flue gas conditioning","1972-01-01","SO2 control","Wet FGD - Spray Type","2002-06-01","","",null,"","",null,"","",null,"","",null,"","",null,"","",null,"","",null,"","",null,"","",null,"",""]
["10769_C-E CONTRACT 24687",16,null,"coal",10769,"Rio Bravo Poso","CA","Config 1","C-E CONTRACT 24687","Fluidized bed firing","Fluidized bed firing",36,407.93,11.331388888888888,"bituminous","bituminous",2.5033333333333345E-2,0.2836624351851853,null,null,null,null,2.4500000000000001E-2,0.27761902777777775,2.4500000000000001E-2,0.27761902777777775,"NOx control","Selective Noncatalytic Reduction","1990-03-01","PM control","Fabric Filter, reverse air","1990-03-01","","",null,"","",null,"","",null,"","",null,"","",null,"","",null,"","",null,"","",null,"","",null,"",""]
["6264_1",17,null,"coal",6264,"Mountaineer","WV","Mt-1","1","Conventional Boiler","Wall firing - opposed firing",1320,11960,9.0606060606060606,"bituminous","bituminous",3.1400000000000011E-2,0.28450303030303042,null,null,null,null,null,null,3.1400000000000011E-2,0.28450303030303042,"NOx control","Selective Catalytic Reduction","2002-01-01","Other control","Dry sorbent injection","2007-01-01","PM control","Electrostatic precipitator, cold side, w/o flue gas conditioning","1980-09-01","SO2 control","Wet FGD - Spray Type","2007-01-01","","",null,"","",null,"","",null,"","",null,"","",null,"","",null,"","",null,"",""]
["708_2",18,null,"coal",708,"Hammond","GA","Unit 2","2","Conventional Boiler","Wall firing - front firing",115,1138.0319999999999,9.895930434782608,"bituminous","bituminous",2.9366666666666673E-2,0.29061049043478265,null,null,null,null,null,null,2.9366666666666673E-2,0.29061049043478265,"PM control","Electrostatic precipitator, cold side, w/ flue gas conditioning","1969-04-01","SO2 control","Wet FGD - Spray Type","2008-05-01","","",null,"","",null,"","",null,"","",null,"","",null,"","",null,"","",null,"","",null,"","",null,"",""]
["10771_10771-01",19,null,"coal",10771,"Hopewell","VA","1 & 2","10771-01","Conventional Boiler","Stoker - spreader",34,433,12.735294117647058,"bituminous","bituminous",null,null,2.3157477373991747E-2,0.29117122286416097,null,null,null,null,2.3157477373991747E-2,0.29117122286416097,"NOx control","Selective Noncatalytic Reduction","1992-04-01","NOx control","Selective Noncatalytic Reduction","1992-04-01","PM control","Multiple cyclone","1992-04-01","PM control","Multiple cyclone","1992-04-01","SO2 control","Dry FGD - Spray Dryer","1992-04-01","SO2 control","Dry FGD - Spray Dryer","1992-04-01","PM control","Fabric Filter, pulse","1992-04-01","PM control","Fabric Filter, pulse","1992-04-01","","",null,"","",null,"","",null,"",""]
["10771_10771-02",20,null,"coal",10771,"Hopewell","VA","1 & 2","10771-02","Conventional Boiler","Stoker - underfeed",34,422,12.411764705882353,"bituminous","bituminous",null,null,2.3157477373991747E-2,0.29117122286416097,null,null,null,null,2.3157477373991747E-2,0.29117122286416097,"NOx control","Selective Noncatalytic Reduction","1992-04-01","NOx control","Selective Noncatalytic Reduction","1992-04-01","PM control","Multiple cyclone","1992-04-01","PM control","Multiple cyclone","1992-04-01","SO2 control","Dry FGD - Spray Dryer","1992-04-01","SO2 control","Dry FGD - Spray Dryer","1992-04-01","PM control","Fabric Filter, pulse","1992-04-01","PM control","Fabric Filter, pulse","1992-04-01","","",null,"","",null,"","",null,"",""]
["708_3",21,null,"coal",708,"Hammond","GA","Unit 3","3","Conventional Boiler","Wall firing - front firing",115,1141.3920000000001,9.9251478260869561,"bituminous","bituminous",2.9366666666666673E-2,0.29146850782608702,null,null,null,null,null,null,2.9366666666666673E-2,0.29146850782608702,"PM control","Electrostatic precipitator, cold side, w/ flue gas conditioning","1968-12-01","SO2 control","Wet FGD - Spray Type","2008-05-01","","",null,"","",null,"","",null,"","",null,"","",null,"","",null,"","",null,"","",null,"","",null,"",""]
["708_1",22,null,"coal",708,"Hammond","GA","Unit 1","1","Conventional Boiler","Wall firing - front firing",115,1158.752,10.076104347826087,"bituminous","bituminous",2.9366666666666673E-2,0.29590159768115948,null,null,null,null,null,null,2.9366666666666673E-2,0.29590159768115948,"PM control","Electrostatic precipitator, cold side, w/ flue gas conditioning","1971-02-01","SO2 control","Wet FGD - Spray Type","2008-05-01","","",null,"","",null,"","",null,"","",null,"","",null,"","",null,"","",null,"","",null,"","",null,"",""]
["54081_3A",23,null,"coal",54081,"Spruance Genco, LLC","VA","GEN3","3A","Conventional Boiler","Stoker - underfeed",28.7,375,13.066202090592334,"bituminous","bituminous",2.2700000000000008E-2,0.29660278745644608,6.5271065175803791E-2,0.85284492825527602,null,null,2.5246942176443497E-2,0.32988164864690978,2.2700000000000008E-2,0.29660278745644608,"SO2 control","Dry FGD - Spray Dryer","1992-05-01","SO2 control","Dry FGD - Spray Dryer","1992-05-01","PM control","Fabric Filter, pulse","1992-05-01","PM control","Fabric Filter, pulse","1992-05-01","","",null,"","",null,"","",null,"","",null,"","",null,"","",null,"","",null,"",""]
["54081_3B",24,null,"coal",54081,"Spruance Genco, LLC","VA","GEN3","3B","Conventional Boiler","Stoker - underfeed",28.7,375,13.066202090592334,"bituminous","bituminous",2.2700000000000008E-2,0.29660278745644608,6.5271065175803791E-2,0.85284492825527602,null,null,2.5246942176443497E-2,0.32988164864690978,2.2700000000000008E-2,0.29660278745644608,"SO2 control","Dry FGD - Spray Dryer","1992-05-01","SO2 control","Dry FGD - Spray Dryer","1992-05-01","PM control","Fabric Filter, pulse","1992-05-01","PM control","Fabric Filter, pulse","1992-05-01","","",null,"","",null,"","",null,"","",null,"","",null,"","",null,"","",null,"",""]
["3179_1",25,null,"coal",3179,"Hatfield's Ferry Power Station","PA","001","1","Conventional Boiler","Wall firing - opposed firing",590,5700,9.6610169491525415,"bituminous","bituminous",null,null,3.1524908057705477E-2,0.30456267106596813,null,null,null,null,3.1524908057705477E-2,0.30456267106596813,"PM control","Electrostatic precipitator, cold side, unspecified","1969-01-01","SO2 control","Wet FGD - Spray Type","2009-06-01","","",null,"","",null,"","",null,"","",null,"","",null,"","",null,"","",null,"","",null,"","",null,"",""]
["708_4",26,null,"coal",708,"Hammond","GA","Unit 4","4","Conventional Boiler","Wall firing - front firing",520,5458.53,10.497173076923076,"bituminous","bituminous",2.9366666666666673E-2,0.30826698269230773,null,null,null,null,null,null,2.9366666666666673E-2,0.30826698269230773,"NOx control","Selective Catalytic Reduction","2002-05-01","PM control","Electrostatic precipitator, cold side, w/ flue gas conditioning","1970-12-01","SO2 control","Wet FGD - Spray Type","2008-05-01","","",null,"","",null,"","",null,"","",null,"","",null,"","",null,"","",null,"","",null,"",""]
["54081_2A",27,null,"coal",54081,"Spruance Genco, LLC","VA","GEN2","2A","Conventional Boiler","Stoker - underfeed",28.7,375,13.066202090592334,"bituminous","bituminous",2.410000000000001E-2,0.31489547038327537,6.5675669546852847E-2,0.85813157073413993,null,null,null,null,2.410000000000001E-2,0.31489547038327537,"SO2 control","Dry FGD - Spray Dryer","1992-05-01","SO2 control","Dry FGD - Spray Dryer","1992-05-01","PM control","Fabric Filter, pulse","1992-05-01","PM control","Fabric Filter, pulse","1992-05-01","","",null,"","",null,"","",null,"","",null,"","",null,"","",null,"","",null,"",""]
["54081_2B",28,null,"coal",54081,"Spruance Genco, LLC","VA","GEN2","2B","Conventional Boiler","Stoker - underfeed",28.7,375,13.066202090592334,"bituminous","bituminous",2.410000000000001E-2,0.31489547038327537,6.5675669546852847E-2,0.85813157073413993,null,null,null,null,2.410000000000001E-2,0.31489547038327537,"SO2 control","Dry FGD - Spray Dryer","1992-05-01","SO2 control","Dry FGD - Spray Dryer","1992-05-01","PM control","Fabric Filter, pulse","1992-05-01","PM control","Fabric Filter, pulse","1992-05-01","","",null,"","",null,"","",null,"","",null,"","",null,"","",null,"","",null,"",""]
["3845_BD22",29,null,"coal",3845,"TransAlta Centralia Generation","WA","BW22CONFIG","BD22","Conventional Boiler","Tangential firing",567,7743,13.656084656084657,"subbituminous","subbituminous",5.2499999999999984E-2,0.71694444444444427,null,null,null,null,2.3333333333333334E-2,0.31864197530864202,2.3333333333333334E-2,0.31864197530864202,"PM control","Electrostatic precipitator, hot side, w/o flue gas conditioning","1971-12-01","SO2 control","Wet FGD - Spray Type","2001-10-01","","",null,"","",null,"","",null,"","",null,"","",null,"","",null,"","",null,"","",null,"","",null,"",""]
["2324_3",30,null,"coal",2324,"Reid Gardner","NV","3","3","Conventional Boiler","Wall firing - front firing",111,1237,11.144144144144144,"coal - bituminous, other non-fossil fuel (specify)","bituminous",null,null,null,null,null,null,2.9266666666666673E-2,0.32615195195195201,2.9266666666666673E-2,0.32615195195195201,"PM control","Fabric Filter, pulse","2009-02-01","SO2 control","Wet FGD - Venturi Type","1976-07-01","","",null,"","",null,"","",null,"","",null,"","",null,"","",null,"","",null,"","",null,"","",null,"",""]
["52071_5B",31,null,"coal",52071,"Sandow Station","TX","5B","5B","Fluidized bed firing","Fluidized bed firing",282.35000000000002,2960,10.483442535859748,"lignite","lignite",null,null,4.7983219701493718E-2,0.50302932642614273,null,null,3.2000000000000001E-2,0.33547016114751194,3.2000000000000001E-2,0.33547016114751194,"NOx control","Selective Noncatalytic Reduction","2009-07-01","Other control","Activated carbon injection","2009-08-01","SO2 control","Dry FGD - Circulating Dry Scrubber","2009-07-01","PM control","Fabric Filter, pulse","2009-07-01","","",null,"","",null,"","",null,"","",null,"","",null,"","",null,"","",null,"",""]
["10384_1A",32,null,"coal",10384,"Edgecombe Genco, LLC","NC","Gen 1","1A","Conventional Boiler","Stoker - overfeed",30.5,375,12.295081967213115,"bituminous","bituminous",2.7800000000000009E-2,0.34180327868852467,null,null,null,null,null,null,2.7800000000000009E-2,0.34180327868852467,"SO2 control","Dry FGD - Spray Dryer","1990-10-01","SO2 control","Dry FGD - Spray Dryer","1990-10-01","PM control","Fabric Filter, reverse air","1990-10-01","PM control","Fabric Filter, pulse","1990-10-01","","",null,"","",null,"","",null,"","",null,"","",null,"","",null,"","",null,"",""]
["10384_1B",33,null,"coal",10384,"Edgecombe Genco, LLC","NC","Gen 1","1B","Conventional Boiler","Stoker - overfeed",30.5,375,12.295081967213115,"bituminous","bituminous",2.7800000000000009E-2,0.34180327868852467,null,null,null,null,null,null,2.7800000000000009E-2,0.34180327868852467,"SO2 control","Dry FGD - Spray Dryer","1990-10-01","SO2 control","Dry FGD - Spray Dryer","1990-10-01","PM control","Fabric Filter, reverse air","1990-10-01","PM control","Fabric Filter, pulse","1990-10-01","","",null,"","",null,"","",null,"","",null,"","",null,"","",null,"","",null,"",""]
["2706_1",34,null,"coal",2706,"Asheville Steam Electric Plant","NC","Ash_Cfg_1d","1","Conventional Boiler","Wall firing - front firing",207,1914,9.2463768115942031,"bituminous","bituminous",null,null,5.1660855288056161E-2,0.47767573440260624,null,null,3.7999999999999999E-2,0.35136231884057972,3.7999999999999999E-2,0.35136231884057972,"NOx control","Selective Catalytic Reduction","2007-06-14","PM control","Electrostatic precipitator, cold side, w/o flue gas conditioning","2005-11-17","SO2 control","Wet FGD - Spray/Tray Type","2005-11-17","","",null,"","",null,"","",null,"","",null,"","",null,"","",null,"","",null,"","",null,"",""]
["56224_BLR100",35,null,"coal",56224,"TS Power Plant","NV","TSPower","BLR100","Conventional Boiler","Wall firing - opposed firing",242,2112,8.7272727272727266,"subbituminous","subbituminous",4.2700000000000009E-2,0.37265454545454552,null,null,null,null,4.1666666666666664E-2,0.36363636363636359,4.1666666666666664E-2,0.36363636363636359,"NOx control","Selective Catalytic Reduction","2008-03-01","Other control","Activated carbon injection","2008-03-01","SO2 control","Dry FGD - Spray Dryer","2008-03-01","PM control","Fabric Filter, pulse","2008-01-01","","",null,"","",null,"","",null,"","",null,"","",null,"","",null,"","",null,"",""]
["1082_4",36,null,"coal",1082,"Walter Scott Jr. Energy Center","IA","4","4","Conventional Boiler","Wall firing - unspecified",850,7675,9.0294117647058822,"subbituminous","subbituminous",7.8E-2,0.70429411764705885,null,null,null,null,4.1000000000000002E-2,0.37020588235294116,4.1000000000000002E-2,0.37020588235294116,"NOx control","Selective Catalytic Reduction","2007-02-01","Other control","Activated carbon injection","2007-02-01","SO2 control","Dry FGD - Circulating Dry Scrubber","2007-02-01","PM control","Fabric Filter, pulse","2007-02-01","","",null,"","",null,"","",null,"","",null,"","",null,"","",null,"","",null,"",""]
["10774_1",37,null,"coal",10774,"Southampton Power Station","VA","Unit 1 & 2","1","Conventional Boiler","Stoker - spreader",34,442,13,"bituminous","bituminous",null,null,2.8694882963040458E-2,0.37514339638445543,null,null,null,null,2.8694882963040458E-2,0.37514339638445543,"PM control","Multiple cyclone","1992-03-01","PM control","Multiple cyclone","1992-03-01","SO2 control","Dry FGD - Spray Dryer","1992-03-01","SO2 control","Dry FGD - Spray Dryer","1992-03-01","PM control","Fabric Filter, pulse","1992-03-01","PM control","Fabric Filter, pulse","1992-03-01","","",null,"","",null,"","",null,"","",null,"","",null,"",""]
["10774_2",38,null,"coal",10774,"Southampton Power Station","VA","Unit 1 & 2","2","Conventional Boiler","Stoker - spreader",34,447,13.147058823529411,"bituminous","bituminous",null,null,2.8694882963040458E-2,0.37514339638445543,null,null,null,null,2.8694882963040458E-2,0.37514339638445543,"PM control","Multiple cyclone","1992-03-01","PM control","Multiple cyclone","1992-03-01","SO2 control","Dry FGD - Spray Dryer","1992-03-01","SO2 control","Dry FGD - Spray Dryer","1992-03-01","PM control","Fabric Filter, pulse","1992-03-01","PM control","Fabric Filter, pulse","1992-03-01","","",null,"","",null,"","",null,"","",null,"","",null,"",""]
["2451_Unit 3",39,null,"coal",2451,"San Juan","NM","Unit 3","Unit 3","Conventional Boiler","Wall firing - opposed firing",544,5758,10.584558823529411,"subbituminous","subbituminous",3.55483870967742E-2,0.37626399430740043,null,null,null,null,null,null,3.55483870967742E-2,0.37626399430740043,"Other control","Activated carbon injection","2008-04-01","PM control","Fabric Filter, pulse","2008-03-01","SO2 control","Wet FGD - Spray Type","1998-05-01","","",null,"","",null,"","",null,"","",null,"","",null,"","",null,"","",null,"","",null,"",""]
["3935_2",40,null,"coal",3935,"John E. Amos","WV","AM-2","2","Conventional Boiler","Wall firing - opposed firing",816.3,7020,8.5997794928335178,"bituminous","bituminous",4.5066666666666678E-2,0.38756339581036398,null,null,null,null,null,null,4.5066666666666678E-2,0.38756339581036398,"NOx control","Selective Catalytic Reduction",null,"PM control","Electrostatic precipitator, cold side, w/o flue gas conditioning","1977-12-01","SO2 control","Wet FGD - Spray Type","2009-02-01","","",null,"","",null,"","",null,"","",null,"","",null,"","",null,"","",null,"","",null,"",""]
["994_1",41,null,"coal",994,"AES Petersburg","IN","1s","1","Conventional Boiler","Tangential firing",255,2200,8.6274509803921564,"bituminous","bituminous",4.7470588235294126E-2,0.40955017301038066,null,null,null,null,null,null,4.7470588235294126E-2,0.40955017301038066,"PM control","Electrostatic precipitator, cold side, w/ flue gas conditioning","1967-12-01","SO2 control","Wet FGD - Spray Type","1996-12-01","","",null,"","",null,"","",null,"","",null,"","",null,"","",null,"","",null,"","",null,"","",null,"",""]
["2712_2",42,null,"coal",2712,"Roxboro Steam Electric Plant","NC","Rox_Cfg_2c","2","Conventional Boiler","Tangential firing",703,6893,9.8051209103840691,"bituminous","bituminous",null,null,null,null,null,null,4.1999999999999996E-2,0.41181507823613084,4.1999999999999996E-2,0.41181507823613084,"NOx control","Selective Catalytic Reduction","2005-05-01","PM control","Electrostatic precipitator, cold side, w/o flue gas conditioning","1974-05-01","SO2 control","Wet FGD - Spray/Tray Type","2007-04-20","","",null,"","",null,"","",null,"","",null,"","",null,"","",null,"","",null,"","",null,"",""]
["2706_2",43,null,"coal",2706,"Asheville Steam Electric Plant","NC","Ash_Cfg_2","2","Conventional Boiler","Wall firing - front firing",204,1902,9.3235294117647065,"bituminous","bituminous",null,null,4.6387589212262714E-2,0.4324960523613906,null,null,4.4413856309782805E-2,0.4140938955941515,4.4413856309782805E-2,0.4140938955941515,"NOx control","Selective Catalytic Reduction","2006-06-14","PM control","Electrostatic precipitator, cold side, w/o flue gas conditioning","1971-05-01","SO2 control","Wet FGD - Spray/Tray Type","2006-05-15","","",null,"","",null,"","",null,"","",null,"","",null,"","",null,"","",null,"","",null,"",""]
["6076_3",44,null,"coal",6076,"Colstrip","MT","Unit3","3","Conventional Boiler","Tangential firing",805,7573,9.4074534161490675,"subbituminous","subbituminous",null,null,4.5223791369981094E-2,0.42544071061474137,null,null,null,null,4.5223791369981094E-2,0.42544071061474137,"Other control","Activated carbon injection","2009-12-01","SO2 control","Wet FGD - Venturi Type","1984-01-01","PM control","PM scrubber - Venturi","1984-01-01","","",null,"","",null,"","",null,"","",null,"","",null,"","",null,"","",null,"","",null,"",""]
["8042_Unit 1",45,null,"coal",8042,"Belews Creek Steam Station","NC","1-2008","Unit 1","Conventional Boiler","Wall firing - opposed firing",1185.8,10800,9.1077753415415756,"bituminous","bituminous",null,null,4.8359830471376652E-2,0.44045047148833522,null,null,null,null,4.8359830471376652E-2,0.44045047148833522,"NOx control","Selective Catalytic Reduction","2003-06-01","PM control","Electrostatic precipitator, cold side, w/ flue gas conditioning","1973-01-01","SO2 control","Wet FGD - Spray Type","2008-01-01","","",null,"","",null,"","",null,"","",null,"","",null,"","",null,"","",null,"","",null,"",""]
["4078_4",46,null,"coal",4078,"Weston","WI","W4","4","Conventional Boiler","Wall firing - opposed firing",574.5,5173.07,9.0044734551784149,"subbituminous","subbituminous",6.1233333333333348E-2,0.55137392457209178,null,null,null,null,5.000000000000001E-2,0.45022367275892083,5.000000000000001E-2,0.45022367275892083,"NOx control","Selective Catalytic Reduction","2008-07-01","Other control","Activated carbon injection","2008-07-01","SO2 control","Dry FGD - Spray Dryer","2008-07-01","PM control","Fabric Filter, pulse","2008-07-01","","",null,"","",null,"","",null,"","",null,"","",null,"","",null,"","",null,"",""]
["10784_BLR1",47,null,"coal",10784,"Colstrip Energy LP","MT","Config1","BLR1","Fluidized bed firing","Fluidized bed firing",44,635,14.431818181818182,"coal refuse (culm or gob)","coal refuse (culm or gob)",null,null,null,null,3.1566666666666666E-2,0.45556439393939391,null,null,3.1566666666666666E-2,0.45556439393939391,"PM control","Fabric Filter, pulse","1990-06-01","Other control","Activated carbon injection","2009-12-01","","",null,"","",null,"","",null,"","",null,"","",null,"","",null,"","",null,"","",null,"","",null,"",""]
["10002_1",48,null,"coal",10002,"ACE Cogeneration Company","CA","Config 1","1","Fluidized bed firing","Fluidized bed firing",117,1052,8.9914529914529915,"bituminous","bituminous",5.4566666666666666E-2,0.49063361823361823,null,null,null,null,5.1999999999999998E-2,0.46755555555555556,5.1999999999999998E-2,0.46755555555555556,"NOx control","Selective Noncatalytic Reduction","1991-01-01","PM control","Fabric Filter, reverse air","1991-01-01","","",null,"","",null,"","",null,"","",null,"","",null,"","",null,"","",null,"","",null,"","",null,"",""]
["3935_3",49,null,"coal",3935,"John E. Amos","WV","AM-3","3","Conventional Boiler","Wall firing - opposed firing",1300,11936,9.1815384615384623,"bituminous","bituminous",5.2142857142857157E-2,0.47875164835164852,null,null,null,null,null,null,5.2142857142857157E-2,0.47875164835164852,"NOx control","Selective Catalytic Reduction","2001-05-01","PM control","Electrostatic precipitator, cold side, w/o flue gas conditioning","1973-10-01","SO2 control","Wet FGD - Spray Type","2009-02-01","","",null,"","",null,"","",null,"","",null,"","",null,"","",null,"","",null,"","",null,"",""]
["113_1",50,null,"coal",113,"Cholla","AZ","001","1","Conventional Boiler","Tangential firing",131,1270,9.6946564885496187,"","Bituminous, Subbituminous",null,null,null,null,null,null,0.05,0.48473282442748095,0.05,0.48473282442748095,"PM control","Fabric Filter, unspecified","2007-01-01","SO2 control","Wet FGD - Venturi Type","1972-01-01","","",null,"","",null,"","",null,"","",null,"","",null,"","",null,"","",null,"","",null,"","",null,"",""]
["8223_2",51,null,"coal",8223,"Springerville","AZ","2","2","Conventional Boiler","Tangential firing",430,3830,8.9069767441860463,"bituminous","bituminous",null,null,null,null,null,null,5.6000000000000001E-2,0.49879069767441858,5.6000000000000001E-2,0.49879069767441858,"SO2 control","Dry FGD - Spray Dryer","1990-06-01","PM control","Fabric Filter, reverse air","1990-06-01","","",null,"","",null,"","",null,"","",null,"","",null,"","",null,"","",null,"","",null,"","",null,"",""]
["7213_1",52,null,"coal",7213,"Clover","VA","Unit 1","1","Conventional Boiler","Tangential firing",431,4923,11.422273781902552,"bituminous","bituminous",null,null,4.3841657779696223E-2,0.5007714182121682,null,null,null,null,4.3841657779696223E-2,0.5007714182121682,"PM control","Fabric Filter, reverse air","2003-05-01","SO2 control","Wet FGD - Spray Type","2003-05-01","","",null,"","",null,"","",null,"","",null,"","",null,"","",null,"","",null,"","",null,"","",null,"",""]
["7790_1-1",53,null,"coal",7790,"Bonanza Power Plant","UT","1-1","1-1","Conventional Boiler","Wall firing - opposed firing",483,4899,10.142857142857142,"Bituminous","Bituminous",null,null,null,null,null,null,4.9429792976800398E-2,0.50135932876468969,4.9429792976800398E-2,0.50135932876468969,"PM control","Fabric Filter, reverse air","1985-11-01","SO2 control","Wet FGD - Spray Type","1985-11-01","","",null,"","",null,"","",null,"","",null,"","",null,"","",null,"","",null,"","",null,"","",null,"",""]
["703_4",54,null,"coal",703,"Bowen","GA","Unit 4","4","Conventional Boiler","Tangential firing",933,8887.7430000000004,9.5259839228295817,"bituminous","bituminous",5.3933333333333347E-2,0.51376806623794224,null,null,null,null,null,null,5.3933333333333347E-2,0.51376806623794224,"NOx control","Selective Catalytic Reduction","2003-05-01","PM control","Electrostatic precipitator, cold side, w/ flue gas conditioning","1975-11-01","SO2 control","Wet FGD - Spray Type","2008-12-01","","",null,"","",null,"","",null,"","",null,"","",null,"","",null,"","",null,"","",null,"",""]
["3948_1",55,null,"coal",3948,"Mitchell","WV","MI-1","1","Conventional Boiler","Wall firing - opposed firing",816.3,7020,8.5997794928335178,"bituminous","bituminous",6.1299999999999993E-2,0.52716648291069457,null,null,null,null,null,null,6.1299999999999993E-2,0.52716648291069457,"NOx control","Selective Catalytic Reduction","2007-01-01","PM control","Electrostatic precipitator, cold side, w/o flue gas conditioning","1977-02-01","SO2 control","Wet FGD - Tray Type","2007-01-01","","",null,"","",null,"","",null,"","",null,"","",null,"","",null,"","",null,"","",null,"",""]
["54081_4A",56,null,"coal",54081,"Spruance Genco, LLC","VA","GEN4","4A","Conventional Boiler","Stoker - underfeed",28.7,375,13.066202090592334,"bituminous","bituminous",4.2300000000000011E-2,0.55270034843205584,9.4105851603070501E-2,1.2296060749530118,null,null,8.9953476184438524E-2,1.1753502985771584,4.2300000000000011E-2,0.55270034843205584,"SO2 control","Dry FGD - Spray Dryer","1992-05-01","SO2 control","Dry FGD - Spray Dryer","1992-05-01","PM control","Fabric Filter, pulse","1992-05-01","PM control","Fabric Filter, pulse","1992-05-01","","",null,"","",null,"","",null,"","",null,"","",null,"","",null,"","",null,"",""]
["54081_4B",57,null,"coal",54081,"Spruance Genco, LLC","VA","GEN4","4B","Conventional Boiler","Stoker - underfeed",28.7,375,13.066202090592334,"bituminous","bituminous",4.2300000000000011E-2,0.55270034843205584,9.4105851603070501E-2,1.2296060749530118,null,null,8.9953476184438524E-2,1.1753502985771584,4.2300000000000011E-2,0.55270034843205584,"SO2 control","Dry FGD - Spray Dryer","1992-05-01","SO2 control","Dry FGD - Spray Dryer","1992-05-01","PM control","Fabric Filter, pulse","1992-05-01","PM control","Fabric Filter, pulse","1992-05-01","","",null,"","",null,"","",null,"","",null,"","",null,"","",null,"","",null,"",""]
["113_2",58,null,"coal",113,"Cholla","AZ","002","2","Conventional Boiler","Tangential firing",305,2938,9.6327868852459009,"","Bituminous, Subbituminous",null,null,null,null,null,null,6.0999999999999999E-2,0.5875999999999999,6.0999999999999999E-2,0.5875999999999999,"PM control","PM scrubber - Venturi","1978-01-01","SO2 control","Wet FGD - Venturi Type","1978-01-01","","",null,"","",null,"","",null,"","",null,"","",null,"","",null,"","",null,"","",null,"","",null,"",""]
["6018_2",59,null,"coal",6018,"East Bend Station","KY","2","2","Conventional Boiler","Wall firing - front firing",650.72463770000002,6313,9.7014922046188872,"bituminous","bituminous",null,null,6.0855869763289959E-2,0.59039274611385983,null,null,null,null,6.0855869763289959E-2,0.59039274611385983,"Other control","Dry sorbent injection","2005-01-01","PM control","Electrostatic precipitator, hot side, w/ flue gas conditioning","1981-01-01","NOx control","Selective Catalytic Reduction","2002-01-01","SO2 control","Wet FGD - Spray Type","1981-01-01","","",null,"","",null,"","",null,"","",null,"","",null,"","",null,"","",null,"",""]
["8_10",60,null,"coal",8,"Gorgas","AL","Unit 10","10","Conventional Boiler","Tangential firing",720,6523.7939999700002,9.0608249999583332,"coal - bituminous","bituminous",null,null,null,null,null,null,6.5176224871357616E-2,0.59055036771730318,6.5176224871357616E-2,0.59055036771730318,"NOx control","Selective Catalytic Reduction","2002-05-01","PM control","Electrostatic precipitator, cold side, w/ flue gas conditioning","1972-10-01","SO2 control","Wet FGD - Spray Type","2007-12-01","","",null,"","",null,"","",null,"","",null,"","",null,"","",null,"","",null,"","",null,"",""]
["6180_1",61,null,"coal",6180,"Oak Grove","TX","OG1","1","Conventional Boiler","Tangential firing",817,8970,10.979192166462669,"lignite","lignite",null,null,5.6334649225308044E-2,0.61850893947492436,null,null,5.3999999999999999E-2,0.5928763769889841,5.3999999999999999E-2,0.5928763769889841,"NOx control","Selective Catalytic Reduction","2009-08-01","Other control","Activated carbon injection","2009-08-01","PM control","Fabric Filter, pulse","2009-08-01","SO2 control","Wet FGD - Spray Type","2009-08-01","","",null,"","",null,"","",null,"","",null,"","",null,"","",null,"","",null,"",""]
["8_8",62,null,"coal",8,"Gorgas","AL","Unit 8","8","Conventional Boiler","Tangential firing",175,1600.8972500399998,9.1479842859428562,"coal - bituminous","bituminous",null,null,null,null,null,null,6.5176224871357616E-2,0.59623108094025745,6.5176224871357616E-2,0.59623108094025745,"PM control","Electrostatic precipitator, hot side, w/ flue gas conditioning","1972-06-01","SO2 control","Wet FGD - Spray Type","2007-12-01","","",null,"","",null,"","",null,"","",null,"","",null,"","",null,"","",null,"","",null,"","",null,"",""]
["2324_1",63,null,"coal",2324,"Reid Gardner","NV","1","1","Conventional Boiler","Wall firing - front firing",111,1215,10.945945945945946,"bituminous","bituminous",null,null,6.2147118518731483E-2,0.68025900000233108,null,null,5.5E-2,0.60202702702702704,5.5E-2,0.60202702702702704,"PM control","Fabric Filter, pulse","2008-12-01","SO2 control","Wet FGD - Venturi Type","1976-07-01","","",null,"","",null,"","",null,"","",null,"","",null,"","",null,"","",null,"","",null,"","",null,"",""]
["2451_Unit 4",64,null,"coal",2451,"San Juan","NM","Unit 4","Unit 4","Conventional Boiler","Wall firing - opposed firing",544,5649,10.384191176470589,"subbituminous","subbituminous",5.8870967741935482E-2,0.61132738377609108,null,null,null,null,null,null,5.8870967741935482E-2,0.61132738377609108,"Other control","Activated carbon injection","2008-04-01","PM control","Fabric Filter, pulse","2007-10-01","SO2 control","Wet FGD - Spray Type","1998-04-01","","",null,"","",null,"","",null,"","",null,"","",null,"","",null,"","",null,"","",null,"",""]
[{"$f":"E66&\"_\"&I66","v":"3944_2"},65,null,"coal",3944,"Harrison Power Station","WV","Boiler2","2","Conventional Boiler","Wall firing - unspecified",692,6042,8.7312138728323703,"bituminous","bituminous",null,null,7.0078157316521394E-2,0.61186737934454083,null,null,null,null,7.0078157316521394E-2,0.61186737934454083,"NOx control","Selective Catalytic Reduction","2003-05-01","PM control","Electrostatic precipitator, cold side, unspecified","1973-12-01","SO2 control","Wet FGD - Spray Type","1994-11-01","","",null,"","",null,"","",null,"","",null,"","",null,"","",null,"","",null,"","",null,"",""]
["8_9",66,null,"coal",8,"Gorgas","AL","Unit 9","9","Conventional Boiler","Tangential firing",185,1738.6247499249998,9.3979716212162145,"coal - bituminous","bituminous",null,null,null,null,null,null,6.5176224871357616E-2,0.61252431171902533,6.5176224871357616E-2,0.61252431171902533,"PM control","Electrostatic precipitator, hot side, w/ flue gas conditioning","1972-06-01","SO2 control","Wet FGD - Spray Type","2007-12-01","","",null,"","",null,"","",null,"","",null,"","",null,"","",null,"","",null,"","",null,"","",null,"",""]
["2324_4",67,null,"coal",2324,"Reid Gardner","NV","4","4","Conventional Boiler","Wall firing - front firing",281,2956,10.519572953736654,"","bituminous",null,null,null,null,null,null,5.9100000000000007E-2,0.62170676156583637,5.9100000000000007E-2,0.62170676156583637,"PM control","Fabric Filter, pulse","1983-07-01","SO2 control","Wet FGD - Venturi Type","1983-07-01","","",null,"","",null,"","",null,"","",null,"","",null,"","",null,"","",null,"","",null,"","",null,"",""]
["8224_2",68,null,"coal",8224,"North Valmy","NV","2","2","Conventional Boiler","Wall firing - front firing",270.2,2881,10.662472242783124,"","subbituminous, bituminous",null,null,null,null,null,null,5.8666666666666666E-2,0.62553170490994325,5.8666666666666666E-2,0.62553170490994325,"SO2 control","Dry FGD - Spray Dryer","1985-05-01","PM control","Fabric Filter, reverse air","1985-05-01","","",null,"","",null,"","",null,"","",null,"","",null,"","",null,"","",null,"","",null,"","",null,"",""]
["1606_1",69,null,"coal",1606,"Mount Tom","MA","1 current","1","Conventional Boiler","Wall firing - front firing",155,1480,9.5483870967741939,"coal - bituminous","bituminous",null,null,null,null,null,null,6.6000000000000003E-2,0.63019354838709685,6.6000000000000003E-2,0.63019354838709685,"NOx control","Selective Catalytic Reduction","2006-06-01","PM control","Electrostatic precipitator, cold side, w/o flue gas conditioning","1982-09-01","SO2 control","Dry FGD - Circulating Dry Scrubber","2009-12-01","PM control","Fabric Filter, pulse","2009-12-01","","",null,"","",null,"","",null,"","",null,"","",null,"","",null,"","",null,"",""]
["703_3",70,null,"coal",703,"Bowen","GA","Unit 3","3","Conventional Boiler","Tangential firing",933,8184.7479999999996,8.772505894962487,"bituminous","bituminous",7.1933333333333335E-2,0.63103559071096826,null,null,null,null,null,null,7.1933333333333335E-2,0.63103559071096826,"NOx control","Selective Catalytic Reduction","2003-05-01","PM control","Electrostatic precipitator, cold side, w/ flue gas conditioning","1974-12-01","SO2 control","Wet FGD - Spray Type","2008-05-01","","",null,"","",null,"","",null,"","",null,"","",null,"","",null,"","",null,"","",null,"",""]
["628_5",71,null,"coal",628,"Crystal River Power Plant","FL","CryR_Cfg_5c","5","Conventional Boiler","Wall firing - opposed firing",767,7423,9.6779661016949152,"bituminous","bituminous",null,null,6.5224192332729192E-2,0.63123752240658249,null,null,null,null,6.5224192332729192E-2,0.63123752240658249,"NOx control","Selective Catalytic Reduction","2009-05-15","PM control","Electrostatic precipitator, cold side, w/o flue gas conditioning","1984-01-01","SO2 control","Wet FGD - Spray/Tray Type","2009-11-30","","",null,"","",null,"","",null,"","",null,"","",null,"","",null,"","",null,"","",null,"",""]
["8223_1",72,null,"coal",8223,"Springerville","AZ","1","1","Conventional Boiler","Tangential firing",427,3830,8.9695550351288063,"coal - subbituminous","subbituminous",null,null,null,null,null,null,7.0999999999999994E-2,0.63683840749414522,7.0999999999999994E-2,0.63683840749414522,"SO2 control","Dry FGD - Spray Dryer","1985-06-01","PM control","Fabric Filter, reverse air","1985-06-01","","",null,"","",null,"","",null,"","",null,"","",null,"","",null,"","",null,"","",null,"","",null,"",""]
["3948_2",73,null,"coal",3948,"Mitchell","WV","MI-2","2","Conventional Boiler","Wall firing - opposed firing",816.3,7020,8.5997794928335178,"bituminous","bituminous",7.506666666666667E-2,0.64555678059536947,null,null,null,null,null,null,7.506666666666667E-2,0.64555678059536947,"NOx control","Selective Catalytic Reduction","2007-01-01","PM control","Electrostatic precipitator, cold side, w/o flue gas conditioning","1978-08-01","SO2 control","Wet FGD - Tray Type","2007-01-01","","",null,"","",null,"","",null,"","",null,"","",null,"","",null,"","",null,"","",null,"",""]
["8223_4",74,null,"coal",8223,"Springerville","AZ","4","4","Conventional Boiler","Wall firing - opposed firing",450,4200,9.3333333333333339,"bituminous","bituminous",6.9233333333333327E-2,0.64617777777777774,null,null,null,null,null,null,6.9233333333333327E-2,0.64617777777777774,"NOx control","Selective Catalytic Reduction","2009-12-01","SO2 control","Dry FGD - Spray Dryer","2009-12-01","PM control","Fabric Filter, pulse","2009-12-01","","",null,"","",null,"","",null,"","",null,"","",null,"","",null,"","",null,"","",null,"",""]
["56319_0001",75,null,"coal",56319,"Wygen 2","WY","WYG2Cfg","0001","Conventional Boiler","Wall firing - front firing",96,1300,13.541666666666666,"subbituminous","subbituminous",4.8000000000000022E-2,0.65000000000000024,null,null,null,null,null,null,4.8000000000000022E-2,0.65000000000000024,"NOx control","Selective Catalytic Reduction","2008-01-01","SO2 control","Dry FGD - Spray Dryer","2008-01-01","PM control","Fabric Filter, pulse","2008-01-01","","",null,"","",null,"","",null,"","",null,"","",null,"","",null,"","",null,"","",null,"",""]
["2451_Unit 1",76,null,"coal",2451,"San Juan","NM","Unit 1","Unit 1","Conventional Boiler","Wall firing - front firing",370,3707,10.018918918918919,"subbituminous","subbituminous",6.5473684210526309E-2,0.65597553342816495,null,null,null,null,null,null,6.5473684210526309E-2,0.65597553342816495,"Other control","Activated carbon injection","2009-06-01","PM control","Fabric Filter, pulse","2008-10-01","SO2 control","Wet FGD - Spray Type","1998-05-01","","",null,"","",null,"","",null,"","",null,"","",null,"","",null,"","",null,"","",null,"",""]
["54081_1A",77,null,"coal",54081,"Spruance Genco, LLC","VA","GEN1","1A","Conventional Boiler","Stoker - underfeed",28.7,375,13.066202090592334,"bituminous","bituminous",null,null,5.1563358287846174E-2,0.67373725985861721,null,null,null,null,5.1563358287846174E-2,0.67373725985861721,"SO2 control","Dry FGD - Spray Dryer","1992-05-01","SO2 control","Dry FGD - Spray Dryer","1992-05-01","PM control","Fabric Filter, pulse","1992-05-01","PM control","Fabric Filter, pulse","1992-05-01","","",null,"","",null,"","",null,"","",null,"","",null,"","",null,"","",null,"",""]
["54081_1B",78,null,"coal",54081,"Spruance Genco, LLC","VA","GEN1","1B","Conventional Boiler","Stoker - underfeed",28.7,375,13.066202090592334,"bituminous","bituminous",null,null,5.1563358287846174E-2,0.67373725985861721,null,null,null,null,5.1563358287846174E-2,0.67373725985861721,"SO2 control","Dry FGD - Spray Dryer","1992-05-01","SO2 control","Dry FGD - Spray Dryer","1992-05-01","PM control","Fabric Filter, pulse","1992-05-01","PM control","Fabric Filter, pulse","1992-05-01","","",null,"","",null,"","",null,"","",null,"","",null,"","",null,"","",null,"",""]
["8223_3",79,null,"coal",8223,"Springerville","AZ","3","3","Conventional Boiler","Wall firing - opposed firing",450,4200,9.3333333333333339,"subbituminous","subbituminous",7.4366666666666664E-2,0.69408888888888887,null,null,null,null,9.9000000000000005E-2,0.92400000000000015,7.4366666666666664E-2,0.69408888888888887,"NOx control","Selective Catalytic Reduction","2006-08-01","SO2 control","Dry FGD - Spray Dryer","2006-08-01","PM control","Fabric Filter, pulse","2006-08-01","","",null,"","",null,"","",null,"","",null,"","",null,"","",null,"","",null,"","",null,"",""]
["10384_2A",80,null,"coal",10384,"Edgecombe Genco, LLC","NC","Gen 2","2A","Conventional Boiler","Stoker - overfeed",30.5,375,12.295081967213115,"bituminous","bituminous",5.6800000000000003E-2,0.69836065573770501,null,null,null,null,null,null,5.6800000000000003E-2,0.69836065573770501,"SO2 control","Dry FGD - Spray Dryer","1990-10-01","SO2 control","Dry FGD - Spray Dryer","1990-10-01","PM control","Fabric Filter, reverse air","1990-10-01","PM control","Fabric Filter, reverse air","1990-10-01","","",null,"","",null,"","",null,"","",null,"","",null,"","",null,"","",null,"",""]
["10384_2B",81,null,"coal",10384,"Edgecombe Genco, LLC","NC","Gen 2","2B","Conventional Boiler","Stoker - overfeed",30.5,375,12.295081967213115,"bituminous","bituminous",5.6800000000000003E-2,0.69836065573770501,null,null,null,null,null,null,5.6800000000000003E-2,0.69836065573770501,"SO2 control","Dry FGD - Spray Dryer","1990-10-01","SO2 control","Dry FGD - Spray Dryer","1990-10-01","PM control","Fabric Filter, reverse air","1990-10-01","PM control","Fabric Filter, reverse air","1990-10-01","","",null,"","",null,"","",null,"","",null,"","",null,"","",null,"","",null,"",""]
["130_3",82,null,"coal",130,"Cross","SC","C3","3","Conventional Boiler","Tangential firing",625,6058,9.6928000000000001,"bituminous","bituminous",7.4300000000000019E-2,0.72017504000000021,null,null,null,null,null,null,7.4300000000000019E-2,0.72017504000000021,"NOx control","Selective Catalytic Reduction","2006-08-01","PM control","Electrostatic precipitator, cold side, w/o flue gas conditioning","2006-08-01","SO2 control","Wet FGD - Spray Type","2006-08-01","","",null,"","",null,"","",null,"","",null,"","",null,"","",null,"","",null,"","",null,"",""]
["6761_101",83,null,"coal",6761,"Rawhide","CO","Rawhide101","101","Conventional Boiler","Tangential firing",305,2800,9.1803278688524586,"subbituminous","subbituminous",7.8533333333333344E-2,0.72096174863387985,null,null,null,null,null,null,7.8533333333333344E-2,0.72096174863387985,"SO2 control","Dry FGD - Spray Dryer","1984-04-01","PM control","Fabric Filter, reverse air","1984-04-01","","",null,"","",null,"","",null,"","",null,"","",null,"","",null,"","",null,"","",null,"","",null,"",""]
["1012_3",84,null,"coal",1012,"F. B. Culley","IN","Config3","3","Conventional Boiler","Wall firing - opposed firing",287,2689,9.3693379790940767,"subbituminous","subbituminous",8.0045454545454545E-2,0.74997291732657589,null,null,null,null,null,null,8.0045454545454545E-2,0.74997291732657589,"NOx control","Selective Catalytic Reduction","2004-01-01","PM control","Fabric Filter, pulse","2006-11-01","SO2 control","Wet FGD - Spray Type","1995-01-01","","",null,"","",null,"","",null,"","",null,"","",null,"","",null,"","",null,"","",null,"",""]
["2727_Unit 1",85,null,"coal",2727,"Marshall","NC","U12007","Unit 1","Conventional Boiler","Tangential firing",400,3658.2,9.1455000000000002,"bituminous","bituminous",null,null,8.2923525221707775E-2,0.75837709991512847,null,null,null,null,8.2923525221707775E-2,0.75837709991512847,"NOx control","Selective Noncatalytic Reduction","2006-04-01","PM control","Electrostatic precipitator, cold side, w/ flue gas conditioning","1998-12-01","SO2 control","Wet FGD - Spray Type","2007-05-01","","",null,"","",null,"","",null,"","",null,"","",null,"","",null,"","",null,"","",null,"",""]
["2727_Unit 2",86,null,"coal",2727,"Marshall","NC","U22007","Unit 2","Conventional Boiler","Tangential firing",400,3663.2,9.1579999999999995,"bituminous","bituminous",null,null,8.2923525221707775E-2,0.75941364398039979,null,null,null,null,8.2923525221707775E-2,0.75941364398039979,"NOx control","Selective Noncatalytic Reduction","2007-05-01","PM control","Electrostatic precipitator, cold side, w/ flue gas conditioning","2002-01-01","SO2 control","Wet FGD - Spray Type","2007-05-01","","",null,"","",null,"","",null,"","",null,"","",null,"","",null,"","",null,"","",null,"",""]
["2718_ES-3",87,null,"coal",2718,"G G Allen","NC","3-2009","ES-3","Conventional Boiler","Tangential firing",281.5,2228,7.9147424511545292,"bituminous","bituminous",null,null,9.7061529410868777E-2,0.768217007202187,null,null,null,null,9.7061529410868777E-2,0.768217007202187,"NOx control","Selective Noncatalytic Reduction","2005-05-01","PM control","Electrostatic precipitator, cold side, w/ flue gas conditioning","2002-06-01","SO2 control","Wet FGD - Spray Type","2009-05-01","","",null,"","",null,"","",null,"","",null,"","",null,"","",null,"","",null,"","",null,"",""]
["2718_ES-4",88,null,"coal",2718,"G G Allen","NC","4-2009","ES-4","Conventional Boiler","Tangential firing",297.3,2380,8.0053817692566422,"bituminous","bituminous",null,null,9.7061529410868777E-2,0.77701459804193629,null,null,null,null,9.7061529410868777E-2,0.77701459804193629,"NOx control","Selective Noncatalytic Reduction","2006-06-01","PM control","Electrostatic precipitator, cold side, w/ flue gas conditioning","1999-02-01","SO2 control","Wet FGD - Spray Type","2009-04-01","","",null,"","",null,"","",null,"","",null,"","",null,"","",null,"","",null,"","",null,"",""]
["10043_B01",89,null,"coal",10043,"Logan Generating Plant","NJ","Unit1","B01","Conventional Boiler","Wall firing - opposed firing",241.7,2116,8.7546545304095993,"bituminous","bituminous",null,null,9.0995908666725925E-2,0.79663774405789023,null,null,0.10625,0.93018204385601988,9.0995908666725925E-2,0.79663774405789023,"NOx control","Selective Catalytic Reduction","1994-09-01","SO2 control","Dry FGD - Spray Dryer","1994-09-01","PM control","Fabric Filter, reverse air","1994-09-01","","",null,"","",null,"","",null,"","",null,"","",null,"","",null,"","",null,"","",null,"",""]
["2727_Unit 4",90,null,"coal",2727,"Marshall","NC","U4","Unit 4","Conventional Boiler","Tangential firing",700,6029.8,8.6140000000000008,"bituminous","bituminous",null,null,9.4491230902303269E-2,0.81394746299244047,null,null,null,null,9.4491230902303269E-2,0.81394746299244047,"NOx control","Selective Noncatalytic Reduction","2006-12-01","PM control","Electrostatic precipitator, cold side, w/ flue gas conditioning","2006-05-01","SO2 control","Wet FGD - Spray Type","2006-10-01","","",null,"","",null,"","",null,"","",null,"","",null,"","",null,"","",null,"","",null,"",""]
["645_1",91,null,"coal",645,"Big Bend","FL","BB01_pre-SCR","1","Conventional Boiler","Wall firing - opposed firing",410,4037,9.8463414634146336,"bituminous","bituminous",null,null,null,null,null,null,8.2901143425934784E-2,0.81627296587926512,8.2901143425934784E-2,0.81627296587926512,"PM control","Electrostatic precipitator, hot side, w/o flue gas conditioning","1970-10-01","SO2 control","Wet FGD - Packed Type","1999-12-01","","",null,"","",null,"","",null,"","",null,"","",null,"","",null,"","",null,"","",null,"","",null,"",""]
["1012_2",92,null,"coal",1012,"F. B. Culley","IN","Config2","2","Conventional Boiler","Wall firing - opposed firing",100,1031,10.31,"subbituminous","subbituminous",8.0045454545454545E-2,0.82526863636363634,null,null,null,null,null,null,8.0045454545454545E-2,0.82526863636363634,"PM control","Fabric Filter, pulse","2006-11-01","SO2 control","Wet FGD - Spray Type","1995-01-01","","",null,"","",null,"","",null,"","",null,"","",null,"","",null,"","",null,"","",null,"","",null,"",""]
["2451_Unit 2",93,null,"coal",2451,"San Juan","NM","Unit 2","Unit 2","Conventional Boiler","Wall firing - front firing",370,3688,9.967567567567567,"subbituminous","subbituminous",8.328571428571431E-2,0.83015598455598472,null,null,null,null,null,null,8.328571428571431E-2,0.83015598455598472,"Other control","Activated carbon injection","2009-06-01","PM control","Fabric Filter, pulse","2009-04-01","SO2 control","Wet FGD - Spray Type","1998-05-01","","",null,"","",null,"","",null,"","",null,"","",null,"","",null,"","",null,"","",null,"",""]
["2324_2",94,null,"coal",2324,"Reid Gardner","NV","2","2","Conventional Boiler","Wall firing - front firing",111,1215,10.945945945945946,"","bituminous",null,null,null,null,null,null,8.3000000000000004E-2,0.9085135135135135,8.3000000000000004E-2,0.9085135135135135,"PM control","Fabric Filter, pulse","2009-04-01","SO2 control","Wet FGD - Venturi Type","1976-07-01","","",null,"","",null,"","",null,"","",null,"","",null,"","",null,"","",null,"","",null,"","",null,"",""]
["6041_4",95,null,"coal",6041,"H L Spurlock Station","KY","Unit 04","4","Fluidized bed firing","Fluidized bed firing",300,2800,9.3333333333333339,"bituminous","bituminous",9.7766666666666696E-2,0.91248888888888924,null,null,null,null,9.9333333333333329E-2,0.92711111111111111,9.7766666666666696E-2,0.91248888888888924,"NOx control","Selective Noncatalytic Reduction","2009-04-01","SO2 control","Dry FGD - Unspecified","2009-04-01","PM control","Fabric Filter, pulse","2009-04-01","","",null,"","",null,"","",null,"","",null,"","",null,"","",null,"","",null,"","",null,"",""]
["994_2",96,null,"coal",994,"AES Petersburg","IN","2ss","2","Conventional Boiler","Tangential firing",445,4144,9.3123595505617978,"bituminous","bituminous",9.8233333333333311E-2,0.91478411985018704,null,null,null,null,null,null,9.8233333333333311E-2,0.91478411985018704,"NOx control","Selective Catalytic Reduction","2004-12-01","PM control","Electrostatic precipitator, cold side, w/ flue gas conditioning","1969-12-01","SO2 control","Wet FGD - Spray Type","1996-12-01","","",null,"","",null,"","",null,"","",null,"","",null,"","",null,"","",null,"","",null,"",""]
["6639_G2",97,null,"coal",6639,"R D Green","KY","2","G2","Conventional Boiler","Wall firing - opposed firing",239,2726.6,11.40836820083682,"bituminous,  Petroleum coke","bituminous,  Petroleum coke",8.0266666666666667E-2,0.91571168758716881,null,null,null,null,null,null,8.0266666666666667E-2,0.91571168758716881,"PM control","Electrostatic precipitator, cold side, w/o flue gas conditioning","1981-01-01","SO2 control","Wet FGD - Spray Type","1981-01-01","","",null,"","",null,"","",null,"","",null,"","",null,"","",null,"","",null,"","",null,"","",null,"",""]
["7213_2",98,null,"coal",7213,"Clover","VA","Unit 2","2","Conventional Boiler","Tangential firing",434,5041,11.61520737327189,"bituminous","bituminous",null,null,7.9174518289863619E-2,0.91962844861567394,null,null,null,null,7.9174518289863619E-2,0.91962844861567394,"NOx control","Selective Noncatalytic Reduction","2003-03-01","PM control","Fabric Filter, reverse air","2003-05-01","SO2 control","Wet FGD - Spray Type","2003-05-01","","",null,"","",null,"","",null,"","",null,"","",null,"","",null,"","",null,"","",null,"",""]
["6096_NC2",99,null,"coal",6096,"Nebraska City","NE","NC2","NC2","Conventional Boiler","Wall firing - front firing",682,6920.2539999999999,10.147,"bituminous","bituminous",9.2366666666666666E-2,0.93724456666666667,null,null,null,null,null,null,9.2366666666666666E-2,0.93724456666666667,"NOx control","Selective Catalytic Reduction","2009-05-01","Other control","Activated carbon injection","2009-05-01","SO2 control","Dry FGD - Spray Dryer","2009-05-01","PM control","Fabric Filter, pulse","2009-05-01","","",null,"","",null,"","",null,"","",null,"","",null,"","",null,"","",null,"",""]
["728_Y1BR",100,null,"coal",728,"Yates","GA","Y1BR","Y1BR","Conventional Boiler","Tangential firing",107,1094.742,10.231233644859813,"bituminous","bituminous",9.3700000000000019E-2,0.95866659252336472,null,null,null,null,null,null,9.3700000000000019E-2,0.95866659252336472,"PM control","Electrostatic precipitator, cold side, w/o flue gas conditioning","1971-05-01","SO2 control","Wet FGD - Spray Type","1992-10-01","","",null,"","",null,"","",null,"","",null,"","",null,"","",null,"","",null,"","",null,"","",null,"",""]
["160_2",101,null,"coal",160,"Apache Station","AZ","ST2","2","Conventional Boiler","Turbo",204,1932.521,9.4731421568627443,"coal - subbituminous","subbituminous",null,null,null,null,null,null,0.10256585416622069,0.97162091695666153,0.10256585416622069,0.97162091695666153,"PM control","Electrostatic precipitator, hot side, w/o flue gas conditioning","1978-06-01","SO2 control","Wet FGD - Spray Type","1978-06-01","","",null,"","",null,"","",null,"","",null,"","",null,"","",null,"","",null,"","",null,"","",null,"",""]
["963_34",102,null,"coal",963,"Dallman","IL","34","34","Conventional Boiler","Wall firing - opposed firing",229.4,1924.9,8.3910200523103757,"bituminous","bituminous",0.11800000000000002,0.99014036617262446,null,null,null,null,null,null,0.11800000000000002,0.99014036617262446,"NOx control","Selective Catalytic Reduction","2009-05-01","PM control","Fabric Filter, pulse","2009-05-01","SO2 control","Wet FGD - Packed Type","2009-05-01","Other control","Wet electrostatic precipitator","2009-05-01","","",null,"","",null,"","",null,"","",null,"","",null,"","",null,"","",null,"",""]
["52007_BLR1",103,null,"coal",52007,"Mecklenburg Power Station","VA","Unit 1 & 2","BLR1","Conventional Boiler","Wall firing - front firing",76,916,12.052631578947368,"bituminous","bituminous",null,null,8.3128224638290851E-2,1.0030076578067462,null,null,null,null,8.3128224638290851E-2,1.0030076578067462,"SO2 control","Dry FGD - Spray Dryer","1992-11-01","SO2 control","Dry FGD - Spray Dryer","1992-11-01","PM control","Fabric Filter, pulse","1992-11-01","PM control","Fabric Filter, pulse","1992-11-01","","",null,"","",null,"","",null,"","",null,"","",null,"","",null,"","",null,"",""]
["52007_BLR2",104,null,"coal",52007,"Mecklenburg Power Station","VA","Unit 1 & 2","BLR2","Conventional Boiler","Wall firing - front firing",76,918,12.078947368421053,"bituminous","bituminous",null,null,8.3128224638290851E-2,1.0030076578067462,null,null,null,null,8.3128224638290851E-2,1.0030076578067462,"SO2 control","Dry FGD - Spray Dryer","1992-11-01","SO2 control","Dry FGD - Spray Dryer","1992-11-01","PM control","Fabric Filter, pulse","1992-11-01","PM control","Fabric Filter, pulse","1992-11-01","","",null,"","",null,"","",null,"","",null,"","",null,"","",null,"","",null,"",""]
["113_4",105,null,"coal",113,"Cholla","AZ","004","4","Conventional Boiler","Tangential firing",425,4268,10.042352941176471,"bituminous","bituminous",null,null,null,null,0.15057526065142857,1.5121299116712874,0.1,1.0042352941176471,0.1,1.0042352941176471,"PM control","Fabric Filter, unspecified","2008-01-01","SO2 control","Wet FGD - Packed Type","2008-01-01","","",null,"","",null,"","",null,"","",null,"","",null,"","",null,"","",null,"","",null,"","",null,"",""]
["2718_ES-2",106,null,"coal",2718,"G G Allen","NC","2-2009","ES-2","Conventional Boiler","Tangential firing",177,1509,8.5254237288135588,"bituminous","bituminous",null,null,0.11924514949161609,1.0166154270217438,null,null,null,null,0.11924514949161609,1.0166154270217438,"NOx control","Selective Noncatalytic Reduction","2007-04-01","PM control","Electrostatic precipitator, cold side, w/o flue gas conditioning","1988-10-01","SO2 control","Wet FGD - Spray Type","2009-02-01","","",null,"","",null,"","",null,"","",null,"","",null,"","",null,"","",null,"","",null,"",""]
["1356_1",107,null,"coal",1356,"Ghent","KY","GH1","1","Conventional Boiler","Tangential firing",520,6286,12.088461538461539,"bituminous","bituminous",8.443333333333336E-2,1.020669102564103,null,null,null,null,null,null,8.443333333333336E-2,1.020669102564103,"NOx control","Selective Catalytic Reduction","2004-05-01","Other control","Other (specify): Sorbent injection for SO3 reduction","2008-06-01","PM control","Electrostatic precipitator, cold side, w/o flue gas conditioning","1973-12-01","Other control","Other (specify): Sorbent injection for SO3 reduction","2008-06-01","SO2 control","Wet FGD - Spray Type","1994-11-01","","",null,"","",null,"","",null,"","",null,"","",null,"","",null,"",""]
["3954_3",108,null,"coal",3954,"Mt. Storm","WV","Unit 3","3","Conventional Boiler","Tangential firing",559.79999999999995,5923,10.5805644873169,"bituminous","bituminous",9.8266666666666683E-2,1.039716803620341,null,null,null,null,null,null,9.8266666666666683E-2,1.039716803620341,"NOx control","Selective Catalytic Reduction","2004-05-01","PM control","Electrostatic precipitator, cold side, w/o flue gas conditioning","1973-12-01","SO2 control","Wet FGD - Spray Type","1995-01-01","","",null,"","",null,"","",null,"","",null,"","",null,"","",null,"","",null,"","",null,"",""]
["55749_PC1",109,null,"coal",55749,"Hardin Generator Project","MT","PC1","PC1","Conventional Boiler","Wall firing - unspecified",119,1304,10.957983193277311,"bituminous","bituminous",9.5333333333333339E-2,1.0446610644257703,null,null,null,null,0.104,1.1396302521008403,9.5333333333333339E-2,1.0446610644257703,"NOx control","Selective Catalytic Reduction","2006-04-01","Other control","Activated carbon injection",null,"SO2 control","Dry FGD - Spray Dryer","2006-04-01","PM control","Fabric Filter, pulse","2006-04-01","","",null,"","",null,"","",null,"","",null,"","",null,"","",null,"","",null,"",""]
["477_5",110,null,"coal",477,"Valmont","CO","Unit 5","5","Conventional Boiler","Tangential firing",196,1845,9.4132653061224492,"bituminous","bituminous",0.11411538461538463,1.0741983908948196,null,null,0.11116085312966667,1.0463866021644643,null,null,0.11116085312966667,1.0463866021644643,"SO2 control","Dry FGD - Spray Dryer","2002-04-01","PM control","Fabric Filter, reverse air","1984-04-01","","",null,"","",null,"","",null,"","",null,"","",null,"","",null,"","",null,"","",null,"","",null,"",""]
["469_4",111,null,"coal",469,"Cherokee","CO","Unit 4","4","Conventional Boiler","Tangential firing",383,3520,9.1906005221932112,"bituminous","bituminous",0.12536666666666668,1.152194952132289,null,null,0.11387154009666667,1.0465478358753699,null,null,0.11387154009666667,1.0465478358753699,"SO2 control","Dry FGD - Spray Dryer","2002-10-01","PM control","Fabric Filter, reverse air","1989-04-01","","",null,"","",null,"","",null,"","",null,"","",null,"","",null,"","",null,"","",null,"","",null,"",""]
["995_7",112,null,"coal",995,"Bailly","IN","7","7","Conventional Boiler","Cyclone firing",176,1638,9.3068181818181817,"bituminous","bituminous",null,null,0.11432504656908832,1.0640024220464015,null,null,null,null,0.11432504656908832,1.0640024220464015,"NOx control","Selective Catalytic Reduction","2008-03-01","PM control","Electrostatic precipitator, cold side, w/o flue gas conditioning","1980-06-01","SO2 control","Wet FGD - Packed Type","1992-06-01","","",null,"","",null,"","",null,"","",null,"","",null,"","",null,"","",null,"","",null,"",""]
["113_3",113,null,"coal",113,"Cholla","AZ","003","3","Conventional Boiler","Tangential firing",305,2929,9.6032786885245898,"bituminous","bituminous",null,null,null,null,0.13794274810714288,1.3247026531338408,0.113,1.0851704918032787,0.113,1.0851704918032787,"PM control","Fabric Filter, unspecified","2009-01-01","SO2 control","Wet FGD - Unspecified","2009-01-01","","",null,"","",null,"","",null,"","",null,"","",null,"","",null,"","",null,"","",null,"","",null,"",""]
["995_8",114,null,"coal",995,"Bailly","IN","8","8","Conventional Boiler","Cyclone firing",352,3374,9.5852272727272734,"bituminous","bituminous",null,null,0.11432504656908832,1.0958315543298409,null,null,null,null,0.11432504656908832,1.0958315543298409,"NOx control","Selective Catalytic Reduction","2006-06-01","PM control","Electrostatic precipitator, cold side, w/o flue gas conditioning","1981-02-01","SO2 control","Wet FGD - Packed Type","1992-06-01","","",null,"","",null,"","",null,"","",null,"","",null,"","",null,"","",null,"","",null,"",""]
["1356_4",115,null,"coal",1356,"Ghent","KY","GH4","4","Conventional Boiler","Wall firing - opposed firing",525,5967,11.365714285714287,"bituminous","bituminous",9.9100000000000008E-2,1.126342285714286,null,null,null,null,null,null,9.9100000000000008E-2,1.126342285714286,"Other control","Other (specify): Sorbent injection for SO3 reduction","2008-06-01","PM control","Electrostatic precipitator, hot side, w/o flue gas conditioning","1984-06-01","NOx control","Selective Catalytic Reduction","2004-05-01","Other control","Other (specify): Sorbent injection for SO3 reduction","2008-06-01","SO2 control","Wet FGD - Spray Type","2008-06-01","","",null,"","",null,"","",null,"","",null,"","",null,"","",null,"",""]
["2718_ES-5",116,null,"coal",2718,"G G Allen","NC","5-2009","ES-5","Conventional Boiler","Tangential firing",285.3,2705,9.4812478093235182,"bituminous","bituminous",null,null,0.11924514949161609,1.1305928123898406,null,null,null,null,0.11924514949161609,1.1305928123898406,"NOx control","Selective Noncatalytic Reduction","2008-05-01","PM control","Electrostatic precipitator, cold side, w/ flue gas conditioning","2000-06-01","SO2 control","Wet FGD - Spray Type","2009-03-01","","",null,"","",null,"","",null,"","",null,"","",null,"","",null,"","",null,"","",null,"",""]
["2727_Unit 3",117,null,"coal",2727,"Marshall","NC","U3","Unit 3","Conventional Boiler","Tangential firing",700,6103.1,8.7187142857142863,"bituminous","bituminous",null,null,0.13037421534856655,1.136695533848338,null,null,null,null,0.13037421534856655,1.136695533848338,"NOx control","Selective Catalytic Reduction","2008-12-01","PM control","Electrostatic precipitator, cold side, w/ flue gas conditioning","2006-12-01","SO2 control","Wet FGD - Spray Type","2007-03-01","","",null,"","",null,"","",null,"","",null,"","",null,"","",null,"","",null,"","",null,"",""]
["6041_1",118,null,"coal",6041,"H L Spurlock Station","KY","Unit 01","1","Conventional Boiler","Wall firing - opposed firing",344,3641,10.584302325581396,"bituminous","bituminous",0.24906666666666669,2.6361968992248066,null,null,null,null,0.10866666666666668,1.1501608527131784,0.10866666666666668,1.1501608527131784,"PM control","Electrostatic precipitator, cold side, w/o flue gas conditioning","2003-05-01","NOx control","Selective Catalytic Reduction","2003-05-01","SO2 control","Wet FGD - Unspecified","2009-04-01","Other control","Wet electrostatic precipitator","2009-04-01","","",null,"","",null,"","",null,"","",null,"","",null,"","",null,"","",null,"",""]
["7504_2",119,null,"coal",7504,"Neil Simpson II","WY","NS2Cfg","2","Conventional Boiler","Wall firing - front firing",88,1100,12.5,"subbituminous","subbituminous",9.2100000000000015E-2,1.1512500000000001,null,null,null,null,null,null,9.2100000000000015E-2,1.1512500000000001,"SO2 control","Dry FGD - Circulating Dry Scrubber","1995-09-01","PM control","Electrostatic precipitator, cold side, w/o flue gas conditioning","1995-09-01","","",null,"","",null,"","",null,"","",null,"","",null,"","",null,"","",null,"","",null,"","",null,"",""]
["525_2",120,null,"coal",525,"Hayden","CO","Unit 2","2","Conventional Boiler","Tangential firing",285,2712,9.5157894736842099,"bituminous","bituminous",0.13686206896551725,1.3023506352087115,null,null,0.12140945273666666,1.1553067923573332,null,null,0.12140945273666666,1.1553067923573332,"SO2 control","Dry FGD - Spray Dryer","1999-06-01","PM control","Fabric Filter, reverse air","1999-06-01","","",null,"","",null,"","",null,"","",null,"","",null,"","",null,"","",null,"","",null,"","",null,"",""]
["525_1",121,null,"coal",525,"Hayden","CO","Unit 1","1","Conventional Boiler","Wall firing - front firing",202,1963,9.717821782178218,"bituminous","bituminous",0.11896666666666669,1.1560968646864689,null,null,0.12021440316999998,1.1682221456569801,null,null,0.11896666666666669,1.1560968646864689,"SO2 control","Dry FGD - Spray Dryer","1998-12-01","PM control","Fabric Filter, reverse air","1998-12-01","","",null,"","",null,"","",null,"","",null,"","",null,"","",null,"","",null,"","",null,"","",null,"",""]
["50888_BLR1",122,null,"coal",50888,"Northampton Generating Company, L.P.","PA","GEN1","BLR1","Fluidized bed firing","Fluidized bed firing",121,1146,9.4710743801652892,"coal refuse (culm or gob)","coal refuse (culm or gob)",null,null,0.1235357720062057,1.1700164852819153,null,null,null,null,0.1235357720062057,1.1700164852819153,"NOx control","Selective Noncatalytic Reduction","1995-08-01","PM control","Fabric Filter, pulse","1995-08-01","","",null,"","",null,"","",null,"","",null,"","",null,"","",null,"","",null,"","",null,"","",null,"",""]
["2828_2",123,null,"coal",2828,"Cardinal","OH","CD-U2","2","Conventional Boiler","Wall firing - opposed firing",615.20000000000005,5275,8.5744473342002596,"bituminous","bituminous",0.13689999999999999,1.1738418400520154,null,null,null,null,null,null,0.13689999999999999,1.1738418400520154,"NOx control","Selective Catalytic Reduction","2003-01-01","Other control","Dry sorbent injection","2007-12-01","PM control","Electrostatic precipitator, cold side, w/o flue gas conditioning","1980-05-01","SO2 control","Wet FGD - Jet Bubbling Reactor","2007-12-01","","",null,"","",null,"","",null,"","",null,"","",null,"","",null,"","",null,"",""]
["2718_ES-1",124,null,"coal",2718,"G G Allen","NC","1-2009","ES-1","Conventional Boiler","Tangential firing",176.2,1738,9.8637911464245178,"bituminous","bituminous",null,null,0.11924514949161609,1.1762092498094709,null,null,null,null,0.11924514949161609,1.1762092498094709,"NOx control","Selective Noncatalytic Reduction","2004-05-01","PM control","Electrostatic precipitator, cold side, w/o flue gas conditioning","1988-10-01","SO2 control","Wet FGD - Spray Type","2009-02-01","","",null,"","",null,"","",null,"","",null,"","",null,"","",null,"","",null,"","",null,"",""]
["160_3",125,null,"coal",160,"Apache Station","AZ","ST3","3","Conventional Boiler","Turbo",204,1932.521,9.4731421568627443,"coal - subbituminous","subbituminous",null,null,null,null,null,null,0.12490650035692662,1.1832570341973929,0.12490650035692662,1.1832570341973929,"PM control","Electrostatic precipitator, hot side, w/o flue gas conditioning","1978-06-01","SO2 control","Wet FGD - Spray Type","1978-06-01","","",null,"","",null,"","",null,"","",null,"","",null,"","",null,"","",null,"","",null,"","",null,"",""]
["55076_AA-002",126,null,"coal",55076,"Red Hills Generating Facility","MS","002","AA-002","Fluidized bed firing","Fluidized bed firing",250,2382.3000000000002,9.5292000000000012,"lignite","lignite",null,null,0.12496423704539082,1.1908092076529384,null,null,null,null,0.12496423704539082,1.1908092076529384,"PM control","Fabric Filter, unspecified","2002-05-01","","",null,"","",null,"","",null,"","",null,"","",null,"","",null,"","",null,"","",null,"","",null,"","",null,"",""]
["55076_AA-001",127,null,"coal",55076,"Red Hills Generating Facility","MS","001","AA-001","Fluidized bed firing","Fluidized bed firing",250,2401,9.6039999999999992,"lignite","lignite",null,null,0.12496423704539082,1.2001565325839334,null,null,null,null,0.12496423704539082,1.2001565325839334,"PM control","Fabric Filter, unspecified","2002-05-01","","",null,"","",null,"","",null,"","",null,"","",null,"","",null,"","",null,"","",null,"","",null,"","",null,"",""]
["50976_AABO1",128,null,"coal",50976,"INDIANTOWN COGENERATION L.P.","FL","001","AABO1","Conventional Boiler","Wall firing - opposed firing",361,3422,9.4792243767313025,"bituminous","bituminous",null,null,0.14692128868684484,1.3926998611811165,null,null,0.12666666666666668,1.200701754385965,0.12666666666666668,1.200701754385965,"NOx control","Selective Catalytic Reduction","1995-12-01","SO2 control","Dry FGD - Spray Dryer","1995-12-01","PM control","Fabric Filter, pulse","1995-12-01","","",null,"","",null,"","",null,"","",null,"","",null,"","",null,"","",null,"","",null,"",""]
[{"$f":"E130&\"_\"&I130","v":"3954_1"},129,null,"coal",3954,"Mt. Storm","WV","Unit 1&2","1","Conventional Boiler","Tangential firing",552.79999999999995,6446,11.660636758321274,"bituminous","bituminous",null,null,0.10113599955326762,1.2046559124203593,null,null,null,null,0.10113599955326762,1.2046559124203593,"NOx control","Selective Catalytic Reduction","2003-05-01","NOx control","Selective Catalytic Reduction","2003-05-01","PM control","Electrostatic precipitator, cold side, w/o flue gas conditioning","1966-07-01","PM control","Electrostatic precipitator, cold side, w/o flue gas conditioning","1965-09-01","SO2 control","Wet FGD - Spray Type","2002-03-01","SO2 control","Wet FGD - Spray Type","2002-03-01","","",null,"","",null,"","",null,"","",null,"","",null,"",""]
["3954_2",130,null,"coal",3954,"Mt. Storm","WV","Unit 1&2","2","Conventional Boiler","Tangential firing",555.9,6760,12.160460514481022,"bituminous","bituminous",null,null,0.10113599955326762,1.2046559124203593,null,null,null,null,0.10113599955326762,1.2046559124203593,"NOx control","Selective Catalytic Reduction","2003-05-01","NOx control","Selective Catalytic Reduction","2003-05-01","PM control","Electrostatic precipitator, cold side, w/o flue gas conditioning","1966-07-01","PM control","Electrostatic precipitator, cold side, w/o flue gas conditioning","1965-09-01","SO2 control","Wet FGD - Spray Type","2002-03-01","SO2 control","Wet FGD - Spray Type","2002-03-01","","",null,"","",null,"","",null,"","",null,"","",null,"",""]
["50776_BLR1",131,null,"coal",50776,"PANTHER CREEK ENERGY FACILITY","PA","BG1","BLR1","Fluidized bed firing","Fluidized bed firing",46.5,600,12.903225806451612,"coal refuse (culm or gob)","coal refuse (culm or gob)",null,null,9.3700605318000021E-2,1.209040068619355,null,null,null,null,9.3700605318000021E-2,1.209040068619355,"NOx control","Selective Noncatalytic Reduction","1992-10-01","PM control","Fabric Filter, pulse","1992-10-01","","",null,"","",null,"","",null,"","",null,"","",null,"","",null,"","",null,"","",null,"","",null,"",""]
["50776_BLR2",132,null,"coal",50776,"PANTHER CREEK ENERGY FACILITY","PA","BG2","BLR2","Fluidized bed firing","Fluidized bed firing",46.5,600,12.903225806451612,"coal refuse (culm or gob)","coal refuse (culm or gob)",null,null,9.3700605318000021E-2,1.209040068619355,null,null,null,null,9.3700605318000021E-2,1.209040068619355,"NOx control","Selective Noncatalytic Reduction","1992-10-01","PM control","Fabric Filter, pulse","1992-10-01","","",null,"","",null,"","",null,"","",null,"","",null,"","",null,"","",null,"","",null,"","",null,"",""]
["469_3",133,null,"coal",469,"Cherokee","CO","Unit 3","3","Conventional Boiler","Wall firing - front firing",165,1877,11.375757575757575,"bituminous","bituminous",0.12910000000000002,1.4686103030303033,null,null,0.11096959117000001,1.2623631674308484,null,null,0.11096959117000001,1.2623631674308484,"SO2 control","Dry FGD - Spray Dryer","2002-06-01","PM control","Fabric Filter, reverse air","1988-02-01","","",null,"","",null,"","",null,"","",null,"","",null,"","",null,"","",null,"","",null,"","",null,"",""]
["10343_SG-101",134,null,"coal",10343,"Foster Wheeler Mt Carmel Cogen","PA","SG-101","SG-101","Fluidized bed firing","Fluidized bed firing",43,505,11.744186046511627,"coal refuse (culm or gob)","coal refuse (culm or gob)",null,null,0.10864386280863732,1.275933737636322,null,null,null,null,0.10864386280863732,1.275933737636322,"PM control","Fabric Filter, reverse air","1990-01-01","","",null,"","",null,"","",null,"","",null,"","",null,"","",null,"","",null,"","",null,"","",null,"","",null,"",""]
["3118_2",135,null,"coal",3118,"Conemaugh","PA","CON-2","2","Conventional Boiler","Tangential firing",936,8985,9.5993589743589745,"bituminous","bituminous",null,null,0.13457753874080378,1.2918581042586772,null,null,null,null,0.13457753874080378,1.2918581042586772,"PM control","Electrostatic precipitator, cold side, w/ flue gas conditioning","1971-05-01","SO2 control","Wet FGD - Spray Type","1995-11-01","","",null,"","",null,"","",null,"","",null,"","",null,"","",null,"","",null,"","",null,"","",null,"",""]
["2832_Unit 8",136,null,"coal",2832,"Miami Fort","OH","U8","Unit 8","Conventional Boiler","Wall firing - opposed firing",550,5003,9.0963636363636358,"coal - bituminous","bituminous",null,null,null,null,null,null,0.14466666666666669,1.3159406060606063,0.14466666666666669,1.3159406060606063,"NOx control","Selective Catalytic Reduction","2001-01-01","SO2 control","Wet FGD - Spray Type","2007-01-01","Other control","Dry sorbent injection","2007-01-01","PM control","Electrostatic precipitator, cold side, w/o flue gas conditioning","1978-02-01","","",null,"","",null,"","",null,"","",null,"","",null,"","",null,"","",null,"",""]
["3118_1",137,null,"coal",3118,"Conemaugh","PA","CON-1","1","Conventional Boiler","Tangential firing",936,8985,9.5993589743589745,"bituminous","bituminous",null,null,0.13917258373969707,1.335967590706387,null,null,null,null,0.13917258373969707,1.335967590706387,"PM control","Electrostatic precipitator, cold side, w/ flue gas conditioning","1970-05-01","SO2 control","Wet FGD - Spray Type","1995-01-01","","",null,"","",null,"","",null,"","",null,"","",null,"","",null,"","",null,"","",null,"","",null,"",""]
["127_1",138,null,"coal",127,"Oklaunion","TX","OKL-1","1","Conventional Boiler","Wall firing - opposed firing",670,6800,10.149253731343284,"subbituminous","subbituminous",0.18450000000000003,1.8725373134328362,0.13561733020971514,1.3764146946657658,null,null,null,null,0.13561733020971514,1.3764146946657658,"PM control","Electrostatic precipitator, cold side, w/o flue gas conditioning","1986-01-01","SO2 control","Wet FGD - Spray Type","1986-12-01","","",null,"","",null,"","",null,"","",null,"","",null,"","",null,"","",null,"","",null,"","",null,"",""]
["2079_5A",139,null,"coal",2079,"Hawthorn","MO","5A","5A","Conventional Boiler","Wall firing - opposed firing",594,6600,11.111111111111111,"subbituminous,  bituminous","subbituminous,  bituminous",null,null,0.12535393243236512,1.3928214714707234,null,null,null,null,0.12535393243236512,1.3928214714707234,"NOx control","Selective Catalytic Reduction","2001-05-01","SO2 control","Dry FGD - Spray Dryer","2001-05-01","PM control","Fabric Filter, pulse","2001-05-01","","",null,"","",null,"","",null,"","",null,"","",null,"","",null,"","",null,"","",null,"",""]
["6041_2",140,null,"coal",6041,"H L Spurlock Station","KY","Unit 02","2","Conventional Boiler","Tangential firing",555,5600,10.09009009009009,"bituminous","bituminous",0.14053333333333332,1.4179939939939938,null,null,null,null,null,null,0.14053333333333332,1.4179939939939938,"PM control","Electrostatic precipitator, hot side, w/o flue gas conditioning","1981-02-01","NOx control","Selective Catalytic Reduction","2002-05-01","SO2 control","Wet FGD - Unspecified","2008-10-01","Other control","Wet electrostatic precipitator","2008-10-01","","",null,"","",null,"","",null,"","",null,"","",null,"","",null,"","",null,"",""]
["2832_Unit 7",141,null,"coal",2832,"Miami Fort","OH","U7","Unit 7","Conventional Boiler","Wall firing - opposed firing",550,4995,9.081818181818182,"coal - bituminous","bituminous",null,null,null,null,null,null,0.15766666666666668,1.4319000000000002,0.15766666666666668,1.4319000000000002,"NOx control","Selective Catalytic Reduction","2007-01-01","SO2 control","Wet FGD - Spray Type","2007-01-01","Other control","Dry sorbent injection","2007-01-01","PM control","Electrostatic precipitator, cold side, w/o flue gas conditioning","1975-05-01","","",null,"","",null,"","",null,"","",null,"","",null,"","",null,"","",null,"",""]
["3399_1",142,null,"coal",3399,"Cumberland","TN","1","1","Conventional Boiler","Wall firing - opposed firing",1300,14130,10.86923076923077,"bituminous","bituminous",null,null,0.13267855656852576,1.4421138494717454,null,null,null,null,0.13267855656852576,1.4421138494717454,"NOx control","Selective Catalytic Reduction","2003-05-01","Other control","Other (specify): Hydrated Lime for Opacity","2006-11-01","PM control","Electrostatic precipitator, cold side, w/o flue gas conditioning","1982-06-01","SO2 control","Wet FGD - Spray Type","1995-01-01","","",null,"","",null,"","",null,"","",null,"","",null,"","",null,"","",null,"",""]
["55479_3",143,null,"coal",55479,"Wygen 1","WY","WYG1Cfg","3","Conventional Boiler","Wall firing - front firing",91,1053,11.571428571428571,"subbituminous","subbituminous",0.12766666666666671,1.4772857142857148,null,null,null,null,null,null,0.12766666666666671,1.4772857142857148,"NOx control","Selective Catalytic Reduction","2003-04-01","SO2 control","Dry FGD - Spray Dryer","2003-04-01","PM control","Fabric Filter, pulse","2003-04-01","","",null,"","",null,"","",null,"","",null,"","",null,"","",null,"","",null,"","",null,"",""]
["2840_4",144,null,"coal",2840,"Conesville","OH","CV-4","4","Conventional Boiler","Tangential firing",841.5,7960,9.4592988710635773,"bituminous","bituminous",0.157,1.4851099227569817,null,null,null,null,null,null,0.157,1.4851099227569817,"NOx control","Selective Catalytic Reduction","2009-01-01","PM control","Electrostatic precipitator, cold side, w/o flue gas conditioning","1973-06-01","Other control","Dry sorbent injection","2009-06-01","SO2 control","Wet FGD - Jet Bubbling Reactor","2009-06-01","","",null,"","",null,"","",null,"","",null,"","",null,"","",null,"","",null,"",""]
["3944_1",145,null,"coal",3944,"Harrison Power Station","WV","Boiler1","1","Conventional Boiler","Wall firing - unspecified",693,5779,8.3391053391053394,"bituminous","bituminous",null,null,0.1782925631469047,1.4868004652611289,null,null,null,null,0.1782925631469047,1.4868004652611289,"NOx control","Selective Catalytic Reduction","2002-05-01","PM control","Electrostatic precipitator, cold side, unspecified","1974-12-01","SO2 control","Wet FGD - Spray Type","1994-11-01","","",null,"","",null,"","",null,"","",null,"","",null,"","",null,"","",null,"","",null,"",""]
["130_4",146,null,"coal",130,"Cross","SC","C4","4","Conventional Boiler","Tangential firing",625,6798,10.876799999999999,"bituminous","bituminous",0.1386,1.5075244799999998,null,null,null,null,null,null,0.1386,1.5075244799999998,"NOx control","Selective Catalytic Reduction","2008-05-01","PM control","Electrostatic precipitator, cold side, w/o flue gas conditioning","2008-05-01","SO2 control","Wet FGD - Spray Type","2008-05-01","","",null,"","",null,"","",null,"","",null,"","",null,"","",null,"","",null,"","",null,"",""]
["10566_Boil 1",147,null,"coal",10566,"Chambers Cogeneration LP","NJ","Boil 1","Boil 1","Conventional Boiler","Wall firing - front firing",142.5,1387,9.7333333333333325,"bituminous","bituminous",null,null,0.15911461545440739,1.5487155904228984,null,null,null,null,0.15911461545440739,1.5487155904228984,"NOx control","Selective Catalytic Reduction","1994-03-01","SO2 control","Dry FGD - Spray Dryer","1994-03-01","PM control","Fabric Filter, reverse air","1994-03-01","","",null,"","",null,"","",null,"","",null,"","",null,"","",null,"","",null,"","",null,"",""]
["10678_BLR1",148,null,"coal",10678,"AES Warrior Run Cogeneration Facility","MD","BLR1","BLR1","Fluidized bed firing","Fluidized bed firing",202,2047,10.133663366336634,"bituminous","bituminous",0.15393333333333331,1.5599085808580857,null,null,null,null,null,null,0.15393333333333331,1.5599085808580857,"NOx control","Selective Noncatalytic Reduction","2000-02-01","PM control","Fabric Filter, pulse","2000-02-01","","",null,"","",null,"","",null,"","",null,"","",null,"","",null,"","",null,"","",null,"","",null,"",""]
["10672_CBC",149,null,"coal",10672,"Cedar Bay Generating Company L.P.","FL","CBC1","CBC","Fluidized bed firing","Fluidized bed firing",92,1063,11.554347826086957,"bituminous","bituminous",0.13556666666666667,1.5663844202898551,null,null,null,null,null,null,0.13556666666666667,1.5663844202898551,"SO2 control","Dry FGD - Circulating Dry Scrubber","1994-01-01","NOx control","Selective Noncatalytic Reduction","1994-01-01","PM control","Fabric Filter, pulse","1994-01-01","","",null,"","",null,"","",null,"","",null,"","",null,"","",null,"","",null,"","",null,"",""]
["6113_4",150,null,"coal",6113,"Gibson","IN","4","4","Conventional Boiler","Wall firing - opposed firing",661,6265,9.4780635400907709,"bituminous","bituminous",null,null,0.16690713839146307,1.5819564629690106,null,null,0.38100000000000001,3.6111422087745839,0.16690713839146307,1.5819564629690106,"NOx control","Selective Catalytic Reduction","2003-04-01","Other control","Other (specify): Soda Ash Injection for SO3 mitigation","2004-06-01","PM control","Electrostatic precipitator, cold side, w/o flue gas conditioning","1978-01-01","SO2 control","Wet FGD - Tray Type","1994-12-01","","",null,"","",null,"","",null,"","",null,"","",null,"","",null,"","",null,"",""]
["10566_Boil 2",151,null,"coal",10566,"Chambers Cogeneration LP","NJ","Boil 2","Boil 2","Conventional Boiler","Wall firing - front firing",142.5,1387,9.7333333333333325,"bituminous","bituminous",null,null,0.16815798007889027,1.6367376727678651,null,null,null,null,0.16815798007889027,1.6367376727678651,"NOx control","Selective Catalytic Reduction","1994-03-01","SO2 control","Dry FGD - Spray Dryer","1994-03-01","PM control","Fabric Filter, reverse air","1994-03-01","","",null,"","",null,"","",null,"","",null,"","",null,"","",null,"","",null,"","",null,"",""]
["645_3",152,null,"coal",645,"Big Bend","FL","BB03_SCR_iso","3","Conventional Boiler","Wall firing - opposed firing",400,4115,10.2875,"coal - bituminous, petroleum coke","subbituminous",null,null,null,null,null,null,0.16233292831105711,1.67,0.16233292831105711,1.67,"NOx control","Selective Catalytic Reduction","2008-07-01","PM control","Electrostatic precipitator, hot side, w/o flue gas conditioning","1976-05-01","SO2 control","Wet FGD - Packed Type","2008-01-01","","",null,"","",null,"","",null,"","",null,"","",null,"","",null,"","",null,"","",null,"",""]
["3944_3",153,null,"coal",3944,"Harrison Power Station","WV","Boiler3","3","Conventional Boiler","Wall firing - unspecified",692,5876,8.4913294797687868,"bituminous","bituminous",null,null,0.20523489335526338,1.742717100224751,null,null,null,null,0.20523489335526338,1.742717100224751,"NOx control","Selective Catalytic Reduction","2003-05-01","PM control","Electrostatic precipitator, cold side, unspecified","1972-12-01","SO2 control","Wet FGD - Spray Type","1994-11-01","","",null,"","",null,"","",null,"","",null,"","",null,"","",null,"","",null,"","",null,"",""]
["2403_U2",154,null,"coal",2403,"PSEG Hudson Generating Station","NJ","HUDU2E2PT2OS1-Coal","U2","Conventional Boiler","Wall firing - opposed firing",659.7,6600,10.004547521600728,"natural gas","subbituminous",null,null,null,null,null,null,0.18298619730722043,1.8306941067570939,0.18298619730722043,1.8306941067570939,"NOx control","Selective Noncatalytic Reduction","1999-03-01","PM control","Electrostatic precipitator, cold side, w/ flue gas conditioning","1968-12-01","","",null,"","",null,"","",null,"","",null,"","",null,"","",null,"","",null,"","",null,"","",null,"",""]
["568_BHB3",155,null,"coal",568,"Bridgeport Station","CT","BHSEMU3OS2-Coal","BHB3","Conventional Boiler","Tangential firing",403,4100,10.173697270471465,"subbituminous","subbituminous",null,null,0.18065583697492216,1.8379377955265035,null,null,null,null,0.18065583697492216,1.8379377955265035,"PM control","Electrostatic precipitator, cold side, w/o flue gas conditioning","1968-08-01","Other control","Activated carbon injection","2008-07-01","PM control","Fabric Filter, pulse","2008-01-01","","",null,"","",null,"","",null,"","",null,"","",null,"","",null,"","",null,"","",null,"",""]
["1382_H1",156,null,"coal",1382,"HMP&L Station Two Henderson","KY","1","H1","Conventional Boiler","Wall firing - rear firing",166.1,1799,10.830824804334739,"bituminous","bituminous",0.17536666666666664,1.8993656431868351,null,null,null,null,null,null,0.17536666666666664,1.8993656431868351,"NOx control","Selective Catalytic Reduction","2003-10-01","PM control","Electrostatic precipitator, cold side, w/o flue gas conditioning","1973-06-01","SO2 control","Wet FGD - Tray Type","1995-06-01","","",null,"","",null,"","",null,"","",null,"","",null,"","",null,"","",null,"","",null,"",""]
["207_PPBoiler2",157,null,"coal",207,"St Johns River Power Park","FL","PPUnit2Configuration","PPBoiler2","Conventional Boiler","Wall firing - opposed firing",660,6144,9.3090909090909086,"bituminous","bituminous",0.20700000000000005,1.9269818181818186,null,null,null,null,null,null,0.20700000000000005,1.9269818181818186,"NOx control","Selective Catalytic Reduction","2009-03-01","NOx control","Other (specify): Ammonia Injection for SO3 Mitigation","2009-03-01","PM control","Electrostatic precipitator, cold side, w/ flue gas conditioning","1986-12-01","SO2 control","Wet FGD - Spray/Tray Type","1988-03-01","SO2 control","Wet FGD - Spray Type","1988-03-01","","",null,"","",null,"","",null,"","",null,"","",null,"","",null,"",""]
["963_31",158,null,"coal",963,"Dallman","IL","31","31","Conventional Boiler","Cyclone firing",90,962.12,10.690222222222221,"bituminous","bituminous",0.1821666666666667,1.9474021481481483,null,null,null,null,null,null,0.1821666666666667,1.9474021481481483,"NOx control","Selective Catalytic Reduction","2003-05-01","PM control","Electrostatic precipitator, cold side, w/o flue gas conditioning","1968-06-01","SO2 control","Wet FGD - Packed Type","2001-08-01","","",null,"","",null,"","",null,"","",null,"","",null,"","",null,"","",null,"","",null,"",""]
["207_PPBoiler1",159,null,"coal",207,"St Johns River Power Park","FL","PPUnit1Configuration","PPBoiler1","Conventional Boiler","Wall firing - opposed firing",660,6144,9.3090909090909086,"bituminous","bituminous",0.21052000000000001,1.9597498181818183,null,null,null,null,null,null,0.21052000000000001,1.9597498181818183,"NOx control","Selective Catalytic Reduction","2009-07-01","NOx control","Other (specify): Ammonia Injection for SO3 Mitigation","2009-06-01","PM control","Electrostatic precipitator, cold side, w/ flue gas conditioning","1988-03-01","SO2 control","Wet FGD - Spray/Tray Type","1986-12-01","SO2 control","Wet FGD - Spray Type","1986-12-01","","",null,"","",null,"","",null,"","",null,"","",null,"","",null,"",""]
["963_32",160,null,"coal",963,"Dallman","IL","32","32","Conventional Boiler","Cyclone firing",84,905.94,10.785,"bituminous","bituminous",0.1821666666666667,1.9646675000000005,null,null,null,null,null,null,0.1821666666666667,1.9646675000000005,"NOx control","Selective Catalytic Reduction","2003-05-01","PM control","Electrostatic precipitator, cold side, w/o flue gas conditioning","1972-06-01","SO2 control","Wet FGD - Packed Type","2001-08-01","","",null,"","",null,"","",null,"","",null,"","",null,"","",null,"","",null,"","",null,"",""]
["2828_1",161,null,"coal",2828,"Cardinal","OH","CD-U1","1","Conventional Boiler","Wall firing - opposed firing",615.20000000000005,5275,8.5744473342002596,"bituminous","bituminous",0.23494999999999999,2.014566401170351,null,null,null,null,null,null,0.23494999999999999,2.014566401170351,"NOx control","Selective Catalytic Reduction","2003-01-01","Other control","Dry sorbent injection","2008-03-01","PM control","Electrostatic precipitator, cold side, w/o flue gas conditioning","1980-05-01","SO2 control","Wet FGD - Jet Bubbling Reactor","2008-03-01","","",null,"","",null,"","",null,"","",null,"","",null,"","",null,"","",null,"",""]
["3122_3",162,null,"coal",3122,"Homer City Station","PA","HC3CONFIG","3","Conventional Boiler","Wall firing - opposed firing",680,6175,9.0808823529411757,"bituminous","bituminous",0.22583333333333339,2.0507659313725495,null,null,null,null,null,null,0.22583333333333339,2.0507659313725495,"NOx control","Selective Catalytic Reduction","2001-06-01","PM control","Electrostatic precipitator, cold side, w/ flue gas conditioning","1977-12-01","SO2 control","Wet FGD - Spray Type","2001-09-01","","",null,"","",null,"","",null,"","",null,"","",null,"","",null,"","",null,"","",null,"",""]
["10673_BLR B",163,null,"coal",10673,"AES Hawaii","HI","002","BLR B","Fluidized bed firing","Fluidized bed firing",101.5,944.2,9.3024630541871929,"bituminous","bituminous",0.22503333333333334,2.0933642692939247,null,null,null,null,null,null,0.22503333333333334,2.0933642692939247,"NOx control","Selective Noncatalytic Reduction",null,"PM control","Fabric Filter, unspecified",null,"","",null,"","",null,"","",null,"","",null,"","",null,"","",null,"","",null,"","",null,"","",null,"",""]
["50951_1",164,null,"coal",50951,"Sunnyside Cogen Associates","UT","Config 1","1","Fluidized bed firing","Fluidized bed firing",60,700,11.666666666666666,"bituminous","bituminous",null,null,0.18148502722607515,2.1173253176375435,null,null,0.18385714285714286,2.145,0.18148502722607515,2.1173253176375435,"NOx control","Other (specify): Anhydrous ammonia injection","1993-01-01","SO2 control","Dry FGD - Sorbent Injection","1993-01-01","PM control","Fabric Filter, pulse","1993-01-01","","",null,"","",null,"","",null,"","",null,"","",null,"","",null,"","",null,"","",null,"",""]
["10673_BLR A",165,null,"coal",10673,"AES Hawaii","HI","001","BLR A","Fluidized bed firing","Fluidized bed firing",101.5,1021.4,10.063054187192119,"bituminous","bituminous",0.22333333333333338,2.2474154351395739,null,null,null,null,null,null,0.22333333333333338,2.2474154351395739,"NOx control","Selective Noncatalytic Reduction",null,"PM control","Fabric Filter, unspecified",null,"","",null,"","",null,"","",null,"","",null,"","",null,"","",null,"","",null,"","",null,"","",null,"",""]
["3399_2",166,null,"coal",3399,"Cumberland","TN","2","2","Conventional Boiler","Wall firing - opposed firing",1300,14130,10.86923076923077,"bituminous","bituminous",null,null,0.20865998783620629,2.2679735600966113,null,null,null,null,0.20865998783620629,2.2679735600966113,"NOx control","Selective Catalytic Reduction","2004-05-01","Other control","Other (specify): Hydrated Lime for opacity","2006-11-01","PM control","Electrostatic precipitator, cold side, w/o flue gas conditioning","1982-06-01","SO2 control","Wet FGD - Spray Type","1995-01-01","","",null,"","",null,"","",null,"","",null,"","",null,"","",null,"","",null,"",""]
["1382_H2",167,null,"coal",1382,"HMP&L Station Two Henderson","KY","2","H2","Conventional Boiler","Wall firing - rear firing",173.1,1866.2,10.781051415366841,"bituminous","bituminous",0.21489999999999998,2.3168479491623337,null,null,null,null,null,null,0.21489999999999998,2.3168479491623337,"NOx control","Selective Catalytic Reduction","2004-04-01","PM control","Electrostatic precipitator, cold side, w/o flue gas conditioning","1974-04-01","SO2 control","Wet FGD - Tray Type","1995-06-01","","",null,"","",null,"","",null,"","",null,"","",null,"","",null,"","",null,"","",null,"",""]
["6041_3",168,null,"coal",6041,"H L Spurlock Station","KY","Unit 03","3","Fluidized bed firing","Fluidized bed firing",300,2500,8.3333333333333339,"bituminous","bituminous",0.28070000000000006,2.3391666666666673,null,null,null,null,null,null,0.28070000000000006,2.3391666666666673,"NOx control","Selective Noncatalytic Reduction","2005-03-01","SO2 control","Dry FGD - Unspecified","2005-03-01","PM control","Fabric Filter, pulse","2005-03-01","","",null,"","",null,"","",null,"","",null,"","",null,"","",null,"","",null,"","",null,"",""]
["3788_4",169,null,"coal",3788,"Potomac River","VA","4","4","Conventional Boiler","Tangential firing",108,961,8.8981481481481488,"coal - bituminous","bituminous",null,null,null,null,null,null,0.27,2.4025000000000003,0.27,2.4025000000000003,"SO2 control","Dry FGD - Sorbent Injection","2006-05-01","PM control","Electrostatic precipitator, hot side, w/o flue gas conditioning","1978-10-01","PM control","Electrostatic precipitator, cold side, w/o flue gas conditioning","1956-02-01","","",null,"","",null,"","",null,"","",null,"","",null,"","",null,"","",null,"","",null,"",""]
["8102_2",170,null,"coal",8102,"General James M. Gavin","OH","GA-2","2","Conventional Boiler","Wall firing - opposed firing",1320,11936,9.0424242424242429,"bituminous","bituminous",0.26869230769230767,2.4296298368298368,null,null,null,null,null,null,0.26869230769230767,2.4296298368298368,"NOx control","Selective Catalytic Reduction","2000-01-01","Other control","Dry sorbent injection","2001-01-01","PM control","Electrostatic precipitator, cold side, w/o flue gas conditioning","1975-03-01","SO2 control","Wet FGD - Spray Type","1995-03-01","","",null,"","",null,"","",null,"","",null,"","",null,"","",null,"","",null,"",""]
["1356_3",171,null,"coal",1356,"Ghent","KY","GH3","3","Conventional Boiler","Wall firing - opposed firing",525,5868,11.177142857142858,"bituminous","bituminous",0.21783333333333335,2.4347542857142859,null,null,null,null,null,null,0.21783333333333335,2.4347542857142859,"Other control","Other (specify): Sorbent injection for SO3 reduction","2008-06-01","PM control","Electrostatic precipitator, hot side, w/o flue gas conditioning","1981-05-01","NOx control","Selective Catalytic Reduction","2004-05-01","Other control","Other (specify): Sorbent injection for SO3 reduction","2008-06-01","SO2 control","Wet FGD - Spray Type","2007-05-01","","",null,"","",null,"","",null,"","",null,"","",null,"","",null,"",""]
["10675_B",172,null,"coal",10675,"AES Thames","CT","B","B","Fluidized bed firing","Fluidized bed firing",104,1002,9.634615384615385,"bituminous","bituminous",0.25286666666666668,2.4362730769230772,null,null,null,null,0.28999999999999998,2.7940384615384612,0.25286666666666668,2.4362730769230772,"SO2 control","Dry FGD - Circulating Dry Scrubber","1990-03-01","PM control","Fabric Filter, pulse","1990-03-01","","",null,"","",null,"","",null,"","",null,"","",null,"","",null,"","",null,"","",null,"","",null,"",""]
["10675_A",173,null,"coal",10675,"AES Thames","CT","A","A","Fluidized bed firing","Fluidized bed firing",104,1002,9.634615384615385,"bituminous","bituminous",0.25759999999999994,2.4818769230769226,null,null,null,null,0.28999999999999998,2.7940384615384612,0.25759999999999994,2.4818769230769226,"SO2 control","Dry FGD - Circulating Dry Scrubber","1990-03-01","PM control","Fabric Filter, pulse","1990-03-01","","",null,"","",null,"","",null,"","",null,"","",null,"","",null,"","",null,"","",null,"","",null,"",""]
["3149_2",174,null,"coal",3149,"PPL Montour","PA","U2","2","Conventional Boiler","Tangential firing",792,7239,9.1401515151515156,"bituminous","bituminous",null,null,0.27721706375550142,2.5338059653107008,null,null,null,null,0.27721706375550142,2.5338059653107008,"PM control","Electrostatic precipitator, cold side, w/o flue gas conditioning","2000-05-01","NOx control","Selective Catalytic Reduction","2000-05-01","SO2 control","Wet FGD - Tray Type","2008-03-01","","",null,"","",null,"","",null,"","",null,"","",null,"","",null,"","",null,"","",null,"",""]
["8102_1",175,null,"coal",8102,"General James M. Gavin","OH","GA-1","1","Conventional Boiler","Wall firing - opposed firing",1320,11936,9.0424242424242429,"bituminous","bituminous",0.29073333333333334,2.6289341414141418,null,null,null,null,null,null,0.29073333333333334,2.6289341414141418,"NOx control","Selective Catalytic Reduction","2000-01-01","Other control","Dry sorbent injection","2001-01-01","PM control","Electrostatic precipitator, cold side, w/o flue gas conditioning","1974-04-01","SO2 control","Wet FGD - Spray Type","1994-12-01","","",null,"","",null,"","",null,"","",null,"","",null,"","",null,"","",null,"",""]
["10849_BLR1",176,null,"coal",10849,"Silver Bay Power","MN","GEN1","BLR1","Conventional Boiler","Wall firing - front firing",45,371.91187187999998,8.2647082639999994,"subbituminous","subbituminous",0.44133333333333324,3.6474912471786656,null,null,null,null,0.33666666666666667,2.7824517822133332,0.33666666666666667,2.7824517822133332,"PM control","Fabric Filter, reverse air","1980-01-01","","",null,"","",null,"","",null,"","",null,"","",null,"","",null,"","",null,"","",null,"","",null,"","",null,"",""]
["645_4",177,null,"coal",645,"Big Bend","FL","BB04_SCR_iso","4","Conventional Boiler","Tangential firing",465,4330,9.3118279569892479,"coal - bituminous, petroleum coke, coal refuse","subbituminous",null,null,null,null,null,null,0.30394856468080217,2.8303167420814481,0.30394856468080217,2.8303167420814481,"NOx control","Selective Catalytic Reduction","2007-06-01","PM control","Electrostatic precipitator, hot side, w/o flue gas conditioning","1985-02-01","SO2 control","Wet FGD - Packed Type","2008-01-01","","",null,"","",null,"","",null,"","",null,"","",null,"","",null,"","",null,"","",null,"",""]
["3788_5",178,null,"coal",3788,"Potomac River","VA","5","5","Conventional Boiler","Tangential firing",108,961,8.8981481481481488,"coal - bituminous","bituminous",null,null,null,null,null,null,0.32,2.8474074074074078,0.32,2.8474074074074078,"SO2 control","Dry FGD - Sorbent Injection","2006-05-01","PM control","Electrostatic precipitator, hot side, w/o flue gas conditioning","1978-10-01","PM control","Electrostatic precipitator, cold side, w/o flue gas conditioning","1957-05-01","","",null,"","",null,"","",null,"","",null,"","",null,"","",null,"","",null,"","",null,"",""]
["6664_101",179,null,"coal",6664,"Louisa","IA","101","101","Conventional Boiler","Wall firing - unspecified",805,8624,10.71304347826087,"subbituminous","subbituminous",0.26829999999999998,2.8743095652173913,null,null,null,null,null,null,0.26829999999999998,2.8743095652173913,"SO2 control","Dry FGD - Circulating Dry Scrubber","2007-12-01","PM control","Fabric Filter, pulse","2007-12-01","","",null,"","",null,"","",null,"","",null,"","",null,"","",null,"","",null,"","",null,"","",null,"",""]
["50611_031",180,null,"coal",50611,"WPS Westwood Generation, LLC","PA","001","031","Fluidized bed firing","Fluidized bed firing",36,615,17.083333333333332,"coal refuse (culm or gob)","coal refuse (culm or gob)",0.16833333333333336,2.8756944444444446,null,null,null,null,null,null,0.16833333333333336,2.8756944444444446,"PM control","Fabric Filter, pulse","1987-12-01","","",null,"","",null,"","",null,"","",null,"","",null,"","",null,"","",null,"","",null,"","",null,"","",null,"",""]
["6177_U2B",181,null,"coal",6177,"Coronado Generating Station","AZ","U2B","U2B","Conventional Boiler","Wall firing - unspecified",456.6,4719,10.33508541392904,"","Bituminous, Subbituminous",null,null,null,null,null,null,0.28000000000000003,2.8938239159001315,0.28000000000000003,2.8938239159001315,"PM control","Electrostatic precipitator, hot side, unspecified","1980-10-01","","",null,"","",null,"","",null,"","",null,"","",null,"","",null,"","",null,"","",null,"","",null,"","",null,"",""]
["2378_2",182,null,"coal",2378,"BL England","NJ","2 Coal w or w/o TDF","2","Conventional Boiler","Cyclone firing",167.3,1600,9.5636580992229518,"bituminous","bituminous",null,null,null,null,null,null,0.30993224462365587,2.9640860215053757,0.30993224462365587,2.9640860215053757,"NOx control","Selective Noncatalytic Reduction","1998-06-01","Other control","Activated carbon injection","2007-12-01","PM control","Electrostatic precipitator, cold side, w/o flue gas conditioning","1979-01-01","SO2 control","Wet FGD - Spray Type","1994-11-01","","",null,"","",null,"","",null,"","",null,"","",null,"","",null,"","",null,"",""]
["6177_U1B",183,null,"coal",6177,"Coronado Generating Station","AZ","U1B","U1B","Conventional Boiler","Wall firing - unspecified",456.6,4719,10.33508541392904,"","Bituminous, Subbituminous",null,null,null,null,null,null,0.28999999999999998,2.9971747700394213,0.28999999999999998,2.9971747700394213,"PM control","Electrostatic precipitator, hot side, unspecified","1979-12-01","","",null,"","",null,"","",null,"","",null,"","",null,"","",null,"","",null,"","",null,"","",null,"","",null,"",""]
["3161_2",184,null,"coal",3161,"Eddystone Generating Station","PA","Unit 2","2","Conventional Boiler","Tangential firing",339,2808,8.283185840707965,"bituminous","bituminous",0.38019999999999998,3.149267256637168,null,null,null,null,null,null,0.38019999999999998,3.149267256637168,"NOx control","Selective Noncatalytic Reduction","2003-06-01","PM control","Multiple cyclone","1960-11-01","PM control","Electrostatic precipitator, hot side, w/o flue gas conditioning","1960-11-01","PM control","PM scrubber - Venturi","1982-12-01","SO2 control","Wet FGD - Spray Type","1982-12-01","","",null,"","",null,"","",null,"","",null,"","",null,"","",null,"",""]
["6085_18",185,null,"coal",6085,"R.M. Schahfer","IN","R.M.0018","18","Conventional Boiler","Tangential firing",393,3967,10.0941475826972,"bituminous","bituminous",null,null,0.31636356854335479,3.1934205506653646,null,null,null,null,0.31636356854335479,3.1934205506653646,"PM control","Electrostatic precipitator, cold side, w/o flue gas conditioning","1986-01-01","SO2 control","Wet FGD - Spray Type","1986-02-01","","",null,"","",null,"","",null,"","",null,"","",null,"","",null,"","",null,"","",null,"","",null,"",""]
["3130_1",186,null,"coal",3130,"Seward","PA","SEW-1","1","Fluidized bed firing","Fluidized bed firing",292.5,3100,10.598290598290598,"coal refuse (culm or gob)","coal refuse (culm or gob)",null,null,0.33537253472545636,3.5543755817056915,null,null,null,null,0.33537253472545636,3.5543755817056915,"NOx control","Selective Noncatalytic Reduction","2004-03-01","PM control","Fabric Filter, pulse","2004-03-01","","",null,"","",null,"","",null,"","",null,"","",null,"","",null,"","",null,"","",null,"","",null,"",""]
["3130_2",187,null,"coal",3130,"Seward","PA","SEW-1","2","Fluidized bed firing","Fluidized bed firing",292.5,3100,10.598290598290598,"coal refuse (culm or gob)","coal refuse (culm or gob)",null,null,0.33537253472545636,3.5543755817056915,null,null,null,null,0.33537253472545636,3.5543755817056915,"NOx control","Selective Noncatalytic Reduction","2004-03-01","PM control","Fabric Filter, pulse","2004-03-01","","",null,"","",null,"","",null,"","",null,"","",null,"","",null,"","",null,"","",null,"","",null,"",""]
["8219_1",188,null,"coal",8219,"Ray D Nixon","CO","Unit 1","1","Conventional Boiler","Wall firing - front firing",225,2095,9.3111111111111118,"subbituminous","subbituminous",null,null,null,null,null,null,0.39066666666666672,3.6375407407407416,0.39066666666666672,3.6375407407407416,"PM control","Fabric Filter, reverse air","1980-04-01","","",null,"","",null,"","",null,"","",null,"","",null,"","",null,"","",null,"","",null,"","",null,"","",null,"",""]
["6019_1",189,null,"coal",6019,"W H Zimmer","OH","1","1","Conventional Boiler","Wall firing - opposed firing",1408,12656,8.9886363636363633,"bituminous,  bituminous,  bituminous","bituminous,  bituminous,  bituminous",null,null,0.40490067388679246,3.6395049209596912,null,null,null,null,0.40490067388679246,3.6395049209596912,"Other control","Other (specify): Magnesium Hydroxide Injection",null,"NOx control","Selective Catalytic Reduction","2004-01-01","Other control","Dry sorbent injection","2004-05-01","PM control","Electrostatic precipitator, cold side, w/o flue gas conditioning","1991-03-01","SO2 control","Wet FGD - Spray Type","2004-06-01","","",null,"","",null,"","",null,"","",null,"","",null,"","",null,"",""]
["3136_2",190,null,"coal",3136,"Keystone","PA","KEY-2-4","2","Conventional Boiler","Tangential firing",936,8695,9.2895299145299148,"coal - bituminous","bituminous",null,null,null,null,null,null,0.39333333333333331,3.6538817663817662,0.39333333333333331,3.6538817663817662,"NOx control","Selective Catalytic Reduction","2003-05-01","PM control","Electrostatic precipitator, cold side, w/ flue gas conditioning","1974-04-01","SO2 control","Wet FGD - Spray Type","2009-11-01","","",null,"","",null,"","",null,"","",null,"","",null,"","",null,"","",null,"","",null,"",""]
["50039_001",191,null,"coal",50039,"Kline Township Cogen Facility","PA","001","001","Fluidized bed firing","Fluidized bed firing",58,825,14.224137931034482,"coal refuse (culm or gob)","coal refuse (culm or gob)",null,null,0.25912594783514392,3.685843223517133,null,null,null,null,0.25912594783514392,3.685843223517133,"PM control","Fabric Filter, unspecified",null,"","",null,"","",null,"","",null,"","",null,"","",null,"","",null,"","",null,"","",null,"","",null,"","",null,"",""]
["2554_4",192,null,"coal",2554,"Dunkirk Generating Plant","NY","4","4","Conventional Boiler","Tangential firing",195,1836,9.4153846153846157,"subbituminous","subbituminous",null,null,0.40713586621785885,3.8333407711589174,null,null,null,null,0.40713586621785885,3.8333407711589174,"NOx control","Selective Noncatalytic Reduction",null,"Other control","Dry sorbent injection",null,"PM control","Fabric Filter, unspecified","2009-05-01","","",null,"","",null,"","",null,"","",null,"","",null,"","",null,"","",null,"","",null,"",""]
[{"$f":"E194&\"_\"&I194","v":"3140_2"},193,null,"coal",3140,"PPL Brunner Island","PA","U2","2","Conventional Boiler","Tangential firing",393,3790,9.6437659033078873,"bituminous","bituminous",null,null,0.40277115279491854,3.8842307101596467,null,null,null,null,0.40277115279491854,3.8842307101596467,"PM control","Electrostatic precipitator, cold side, w/o flue gas conditioning","2009-10-01","SO2 control","Wet FGD - Tray Type","2009-11-01","","",null,"","",null,"","",null,"","",null,"","",null,"","",null,"","",null,"","",null,"","",null,"",""]
["3136_1",194,null,"coal",3136,"Keystone","PA","KEY-1-4","1","Conventional Boiler","Tangential firing",936,8695,9.2895299145299148,"coal - bituminous","bituminous",null,null,null,null,null,null,0.42016666666666663,3.9031508190883191,0.42016666666666663,3.9031508190883191,"NOx control","Selective Catalytic Reduction","2003-05-01","PM control","Electrostatic precipitator, cold side, w/ flue gas conditioning","1974-04-01","SO2 control","Wet FGD - Spray Type","2009-09-01","","",null,"","",null,"","",null,"","",null,"","",null,"","",null,"","",null,"","",null,"",""]
["3140_1",195,null,"coal",3140,"PPL Brunner Island","PA","U1","1","Conventional Boiler","Tangential firing",330,3345,10.136363636363637,"bituminous","bituminous",null,null,0.40277115279491854,4.0826348669666741,null,null,null,null,0.40277115279491854,4.0826348669666741,"PM control","Fabric Filter, pulse","1965-01-01","SO2 control","Wet FGD - Tray Type","2009-11-01","","",null,"","",null,"","",null,"","",null,"","",null,"","",null,"","",null,"","",null,"","",null,"",""]
["2535_1",196,null,"coal",2535,"AES Cayuga, LLC","NY","Unit_1","1","Conventional Boiler","Tangential firing",164,1462,8.9146341463414629,"bituminous","bituminous",0.45856666666666673,4.087954065040651,null,null,null,null,null,null,0.45856666666666673,4.087954065040651,"NOx control","Selective Catalytic Reduction",null,"PM control","Electrostatic precipitator, cold side, w/o flue gas conditioning",null,"SO2 control","Wet FGD - Spray Type","1995-06-01","","",null,"","",null,"","",null,"","",null,"","",null,"","",null,"","",null,"","",null,"",""]
["10113_CFB1",197,null,"coal",10113,"John B Rich Memorial Power Station","PA","CFB1","CFB1","Fluidized bed firing","Fluidized bed firing",44,520,11.818181818181818,"coal refuse (culm or gob)","coal refuse (culm or gob)",null,null,0.34643133768651119,4.0941885362951327,null,null,null,null,0.34643133768651119,4.0941885362951327,"PM control","Fabric Filter, pulse",null,"","",null,"","",null,"","",null,"","",null,"","",null,"","",null,"","",null,"","",null,"","",null,"","",null,"",""]
["10113_CFB2",198,null,"coal",10113,"John B Rich Memorial Power Station","PA","CFB2","CFB2","Fluidized bed firing","Fluidized bed firing",44,520,11.818181818181818,"coal refuse (culm or gob)","coal refuse (culm or gob)",null,null,0.34643133768651119,4.0941885362951327,null,null,null,null,0.34643133768651119,4.0941885362951327,"PM control","Fabric Filter, pulse",null,"","",null,"","",null,"","",null,"","",null,"","",null,"","",null,"","",null,"","",null,"","",null,"","",null,"",""]
["3149_1",199,null,"coal",3149,"PPL Montour","PA","U1","1","Conventional Boiler","Tangential firing",797,7239,9.0828105395232122,"bituminous","bituminous",null,null,0.45804453827123409,4.1603317597810081,null,null,null,null,0.45804453827123409,4.1603317597810081,"PM control","Electrostatic precipitator, cold side, w/o flue gas conditioning","2001-05-01","NOx control","Selective Catalytic Reduction","2001-05-01","SO2 control","Wet FGD - Tray Type","2008-05-01","","",null,"","",null,"","",null,"","",null,"","",null,"","",null,"","",null,"","",null,"",""]
["10641_B1",200,null,"coal",10641,"Cambria Cogen","PA","001","B1","Fluidized bed firing","Fluidized bed firing",49,560,11.428571428571429,"coal refuse (culm or gob),  other--natural gas","coal refuse (culm or gob),  other--natural gas",null,null,0.37532674624343593,4.2894485284964103,null,null,null,null,0.37532674624343593,4.2894485284964103,"NOx control","Selective Noncatalytic Reduction",null,"PM control","Fabric Filter, unspecified",null,"","",null,"","",null,"","",null,"","",null,"","",null,"","",null,"","",null,"","",null,"","",null,"",""]
["1250_3",201,null,"coal",1250,"Lawrence Energy Center","KS","3","3","Conventional Boiler","Tangential firing",58,645,11.120689655172415,"bituminous","bituminous",233.32529032819443,2594.7381424428522,null,null,0.39750000000000002,4.4204741379310351,null,null,0.39750000000000002,4.4204741379310351,"PM control","Electrostatic precipitator, cold side, w/o flue gas conditioning","1977-06-01","","",null,"","",null,"","",null,"","",null,"","",null,"","",null,"","",null,"","",null,"","",null,"","",null,"",""]
["2554_1",202,null,"coal",2554,"Dunkirk Generating Plant","NY","1","1","Conventional Boiler","Tangential firing",85,922.2,10.849411764705883,"subbituminous","subbituminous",null,null,0.40825745061659663,4.4293531877485339,null,null,null,null,0.40825745061659663,4.4293531877485339,"NOx control","Selective Noncatalytic Reduction",null,"Other control","Dry sorbent injection",null,"PM control","Fabric Filter, unspecified","2009-12-01","","",null,"","",null,"","",null,"","",null,"","",null,"","",null,"","",null,"","",null,"",""]
["6139_1",203,null,"coal",6139,"Welsh","TX","WE-1","1","Conventional Boiler","Wall firing - opposed firing",558,5156,9.2401433691756267,"subbituminous","subbituminous",0.47975000000000007,4.4329587813620073,null,null,null,null,null,null,0.47975000000000007,4.4329587813620073,"PM control","Electrostatic precipitator, hot side, w/o flue gas conditioning","1977-03-01","","",null,"","",null,"","",null,"","",null,"","",null,"","",null,"","",null,"","",null,"","",null,"","",null,"",""]
["891_Boiler 9",204,null,"coal",891,"Havana","IL","Boiler 9","Boiler 9","Conventional Boiler","Wall firing - unspecified",481,5030,10.457380457380458,"bituminous","bituminous",0.43072413793103448,4.5042461825220448,null,null,null,null,null,null,0.43072413793103448,4.5042461825220448,"PM control","Electrostatic precipitator, hot side, unspecified","1978-04-01","NOx control","Selective Catalytic Reduction","2003-08-01","Other control","Activated carbon injection","2009-07-01","SO2 control","Dry FGD - Spray Dryer",null,"PM control","Fabric Filter, unspecified","2009-06-01","","",null,"","",null,"","",null,"","",null,"","",null,"","",null,"",""]
["10743_CFB1",205,null,"coal",10743,"Morgantown Energy Facility","WV","Unit 1&2","CFB1","Fluidized bed firing","Fluidized bed firing",29,457,15.758620689655173,"bituminous","bituminous",null,null,0.29464176906827866,4.6228277560712687,null,null,null,null,0.29464176906827866,4.6228277560712687,"PM control","Fabric Filter, pulse","1992-01-01","PM control","Fabric Filter, pulse","1992-01-01","","",null,"","",null,"","",null,"","",null,"","",null,"","",null,"","",null,"","",null,"","",null,"",""]
["10743_CFB2",206,null,"coal",10743,"Morgantown Energy Facility","WV","Unit 1&2","CFB2","Fluidized bed firing","Fluidized bed firing",29,453,15.620689655172415,"bituminous","bituminous",null,null,0.29464176906827866,4.6228277560712687,null,null,null,null,0.29464176906827866,4.6228277560712687,"PM control","Fabric Filter, pulse","1992-01-01","PM control","Fabric Filter, pulse","1992-01-01","","",null,"","",null,"","",null,"","",null,"","",null,"","",null,"","",null,"","",null,"","",null,"",""]
["884_4",207,null,"coal",884,"Will County","IL","WC4CONFIG","4","Conventional Boiler","Tangential firing",542,5254.5300000000007,9.6947047970479723,"subbituminous","subbituminous",0.47749999999999992,4.6292215405904065,null,null,null,null,null,null,0.47749999999999992,4.6292215405904065,"Other control","Activated carbon injection","2009-07-01","PM control","Electrostatic precipitator, cold side, w/o flue gas conditioning","1963-06-01","","",null,"","",null,"","",null,"","",null,"","",null,"","",null,"","",null,"","",null,"","",null,"",""]
["50974_#1 CFB boiler",208,null,"coal",50974,"Scrubgrass Generating Company L.P.","PA","Gen 1","#1 CFB boiler","Fluidized bed firing","Fluidized bed firing",48.5,650,13.402061855670103,"coal refuse (culm or gob)","coal refuse (culm or gob)",null,null,0.36757015513489266,4.7367288032846995,null,null,null,null,0.36757015513489266,4.7367288032846995,"NOx control","Selective Noncatalytic Reduction","1999-06-01","NOx control","Selective Noncatalytic Reduction","1999-06-01","PM control","Fabric Filter, pulse","1993-06-01","PM control","Fabric Filter, pulse","1993-06-01","SO2 control","Dry FGD - Circulating Dry Scrubber","1993-06-01","SO2 control","Dry FGD - Circulating Dry Scrubber","1993-06-01","","",null,"","",null,"","",null,"","",null,"","",null,"",""]
["50974_#2 CFB Boiler",209,null,"coal",50974,"Scrubgrass Generating Company L.P.","PA","Gen 1","#2 CFB Boiler","Fluidized bed firing","Fluidized bed firing",48.5,600,12.371134020618557,"coal refuse (culm or gob)","coal refuse (culm or gob)",null,null,0.36757015513489266,4.7367288032846995,null,null,null,null,0.36757015513489266,4.7367288032846995,"NOx control","Selective Noncatalytic Reduction","1999-06-01","NOx control","Selective Noncatalytic Reduction","1999-06-01","PM control","Fabric Filter, pulse","1993-06-01","PM control","Fabric Filter, pulse","1993-06-01","SO2 control","Dry FGD - Circulating Dry Scrubber","1993-06-01","SO2 control","Dry FGD - Circulating Dry Scrubber","1993-06-01","","",null,"","",null,"","",null,"","",null,"","",null,"",""]
["874_5",210,null,"coal",874,"Joliet 9","IL","JOL5 CONFIG","5","Conventional Boiler","Cyclone firing",326,3572.3780000000002,10.95821472392638,"subbituminous","subbituminous",0.43349999999999994,4.750386082822085,null,null,null,null,null,null,0.43349999999999994,4.750386082822085,"Other control","Activated carbon injection","2009-07-01","PM control","Electrostatic precipitator, cold side, w/o flue gas conditioning","1966-03-01","","",null,"","",null,"","",null,"","",null,"","",null,"","",null,"","",null,"","",null,"","",null,"",""]
["6288_001",211,null,"coal",6288,"Healy","AK","1","001","Conventional Boiler","Wall firing - front firing",25,347,13.88,"subbituminous","subbituminous",null,null,0.34595441962872497,4.8018473444467027,null,null,null,null,0.34595441962872497,4.8018473444467027,"PM control","Fabric Filter, pulse","1980-01-01","","",null,"","",null,"","",null,"","",null,"","",null,"","",null,"","",null,"","",null,"","",null,"","",null,"",""]
["10671_1A",212,null,"coal",10671,"AES Shady Point,LLC","OK","Unit 1","1A","Fluidized bed firing","Fluidized bed firing",80,1110.4350359049981,13.880437948812476,"bituminous,  subbituminous","bituminous,  subbituminous",0.34833333333333338,4.8350192188363463,null,null,null,null,null,null,0.34833333333333338,4.8350192188363463,"PM control","Fabric Filter, pulse","1991-01-01","","",null,"","",null,"","",null,"","",null,"","",null,"","",null,"","",null,"","",null,"","",null,"","",null,"",""]
["10671_1b",213,null,"coal",10671,"AES Shady Point,LLC","OK","Unit 1","1b","Fluidized bed firing","Fluidized bed firing",80,1110.4350359049981,13.880437948812476,"bituminous,  subbituminous","bituminous,  subbituminous",0.34833333333333338,4.8350192188363463,null,null,null,null,null,null,0.34833333333333338,4.8350192188363463,"PM control","Fabric Filter, pulse","1991-01-01","","",null,"","",null,"","",null,"","",null,"","",null,"","",null,"","",null,"","",null,"","",null,"","",null,"",""]
["10671_2a",214,null,"coal",10671,"AES Shady Point,LLC","OK","Unit 2","2a","Fluidized bed firing","Fluidized bed firing",80,1110.4350359049981,13.880437948812476,"bituminous,  subbituminous","bituminous,  subbituminous",0.34833333333333338,4.8350192188363463,null,null,null,null,null,null,0.34833333333333338,4.8350192188363463,"PM control","Fabric Filter, pulse","1991-01-01","","",null,"","",null,"","",null,"","",null,"","",null,"","",null,"","",null,"","",null,"","",null,"","",null,"",""]
["10671_2b",215,null,"coal",10671,"AES Shady Point,LLC","OK","Unit 2","2b","Fluidized bed firing","Fluidized bed firing",80,1110.4350359049981,13.880437948812476,"bituminous,  subbituminous","bituminous,  subbituminous",0.34833333333333338,4.8350192188363463,null,null,null,null,null,null,0.34833333333333338,4.8350192188363463,"PM control","Fabric Filter, pulse","1991-01-01","","",null,"","",null,"","",null,"","",null,"","",null,"","",null,"","",null,"","",null,"","",null,"","",null,"",""]
["976_123",216,null,"coal",976,"Marion Generating Station","IL","123","123","Fluidized bed firing","Fluidized bed firing",120,1250,10.416666666666666,"bituminous","bituminous",null,null,0.47881682015825494,4.9876752099818225,null,null,null,null,0.47881682015825494,4.9876752099818225,"NOx control","Selective Noncatalytic Reduction",null,"PM control","Fabric Filter, unspecified",null,"","",null,"","",null,"","",null,"","",null,"","",null,"","",null,"","",null,"","",null,"","",null,"",""]
["10641_B2",217,null,"coal",10641,"Cambria Cogen","PA","002","B2","Fluidized bed firing","Fluidized bed firing",49,560,11.428571428571429,"coal refuse (culm or gob),  other--natural gas","coal refuse (culm or gob),  other--natural gas",null,null,0.44677576216328202,5.1060087104375089,null,null,null,null,0.44677576216328202,5.1060087104375089,"NOx control","Selective Noncatalytic Reduction",null,"PM control","Fabric Filter, unspecified",null,"","",null,"","",null,"","",null,"","",null,"","",null,"","",null,"","",null,"","",null,"","",null,"",""]
["2963_3313",218,null,"coal",2963,"Northeastern","OK","NE-3","3313","Conventional Boiler","Tangential firing",490,4775,9.7448979591836729,"subbituminous","subbituminous",0.52496153846153837,5.1156966248037667,null,null,null,null,null,null,0.52496153846153837,5.1156966248037667,"PM control","Electrostatic precipitator, cold side, w/o flue gas conditioning","1979-01-01","","",null,"","",null,"","",null,"","",null,"","",null,"","",null,"","",null,"","",null,"","",null,"","",null,"",""]
["2824_1",219,null,"coal",2824,"Stanton","ND","u1","1","Conventional Boiler","Wall firing - front firing",132,1800,13.636363636363637,"subbituminous","subbituminous",null,null,null,null,null,null,0.37624331130273792,5.1305906086736988,0.37624331130273792,5.1305906086736988,"PM control","Electrostatic precipitator, cold side, w/o flue gas conditioning","2000-01-01","PM control","Electrostatic precipitator, cold side, w/o flue gas conditioning","2000-01-01","","",null,"","",null,"","",null,"","",null,"","",null,"","",null,"","",null,"","",null,"","",null,"",""]
["4078_3",220,null,"coal",4078,"Weston","WI","W3","3","Conventional Boiler","Tangential firing",365.6,3423.48,9.364004376367614,"subbituminous","subbituminous",0.56486666666666663,5.2894139387308527,null,null,null,null,null,null,0.56486666666666663,5.2894139387308527,"PM control","Fabric Filter, pulse","2001-05-01","Other control","Activated carbon injection",null,"","",null,"","",null,"","",null,"","",null,"","",null,"","",null,"","",null,"","",null,"","",null,"",""]
["465_4",221,null,"coal",465,"Arapahoe","CO","Unit 4","4","Conventional Boiler","Vertical firing",118,1709.4,14.486440677966103,"subbituminous","subbituminous",0.38799999999999996,5.6207389830508472,null,null,0.3697593387425,5.3564967258171992,null,null,0.3697593387425,5.3564967258171992,"SO2 control","Dry FGD - Sorbent Injection","1993-06-01","PM control","Fabric Filter, reverse air","1985-04-01","","",null,"","",null,"","",null,"","",null,"","",null,"","",null,"","",null,"","",null,"","",null,"",""]
["6166_MB2",222,null,"coal",6166,"Rockport","IN","RP-2","MB2","Conventional Boiler","Wall firing - opposed firing",1320,12374,9.3742424242424249,"subbituminous","subbituminous",0.57263333333333322,5.3680036868686862,null,null,null,null,null,null,0.57263333333333322,5.3680036868686862,"Other control","Activated carbon injection","2009-09-01","PM control","Electrostatic precipitator, cold side, w/o flue gas conditioning","1989-12-01","","",null,"","",null,"","",null,"","",null,"","",null,"","",null,"","",null,"","",null,"","",null,"",""]
["469_2",223,null,"coal",469,"Cherokee","CO","Unit 2","2","Conventional Boiler","Vertical firing",114,1392,12.210526315789474,"bituminous","bituminous",0.52592592592592591,6.4218323586744637,null,null,0.44218137887333331,5.3992673630849124,null,null,0.44218137887333331,5.3992673630849124,"SO2 control","Dry FGD - Sorbent Injection","2002-12-01","PM control","Fabric Filter, reverse air","1985-05-01","","",null,"","",null,"","",null,"","",null,"","",null,"","",null,"","",null,"","",null,"","",null,"",""]
["3403_2",224,null,"coal",3403,"Gallatin","TN","2","2","Conventional Boiler","Tangential firing",300,2750,9.1666666666666661,"subbituminous","subbituminous",null,null,0.59524106261296883,5.4563764072855472,null,null,null,null,0.59524106261296883,5.4563764072855472,"PM control","Electrostatic precipitator, cold side, w/o flue gas conditioning","1978-09-01","","",null,"","",null,"","",null,"","",null,"","",null,"","",null,"","",null,"","",null,"","",null,"","",null,"",""]
["10143_AAB01",225,null,"coal",10143,"Colver Power Project","PA","AAB01","AAB01","Fluidized bed firing","Fluidized bed firing",131,1204,9.1908396946564892,"coal refuse (culm or gob)","coal refuse (culm or gob)",null,null,0.5969738757427816,5.4866911938496878,null,null,null,null,0.5969738757427816,5.4866911938496878,"NOx control","Selective Noncatalytic Reduction","1995-05-01","PM control","Fabric Filter, pulse","1995-05-01","","",null,"","",null,"","",null,"","",null,"","",null,"","",null,"","",null,"","",null,"","",null,"",""]
["1374_1374",226,null,"coal",1374,"Elmer Smith Station","KY","Unit001","1374","Conventional Boiler","Cyclone firing",153,1370,8.9542483660130721,"bituminous,  petroleum coke","bituminous,  petroleum coke",0.67907279778766672,5.6327140729879126,null,null,null,null,null,null,0.67907279778766672,5.6327140729879126,"NOx control","Selective Catalytic Reduction","2004-05-01","PM control","Electrostatic precipitator, cold side, w/o flue gas conditioning","1993-12-01","SO2 control","Wet FGD - Spray Type","1995-01-01","","",null,"","",null,"","",null,"","",null,"","",null,"","",null,"","",null,"","",null,"",""]
["1374_1374-2",227,null,"coal",1374,"Elmer Smith Station","KY","Unit001","1374-2","Conventional Boiler","Tangential firing",291.5,2317,7.9485420240137223,"bituminous,  petroleum coke","bituminous,  petroleum coke",0.67907279778766672,5.6327140729879126,null,null,null,null,null,null,0.67907279778766672,5.6327140729879126,"NOx control","Selective Catalytic Reduction","2004-05-01","PM control","Electrostatic precipitator, cold side, w/o flue gas conditioning","1993-12-01","SO2 control","Wet FGD - Spray Type","1995-01-01","","",null,"","",null,"","",null,"","",null,"","",null,"","",null,"","",null,"","",null,"",""]
["887_1",228,null,"coal",887,"Joppa Steam","IL","1","1","Conventional Boiler","Tangential firing",183.3,1800,9.8199672667757767,"subbituminous","subbituminous",0.58319999999999994,5.7270049099836324,null,null,null,null,null,null,0.58319999999999994,5.7270049099836324,"Other control","Activated carbon injection","2009-07-01","PM control","Electrostatic precipitator, cold side, w/ flue gas conditioning","1971-01-01","","",null,"","",null,"","",null,"","",null,"","",null,"","",null,"","",null,"","",null,"","",null,"",""]
["469_1",229,null,"coal",469,"Cherokee","CO","Unit 1","1","Conventional Boiler","Vertical firing",117,1392,11.897435897435898,"bituminous","bituminous",0.51596153846153847,6.1386193293885603,null,null,0.48371148998999997,5.7549264450092306,null,null,0.48371148998999997,5.7549264450092306,"SO2 control","Dry FGD - Sorbent Injection","1998-02-01","PM control","Fabric Filter, reverse air","1989-09-01","","",null,"","",null,"","",null,"","",null,"","",null,"","",null,"","",null,"","",null,"","",null,"",""]
["883_8",230,null,"coal",883,"Waukegan","IL","WK8CONFIG","8","Conventional Boiler","Tangential firing",383,3960.8919999999998,10.3417545691906,"subbituminous","subbituminous",0.56689999999999996,5.8627406652741509,null,null,null,null,null,null,0.56689999999999996,5.8627406652741509,"Other control","Activated carbon injection","2008-07-01","PM control","Electrostatic precipitator, cold side, w/o flue gas conditioning","1962-07-01","","",null,"","",null,"","",null,"","",null,"","",null,"","",null,"","",null,"","",null,"","",null,"",""]
["6073_1",231,null,"coal",6073,"Victor J. Daniel Jr","MS","Unit 1","1","Conventional Boiler","Tangential firing",537,5206.3059999999996,9.6951694599627558,"coal - subbituminous, coal - bituminous","subbituminous, bituminous",null,null,null,null,null,null,0.60799999999999998,5.8946630316573554,0.60799999999999998,5.8946630316573554,"PM control","Electrostatic precipitator, cold side, w/ flue gas conditioning","1998-01-01","PM control","Electrostatic precipitator, cold side, w/ flue gas conditioning","1998-01-01","","",null,"","",null,"","",null,"","",null,"","",null,"","",null,"","",null,"","",null,"","",null,"",""]
["2161_4",232,null,"coal",2161,"James River Power Station","MO","Unit_4_JRPS","4","Conventional Boiler","Wall firing - front firing",60,600,10,"subbituminous","subbituminous",0.59609999999999996,5.9609999999999994,null,null,null,null,null,null,0.59609999999999996,5.9609999999999994,"NOx control","Selective Noncatalytic Reduction","2007-05-01","PM control","Electrostatic precipitator, cold side, w/o flue gas conditioning","1976-08-01","","",null,"","",null,"","",null,"","",null,"","",null,"","",null,"","",null,"","",null,"","",null,"",""]
["2535_2",233,null,"coal",2535,"AES Cayuga, LLC","NY","Unit_2","2","Conventional Boiler","Tangential firing",168,1450,8.6309523809523814,"bituminous","bituminous",0.72806666666666664,6.2839087301587302,null,null,null,null,null,null,0.72806666666666664,6.2839087301587302,"PM control","Electrostatic precipitator, cold side, w/o flue gas conditioning",null,"SO2 control","Wet FGD - Spray Type","1995-01-01","","",null,"","",null,"","",null,"","",null,"","",null,"","",null,"","",null,"","",null,"","",null,"",""]
["1393_6",234,null,"coal",1393,"RS Nelson","LA","001","6","Conventional Boiler","Tangential firing",580,5761,9.9327586206896559,"bituminous","bituminous",null,null,0.64056246334668954,6.3625523298970323,null,null,null,null,0.64056246334668954,6.3625523298970323,"PM control","Electrostatic precipitator, unspecified","1982-05-01","","",null,"","",null,"","",null,"","",null,"","",null,"","",null,"","",null,"","",null,"","",null,"","",null,"",""]
["47_3",235,null,"coal",47,"Colbert","AL","3","3","Conventional Boiler","Wall firing - front firing",200,2121,10.605,"other--subbituminous/bituminous blend","other--subbituminous/bituminous blend",null,null,0.60787809417848948,6.4465471887628816,null,null,null,null,0.60787809417848948,6.4465471887628816,"PM control","Electrostatic precipitator, cold side, w/o flue gas conditioning","1990-05-01","","",null,"","",null,"","",null,"","",null,"","",null,"","",null,"","",null,"","",null,"","",null,"","",null,"",""]
["465_3",236,null,"coal",465,"Arapahoe","CO","Unit 3","3","Conventional Boiler","Vertical firing",48,754.8,15.725,"subbituminous","subbituminous",0.50068181818181823,7.8732215909090915,null,null,0.41341018914,6.5008752242265002,null,null,0.41341018914,6.5008752242265002,"SO2 control","Dry FGD - Sorbent Injection","2002-12-01","PM control","Fabric Filter, reverse air","1979-06-01","","",null,"","",null,"","",null,"","",null,"","",null,"","",null,"","",null,"","",null,"","",null,"",""]
["4072_8",237,null,"coal",4072,"Pulliam","WI","8","8","Conventional Boiler","Wall firing - rear firing",137.9,1510,10.949963741841914,"subbituminous","subbituminous",0.60706666666666675,6.6473579888808327,null,null,null,null,null,null,0.60706666666666675,6.6473579888808327,"Other control","Activated carbon injection",null,"PM control","Electrostatic precipitator, cold side, w/ flue gas conditioning","1964-12-01","","",null,"","",null,"","",null,"","",null,"","",null,"","",null,"","",null,"","",null,"","",null,"",""]
["2049_4",238,null,"coal",2049,"Jack Watson","MS","Unit 4","4","Conventional Boiler","Wall firing - front firing",250,2226.86,8.9074400000000011,"coal - bituminous","bituminous",null,null,null,null,null,null,0.77900000000000003,6.9388957600000012,0.77900000000000003,6.9388957600000012,"PM control","Electrostatic precipitator, cold side, w/o flue gas conditioning","1968-07-01","","",null,"","",null,"","",null,"","",null,"","",null,"","",null,"","",null,"","",null,"","",null,"","",null,"",""]
["8224_1",239,null,"coal",8224,"North Valmy","NV","1","1","Conventional Boiler","Wall firing - opposed firing",243.5,2560,10.513347022587268,"","subbituminous, bituminous",null,null,null,null,null,null,0.67,7.0439425051334705,0.67,7.0439425051334705,"PM control","Fabric Filter, reverse air","1981-12-01","","",null,"","",null,"","",null,"","",null,"","",null,"","",null,"","",null,"","",null,"","",null,"","",null,"",""]
["1943_002",240,null,"coal",1943,"Hoot Lake","MN","2","002","Conventional Boiler","Tangential firing",60.7,747.2,12.309719934102143,"subbituminous","subbituminous",0.57276666666666665,7.0505972542559032,null,null,null,null,null,null,0.57276666666666665,7.0505972542559032,"PM control","Electrostatic precipitator, cold side, w/o flue gas conditioning","1972-06-01","","",null,"","",null,"","",null,"","",null,"","",null,"","",null,"","",null,"","",null,"","",null,"","",null,"",""]
["6073_2",241,null,"coal",6073,"Victor J. Daniel Jr","MS","Unit 2","2","Conventional Boiler","Tangential firing",536,5166.7280000000001,9.6394179104477615,"coal - subbituminous, coal - bituminous","subbituminous, bituminous",null,null,null,null,null,null,0.74,7.1331692537313431,0.74,7.1331692537313431,"PM control","Electrostatic precipitator, cold side, w/ flue gas conditioning","1998-01-01","PM control","Electrostatic precipitator, cold side, w/ flue gas conditioning","1998-01-01","","",null,"","",null,"","",null,"","",null,"","",null,"","",null,"","",null,"","",null,"","",null,"",""]
["60_1",242,null,"coal",60,"Whelan Energy Center Unit 1 (WEC1)","NE","1","1","Conventional Boiler","Tangential firing",83.6,845.1,10.10885167464115,"subbituminous","subbituminous",null,null,0.70876122842824418,7.1647621309175742,null,null,null,null,0.70876122842824418,7.1647621309175742,"PM control","Electrostatic precipitator, cold side, w/o flue gas conditioning",null,"","",null,"","",null,"","",null,"","",null,"","",null,"","",null,"","",null,"","",null,"","",null,"","",null,"",""]
["54144_BRBR1",243,null,"coal",54144,"Piney Creek Project","PA","BRBRI","BRBR1","Fluidized bed firing","Fluidized bed firing",36,450,12.5,"bituminous,  synfuel","bituminous,  synfuel",null,null,0.57840271237535623,7.2300339046919531,null,null,0.66,8.25,0.57840271237535623,7.2300339046919531,"NOx control","Selective Noncatalytic Reduction","2002-08-01","PM control","Fabric Filter, pulse","1992-11-01","","",null,"","",null,"","",null,"","",null,"","",null,"","",null,"","",null,"","",null,"","",null,"",""]
["1241_2",244,null,"coal",1241,"La Cygne","KS","2","2","Conventional Boiler","Wall firing - opposed firing",685,7700,11.240875912408759,"subbituminous","subbituminous",null,null,0.68767539826049229,7.7300738198624677,null,null,null,null,0.68767539826049229,7.7300738198624677,"PM control","Electrostatic precipitator, cold side, w/o flue gas conditioning","1977-03-01","","",null,"","",null,"","",null,"","",null,"","",null,"","",null,"","",null,"","",null,"","",null,"","",null,"",""]
["3775_1",245,null,"coal",3775,"Clinch River","VA","CR-1","1","Conventional Boiler","Vertical firing",230,2100.9,9.1343478260869571,"bituminous","bituminous",0.86496666666666655,7.9009063913043471,null,null,null,null,null,null,0.86496666666666655,7.9009063913043471,"NOx control","Selective Noncatalytic Reduction","2009-01-01","PM control","Electrostatic precipitator, cold side, w/ flue gas conditioning","1975-02-01","","",null,"","",null,"","",null,"","",null,"","",null,"","",null,"","",null,"","",null,"","",null,"",""]
["6085_14",246,null,"coal",6085,"R.M. Schahfer","IN","R.M.0014","14","Conventional Boiler","Cyclone firing",468,4650,9.9358974358974361,"subbituminous","subbituminous",null,null,0.81867597602959463,8.1342805310632809,null,null,null,null,0.81867597602959463,8.1342805310632809,"NOx control","Selective Catalytic Reduction","2004-05-01","PM control","Electrostatic precipitator, cold side, w/o flue gas conditioning","1990-06-01","","",null,"","",null,"","",null,"","",null,"","",null,"","",null,"","",null,"","",null,"","",null,"",""]
["2049_5",247,null,"coal",2049,"Jack Watson","MS","Unit 5","5","Conventional Boiler","Wall firing - front firing",500,4752.8599999999997,9.5057200000000002,"coal - bituminous","bituminous",null,null,null,null,null,null,0.87860000000000005,8.3517255920000011,0.87860000000000005,8.3517255920000011,"PM control","Electrostatic precipitator, cold side, w/ flue gas conditioning","1973-05-01","","",null,"","",null,"","",null,"","",null,"","",null,"","",null,"","",null,"","",null,"","",null,"","",null,"",""]
["2480_3",248,null,"coal",2480,"Danskammer Generating Station","NY","3","3","Conventional Boiler","Tangential firing",144.9,1365,9.420289855072463,"bituminous","bituminous",null,null,0.96577255184564781,9.0978573724589999,null,null,null,null,0.96577255184564781,9.0978573724589999,"PM control","Electrostatic precipitator, cold side, w/o flue gas conditioning","1987-09-01","","",null,"","",null,"","",null,"","",null,"","",null,"","",null,"","",null,"","",null,"","",null,"","",null,"",""]
["10151_BLR1A",249,null,"coal",10151,"Grant Town Power Plant","WV","GEN1","BLR1A","Fluidized bed firing","Fluidized bed firing",47.5,675,14.210526315789474,"coal refuse (culm or gob)","coal refuse (culm or gob)",0.64453333333333329,9.1591578947368415,null,null,null,null,null,null,0.64453333333333329,9.1591578947368415,"NOx control","Selective Noncatalytic Reduction","2005-05-01","NOx control","Selective Noncatalytic Reduction","2005-05-01","SO2 control","Dry FGD - Circulating Dry Scrubber","1992-07-01","SO2 control","Dry FGD - Circulating Dry Scrubber","1992-07-01","PM control","Fabric Filter, pulse","1992-07-01","PM control","Fabric Filter, pulse","2005-05-01","","",null,"","",null,"","",null,"","",null,"","",null,"",""]
["10151_BLR1B",250,null,"coal",10151,"Grant Town Power Plant","WV","GEN1","BLR1B","Fluidized bed firing","Fluidized bed firing",47.5,675,14.210526315789474,"coal refuse (culm or gob)","coal refuse (culm or gob)",0.64453333333333329,9.1591578947368415,null,null,null,null,null,null,0.64453333333333329,9.1591578947368415,"NOx control","Selective Noncatalytic Reduction","2005-05-01","NOx control","Selective Noncatalytic Reduction","2005-05-01","SO2 control","Dry FGD - Circulating Dry Scrubber","1992-07-01","SO2 control","Dry FGD - Circulating Dry Scrubber","1992-07-01","PM control","Fabric Filter, pulse","1992-07-01","PM control","Fabric Filter, pulse","2005-05-01","","",null,"","",null,"","",null,"","",null,"","",null,"",""]
["1626_1",251,null,"coal",1626,"Salem Harbor","MA","Unit 1","1","Conventional Boiler","Wall firing - front firing",81.418999999999997,981,12.0487846817082,"bituminous","bituminous",null,null,0.76237860451432604,9.1857356517342854,null,null,null,null,0.76237860451432604,9.1857356517342854,"NOx control","Selective Noncatalytic Reduction","1993-08-01","PM control","Electrostatic precipitator, cold side, w/o flue gas conditioning","1984-07-01","","",null,"","",null,"","",null,"","",null,"","",null,"","",null,"","",null,"","",null,"","",null,"",""]
["6147_2",252,null,"coal",6147,"Monticello","TX","2","2","Conventional Boiler","Tangential firing",583,7000,12.006861063464838,"lignite","lignite",null,null,0.81611045859422093,9.798924888781384,null,null,null,null,0.81611045859422093,9.798924888781384,"NOx control","Selective Noncatalytic Reduction","2008-11-01","Other control","Activated carbon injection","2009-02-01","PM control","Fabric Filter, shake and deflate","1975-12-01","PM control","Electrostatic precipitator, cold side, w/ flue gas conditioning","1975-12-01","","",null,"","",null,"","",null,"","",null,"","",null,"","",null,"","",null,"",""]
["2480_4",253,null,"coal",2480,"Danskammer Generating Station","NY","4","4","Conventional Boiler","Tangential firing",242.3,2535,10.46223689640941,"bituminous","bituminous",null,null,0.94266462506591819,9.8623806213045917,null,null,null,null,0.94266462506591819,9.8623806213045917,"PM control","Electrostatic precipitator, cold side, w/o flue gas conditioning","1987-09-01","","",null,"","",null,"","",null,"","",null,"","",null,"","",null,"","",null,"","",null,"","",null,"","",null,"",""]
["663_B-2",254,null,"coal",663,"Deerhaven Generating Station","FL","001","B-2","Conventional Boiler","Wall firing - unspecified",235,2428,10.331914893617022,"","Bituminous",null,null,null,null,null,null,1.04,10.745191489361703,1.04,10.745191489361703,"PM control","Electrostatic precipitator, hot side, unspecified","1987-10-01","NOx control","Selective Catalytic Reduction","2009-05-01","SO2 control","Dry FGD - Unspecified","2009-05-01","","",null,"","",null,"","",null,"","",null,"","",null,"","",null,"","",null,"","",null,"",""]
["3935_1",255,null,"coal",3935,"John E. Amos","WV","AM-1","1","Conventional Boiler","Wall firing - opposed firing",816.3,7020,8.5997794928335178,"bituminous","bituminous",1.2656999999999996,10.884740904079381,null,null,null,null,null,null,1.2656999999999996,10.884740904079381,"NOx control","Selective Catalytic Reduction",null,"PM control","Electrostatic precipitator, cold side, w/o flue gas conditioning","1978-04-01","","",null,"","",null,"","",null,"","",null,"","",null,"","",null,"","",null,"","",null,"","",null,"",""]
["2848_H-5",256,null,"coal",2848,"O H Hutchings","OH","H-5","H-5","Conventional Boiler","Tangential firing",63,641,10.174603174603174,"coal - bituminous","bituminous",null,null,null,null,null,null,1.0933333333333333,11.124232804232802,1.0933333333333333,11.124232804232802,"PM control","Electrostatic precipitator, hot side, w/o flue gas conditioning","1973-01-01","","",null,"","",null,"","",null,"","",null,"","",null,"","",null,"","",null,"","",null,"","",null,"","",null,"",""]
[{"$f":"E258&\"_\"&I258","v":"2828_3"},257,null,"coal",2828,"Cardinal","OH","CD-U3","3","Conventional Boiler","Wall firing - opposed firing",650,5275,8.115384615384615,"bituminous","bituminous",1.4083913043478258,11.429637123745817,null,null,null,null,null,null,1.4083913043478258,11.429637123745817,"PM control","Electrostatic precipitator, hot side, w/o flue gas conditioning","1977-09-01","NOx control","Selective Catalytic Reduction","2003-01-01","","",null,"","",null,"","",null,"","",null,"","",null,"","",null,"","",null,"","",null,"","",null,"",""]
["988_4",258,null,"coal",988,"Tanners Creek","IN","TC-4","4","Conventional Boiler","Cyclone firing",579.70000000000005,4990,8.6079006382611691,"subbituminous,  bituminous","subbituminous,  bituminous",1.3718965517241377,11.809149203214503,null,null,null,null,null,null,1.3718965517241377,11.809149203214503,"PM control","Electrostatic precipitator, cold side, w/o flue gas conditioning","1977-11-01","","",null,"","",null,"","",null,"","",null,"","",null,"","",null,"","",null,"","",null,"","",null,"","",null,"",""]
["10603_031",259,null,"coal",10603,"Ebensburg Power Company","PA","EPC01","031","Fluidized bed firing","Fluidized bed firing",58,830,14.310344827586206,"coal refuse (culm or gob)","coal refuse (culm or gob)",null,null,0.83702771609454862,11.97815524755992,null,null,null,null,0.83702771609454862,11.97815524755992,"PM control","Fabric Filter, pulse","1990-11-01","","",null,"","",null,"","",null,"","",null,"","",null,"","",null,"","",null,"","",null,"","",null,"","",null,"",""]
["2848_H-1",260,null,"coal",2848,"O H Hutchings","OH","H-1","H-1","Conventional Boiler","Tangential firing",53,607,11.452830188679245,"coal - bituminous","bituminous",null,null,null,null,null,null,1.05,12.025471698113208,1.05,12.025471698113208,"PM control","Electrostatic precipitator, hot side, w/o flue gas conditioning","1973-01-01","","",null,"","",null,"","",null,"","",null,"","",null,"","",null,"","",null,"","",null,"","",null,"","",null,"",""]
["2848_H-3",261,null,"coal",2848,"O H Hutchings","OH","H-3","H-3","Conventional Boiler","Tangential firing",62.5,716,11.456,"coal - bituminous","bituminous",null,null,null,null,null,null,1.0766666666666669,12.334293333333335,1.0766666666666669,12.334293333333335,"PM control","Electrostatic precipitator, hot side, w/o flue gas conditioning","1973-01-01","","",null,"","",null,"","",null,"","",null,"","",null,"","",null,"","",null,"","",null,"","",null,"","",null,"",""]
["2848_H-2",262,null,"coal",2848,"O H Hutchings","OH","H-2","H-2","Conventional Boiler","Tangential firing",53,574,10.830188679245284,"coal - bituminous","bituminous",null,null,null,null,null,null,1.1633333333333333,12.599119496855346,1.1633333333333333,12.599119496855346,"PM control","Electrostatic precipitator, hot side, w/o flue gas conditioning","1973-01-01","","",null,"","",null,"","",null,"","",null,"","",null,"","",null,"","",null,"","",null,"","",null,"","",null,"",""]
["628_1",263,null,"coal",628,"Crystal River Power Plant","FL","CryR_Cfg_1","1","Conventional Boiler","Tangential firing",400,3837,9.5924999999999994,"bituminous","bituminous",null,null,1.3670117968378968,13.113060661167523,null,null,null,null,1.3670117968378968,13.113060661167523,"PM control","Electrostatic precipitator, cold side, w/o flue gas conditioning","1979-01-01","","",null,"","",null,"","",null,"","",null,"","",null,"","",null,"","",null,"","",null,"","",null,"","",null,"",""]
["2848_H-6",264,null,"coal",2848,"O H Hutchings","OH","H-6","H-6","Conventional Boiler","Tangential firing",60.5,646,10.677685950413224,"coal - bituminous","bituminous",null,null,null,null,null,null,1.2300000000000002,13.133553719008267,1.2300000000000002,13.133553719008267,"PM control","Electrostatic precipitator, hot side, w/o flue gas conditioning","1973-01-01","","",null,"","",null,"","",null,"","",null,"","",null,"","",null,"","",null,"","",null,"","",null,"","",null,"",""]
["2848_H-4",265,null,"coal",2848,"O H Hutchings","OH","H-4","H-4","Conventional Boiler","Tangential firing",64,696,10.875,"coal - bituminous","bituminous",null,null,null,null,null,null,1.23,13.376250000000001,1.23,13.376250000000001,"PM control","Electrostatic precipitator, hot side, w/o flue gas conditioning","1973-01-01","","",null,"","",null,"","",null,"","",null,"","",null,"","",null,"","",null,"","",null,"","",null,"","",null,"",""]
["2917_9",266,null,"coal",2917,"Hamilton","OH","Unit 9","9","Conventional Boiler","Tangential firing",50.6,729,14.407114624505928,"bituminous","bituminous",null,null,0.9356540745994294,13.48007550164,null,null,null,null,0.9356540745994294,13.48007550164,"PM control","Electrostatic precipitator, hot side, w/o flue gas conditioning","1974-06-01","SO2 control","Dry FGD - Spray Dryer","2001-06-01","PM control","Single cyclone","1997-01-01","PM control","Fabric Filter, pulse","1997-01-01","","",null,"","",null,"","",null,"","",null,"","",null,"","",null,"","",null,"",""]
["6648_4",267,null,"coal",6648,"Sandow No 4","TX","4","4","Conventional Boiler","Tangential firing",568,7810,13.75,"coal - lignite","Lignite",null,null,null,null,null,null,1.0080393928289542,13.860541651398119,1.0080393928289542,13.860541651398119,"NOx control","Selective Catalytic Reduction",null,"Other control","Activated carbon injection",null,"PM control","Electrostatic precipitator, cold side, w/o flue gas conditioning","1981-05-01","SO2 control","Wet FGD - Spray Type","1981-05-01","","",null,"","",null,"","",null,"","",null,"","",null,"","",null,"","",null,"",""]
["2716_1",268,null,"coal",2716,"W.H. Weatherspoon Plant","NC","Wea_Cfg_1","1","Conventional Boiler","Wall firing - front firing",53,472,8.9056603773584904,"bituminous","bituminous",null,null,1.6064603724188229,14.306590486446876,null,null,null,null,1.6064603724188229,14.306590486446876,"PM control","Electrostatic precipitator, cold side, w/o flue gas conditioning","1975-06-01","PM control","Electrostatic precipitator, cold side, w/o flue gas conditioning","1975-04-01","","",null,"","",null,"","",null,"","",null,"","",null,"","",null,"","",null,"","",null,"","",null,"",""]
["2716_2",269,null,"coal",2716,"W.H. Weatherspoon Plant","NC","Wea_Cfg_1","2","Conventional Boiler","Wall firing - front firing",53,472,8.9056603773584904,"bituminous","bituminous",null,null,1.6064603724188229,14.306590486446876,null,null,null,null,1.6064603724188229,14.306590486446876,"PM control","Electrostatic precipitator, cold side, w/o flue gas conditioning","1975-06-01","PM control","Electrostatic precipitator, cold side, w/o flue gas conditioning","1975-04-01","","",null,"","",null,"","",null,"","",null,"","",null,"","",null,"","",null,"","",null,"","",null,"",""]
["2837_1",270,null,"coal",2837,"Eastlake","OH","Unit 1","1","Conventional Boiler","Tangential firing",144,1205,8.3680555555555554,"subbituminous,  bituminous","subbituminous,  bituminous",null,null,1.8618807220013907,15.580321319525526,null,null,null,null,1.8618807220013907,15.580321319525526,"PM control","Electrostatic precipitator, cold side, w/o flue gas conditioning","1979-01-01","","",null,"","",null,"","",null,"","",null,"","",null,"","",null,"","",null,"","",null,"","",null,"","",null,"",""]
["2107_2",271,null,"coal",2107,"Sioux","MO","002","2","Conventional Boiler","Cyclone firing",524,4920,9.3893129770992374,"subbituminous,  bituminous","subbituminous,  bituminous",1.6986333333333334,15.949000000000002,null,null,null,null,null,null,1.6986333333333334,15.949000000000002,"NOx control","Selective Noncatalytic Reduction","2007-05-01","PM control","Electrostatic precipitator, cold side, w/ flue gas conditioning","1997-12-01","SO2 control","Wet FGD - Unspecified",null,"","",null,"","",null,"","",null,"","",null,"","",null,"","",null,"","",null,"","",null,"",""]
["3942_2",272,null,"coal",3942,"Albright Power Station","WV","Unit_2","2","Conventional Boiler","Wall firing - unspecified",81,643,7.9382716049382713,"bituminous","bituminous",null,null,2.0144003566422413,15.99085715211063,null,null,null,null,2.0144003566422413,15.99085715211063,"PM control","Electrostatic precipitator, cold side, w/o flue gas conditioning",null,"","",null,"","",null,"","",null,"","",null,"","",null,"","",null,"","",null,"","",null,"","",null,"","",null,"",""]
["642_1",273,null,"coal",642,"Scholz","FL","Unit 1","1","Conventional Boiler","Wall firing - front firing",49,581.09100000000001,11.859,"bituminous","bituminous",1.4127142857142856,16.753378714285713,null,null,null,null,1.3666666666666669,16.207300000000004,1.3666666666666669,16.207300000000004,"PM control","Electrostatic precipitator, cold side, w/o flue gas conditioning","1974-01-01","","",null,"","",null,"","",null,"","",null,"","",null,"","",null,"","",null,"","",null,"","",null,"","",null,"",""]
["1385_3",274,null,"coal",1385,"Dale Station","KY","03","3","Conventional Boiler","Wall firing - front firing",80,944,11.8,"bituminous","bituminous",1.4327666666666667,16.906646666666667,null,null,null,null,null,null,1.4327666666666667,16.906646666666667,"PM control","Electrostatic precipitator, cold side, w/ flue gas conditioning",null,"","",null,"","",null,"","",null,"","",null,"","",null,"","",null,"","",null,"","",null,"","",null,"","",null,"",""]
["2837_3",275,null,"coal",2837,"Eastlake","OH","Unit 3","3","Conventional Boiler","Tangential firing",144,1205,8.3680555555555554,"subbituminous,  bituminous","subbituminous,  bituminous",null,null,2.1208759289031192,17.747607599501794,null,null,null,null,2.1208759289031192,17.747607599501794,"NOx control","Selective Noncatalytic Reduction","1999-10-01","PM control","Electrostatic precipitator, cold side, w/o flue gas conditioning","1980-01-01","","",null,"","",null,"","",null,"","",null,"","",null,"","",null,"","",null,"","",null,"","",null,"",""]
["642_2",276,null,"coal",642,"Scholz","FL","Unit 2","2","Conventional Boiler","Wall firing - front firing",49,644.74199999999996,13.157999999999999,"bituminous","bituminous",1.4127142857142856,18.588494571428569,null,null,null,null,1.3666666666666669,17.982600000000001,1.3666666666666669,17.982600000000001,"PM control","Electrostatic precipitator, cold side, w/o flue gas conditioning","2007-12-01","","",null,"","",null,"","",null,"","",null,"","",null,"","",null,"","",null,"","",null,"","",null,"","",null,"",""]
["3947_1",277,null,"coal",3947,"Kammer","WV","K-1","1","Conventional Boiler","Cyclone firing",237.5,2156,9.0778947368421061,"bituminous","bituminous",2.0177333333333336,18.316770807017548,null,null,null,null,null,null,2.0177333333333336,18.316770807017548,"PM control","Electrostatic precipitator, cold side, w/o flue gas conditioning","1978-08-01","","",null,"","",null,"","",null,"","",null,"","",null,"","",null,"","",null,"","",null,"","",null,"","",null,"",""]
["3947_3",278,null,"coal",3947,"Kammer","WV","K-3","3","Conventional Boiler","Cyclone firing",237.5,2156,9.0778947368421061,"bituminous","bituminous",2.0177333333333336,18.316770807017548,null,null,null,null,null,null,2.0177333333333336,18.316770807017548,"PM control","Electrostatic precipitator, cold side, w/o flue gas conditioning","1978-04-01","","",null,"","",null,"","",null,"","",null,"","",null,"","",null,"","",null,"","",null,"","",null,"","",null,"",""]
["2364_2",279,null,"coal",2364,"Merrimack Station","NH","mk2","2","Conventional Boiler","Cyclone firing",337,3017,8.9525222551928785,"bituminous","bituminous",2.1748000000000003,19.469945400593474,null,null,null,null,null,null,2.1748000000000003,19.469945400593474,"NOx control","Selective Catalytic Reduction","1995-05-01","Other control","Activated carbon injection",null,"PM control","Electrostatic precipitator, cold side, w/o flue gas conditioning","1999-11-01","PM control","Electrostatic precipitator, cold side, w/o flue gas conditioning","1968-05-01","","",null,"","",null,"","",null,"","",null,"","",null,"","",null,"","",null,"",""]
["1218_2",280,null,"coal",1218,"Fair Station","IA","U2","2","Conventional Boiler","Wall firing - front firing",44,465,10.568181818181818,"bituminous","bituminous",2.0313666666666665,21.467852272727271,null,null,null,null,null,null,2.0313666666666665,21.467852272727271,"Other control","Other (specify): Flue gas conditioning for opacity control","2006-04-01","PM control","Electrostatic precipitator, cold side, w/ flue gas conditioning","1974-10-01","","",null,"","",null,"","",null,"","",null,"","",null,"","",null,"","",null,"","",null,"","",null,"",""]
["3942_1",281,null,"coal",3942,"Albright Power Station","WV","Unit_1","1","Conventional Boiler","Wall firing - unspecified",81,786,9.7037037037037042,"bituminous","bituminous",null,null,2.3667717521383196,22.966451817045918,null,null,null,null,2.3667717521383196,22.966451817045918,"PM control","Electrostatic precipitator, cold side, w/o flue gas conditioning",null,"","",null,"","",null,"","",null,"","",null,"","",null,"","",null,"","",null,"","",null,"","",null,"","",null,"",""]
["1217_1",282,null,"coal",1217,"Earl F Wisdom","IA","1","1","Conventional Boiler","Wall firing - front firing",40,477,11.925000000000001,"coal - bituminous","bituminous",null,null,null,null,null,null,2.1,25.042500000000004,2.1,25.042500000000004,"PM control","Multiple cyclone","1960-04-01","PM control","Electrostatic precipitator, cold side, w/o flue gas conditioning","1975-07-01","","",null,"","",null,"","",null,"","",null,"","",null,"","",null,"","",null,"","",null,"","",null,"",""]
["7253_3",283,null,"coal",7253,"Richard Gorsuch","OH","UNIT3","3","Conventional Boiler","Radiant",53.3,553,10.375234521575985,"bituminous","bituminous",null,null,2.6829163240311966,27.835886063588212,null,null,null,null,2.6829163240311966,27.835886063588212,"PM control","Electrostatic precipitator, hot side, w/o flue gas conditioning","1972-06-01","","",null,"","",null,"","",null,"","",null,"","",null,"","",null,"","",null,"","",null,"","",null,"","",null,"",""]
["3131_3",284,null,"coal",3131,"Shawville","PA","SHAW3-2","3","Conventional Boiler","Tangential firing",188,1794,9.5425531914893611,"bituminous","bituminous",3.1492999999999989,30.052362765957433,null,null,null,null,null,null,3.1492999999999989,30.052362765957433,"NOx control","Selective Noncatalytic Reduction","2005-05-01","PM control","Electrostatic precipitator, cold side, w/o flue gas conditioning","1959-06-01","PM control","Electrostatic precipitator, cold side, w/o flue gas conditioning","1977-03-01","","",null,"","",null,"","",null,"","",null,"","",null,"","",null,"","",null,"","",null,"",""]
["3131_4",285,null,"coal",3131,"Shawville","PA","SHAW4-2","4","Conventional Boiler","Tangential firing",188,1794,9.5425531914893611,"bituminous","bituminous",3.1492999999999989,30.052362765957433,null,null,null,null,null,null,3.1492999999999989,30.052362765957433,"NOx control","Selective Noncatalytic Reduction","2005-05-01","PM control","Electrostatic precipitator, cold side, w/o flue gas conditioning","1960-06-01","PM control","Electrostatic precipitator, cold side, w/o flue gas conditioning","1977-03-01","","",null,"","",null,"","",null,"","",null,"","",null,"","",null,"","",null,"","",null,"",""]
["2732_7",286,null,"coal",2732,"Riverbend","NC","7","7","Conventional Boiler","Tangential firing",99.5,1059,10.643216080402009,"bituminous","bituminous",null,null,2.8632800542083552,30.474508315644702,null,null,null,null,2.8632800542083552,30.474508315644702,"NOx control","Selective Noncatalytic Reduction","2007-02-01","PM control","Electrostatic precipitator, hot side, w/o flue gas conditioning","1995-01-01","","",null,"","",null,"","",null,"","",null,"","",null,"","",null,"","",null,"","",null,"","",null,"",""]
["3152_4",287,null,"coal",3152,"Sunbury Generation LP","PA","Boiler 4","4","Conventional Boiler","Wall firing - front firing",128,1360,10.625,"bituminous","bituminous",3.0538666666666665,32.447333333333333,null,null,null,null,null,null,3.0538666666666665,32.447333333333333,"Other control","Other (specify): SO3 injection","1980-06-01","PM control","Electrostatic precipitator, cold side, w/ flue gas conditioning","1970-06-01","","",null,"","",null,"","",null,"","",null,"","",null,"","",null,"","",null,"","",null,"","",null,"",""]
["1010_6",288,null,"coal",1010,"Wabash River","IN","6","6","Conventional Boiler","Tangential firing",342,3059.0605,8.9446213450292404,"bituminous","bituminous",null,null,3.6619959569548564,32.755167201989188,null,null,null,null,3.6619959569548564,32.755167201989188,"PM control","Electrostatic precipitator, cold side, w/o flue gas conditioning","1993-05-01","","",null,"","",null,"","",null,"","",null,"","",null,"","",null,"","",null,"","",null,"","",null,"","",null,"",""]
["1040_2",289,null,"coal",1040,"Whitewater Valley","IN","002","2","Conventional Boiler","Tangential firing",69,730,10.579710144927537,"bituminous","bituminous",null,null,3.5480306058049607,37.537135394748134,null,null,null,null,3.5480306058049607,37.537135394748134,"NOx control","Selective Noncatalytic Reduction","2003-09-01","PM control","Electrostatic precipitator, unspecified","1973-05-16","PM control","Fabric Filter, unspecified","2009-01-06","","",null,"","",null,"","",null,"","",null,"","",null,"","",null,"","",null,"","",null,"",""]
["1010_4",290,null,"coal",1010,"Wabash River","IN","4","4","Conventional Boiler","Wall firing - front firing",90,923.69500000000005,10.263277777777779,"bituminous","bituminous",null,null,3.6619959569548564,37.584081727326847,null,null,null,null,3.6619959569548564,37.584081727326847,"PM control","Electrostatic precipitator, cold side, w/o flue gas conditioning","1993-10-01","","",null,"","",null,"","",null,"","",null,"","",null,"","",null,"","",null,"","",null,"","",null,"","",null,"",""]
["2840_3",291,null,"coal",2840,"Conesville","OH","CV-3","3","Conventional Boiler","Wall firing - front firing",165,1862,11.284848484848485,"bituminous","bituminous",4.1252499999999994,46.552821212121209,null,null,null,null,null,null,4.1252499999999994,46.552821212121209,"PM control","Electrostatic precipitator, cold side, w/o flue gas conditioning","1977-01-01","","",null,"","",null,"","",null,"","",null,"","",null,"","",null,"","",null,"","",null,"","",null,"","",null,"",""]
["1218_1",292,null,"coal",1218,"Fair Station","IA","U1","1","Conventional Boiler","Wall firing - front firing",24.5,330,13.469387755102041,"coal - bituminous","bituminous",null,null,null,null,null,null,3.93,52.93469387755102,3.93,52.93469387755102,"PM control","Electrostatic precipitator, cold side, w/o flue gas conditioning","1974-11-01","","",null,"","",null,"","",null,"","",null,"","",null,"","",null,"","",null,"","",null,"","",null,"","",null,"",""]

{"sheet":"Variability","index":1,"n_rows":493,"n_cols":15,"rows_kept":493,"cut":false,"hidden":false,"merged":[]}
["Key f_b","Rank","Reason_for_Removal as top ranked unit for new source floor","Plant Name","facility_id","boiler_id","configuration_id","compound","Final_EF","Final_EF_Units","Final_Output_EF","Final_Output_EF_Units","From","Report_id"]
[{"$f":"E2&\"_\"&F2","v":"1008_2"},{"$f":"VLOOKUP(A2,Min_Tests!A:AB,2,FALSE)","v":1},"No run level data submitted.",{"$f":"VLOOKUP(A2,Min_Tests!A:AB,5,FALSE)","v":1008},1008,"2","2-2007","Sulfur Dioxide",3.2359930321660475E-3,"lb/MMBtu",3.1496998846416192E-2,"lb/MW","Part II","U2091409-BASE","No run level data submitted."]
["1008_2",{"$f":"VLOOKUP(A3,Min_Tests!A:AB,2,FALSE)","v":1},"No run level data submitted.",{"$f":"VLOOKUP(A3,Min_Tests!A:AB,5,FALSE)","v":1008},1008,"2","2-2007","Sulfur Dioxide",3.4507534704218685E-3,"lb/MMBtu",3.3587333778772849E-2,"lb/MW","Part II","U2091409-BAGOUT"]
["861_1",{"$f":"VLOOKUP(A4,Min_Tests!A:AB,2,FALSE)","v":2},"No run level data submitted.",{"$f":"VLOOKUP(A4,Min_Tests!A:AB,5,FALSE)","v":861},861,"1","001","Sulfur Dioxide",8.4666666666666692E-3,"lb/MMBtu",7.71877777777778E-2,"lb/MW","CEMS","","30 Days of CEMS Data"]
["2824_10",{"$f":"VLOOKUP(A5,Min_Tests!A:AB,2,FALSE)","v":3},"No run level data submitted.",{"$f":"VLOOKUP(A5,Min_Tests!A:AB,5,FALSE)","v":2824},2824,"10","u10","Sulfur Dioxide",7.6601195105882132E-3,"lb/MMBtu",8.1963278763293873E-2,"lb/MW","Part II","2006 RATA B","No run level data submitted."]
["2824_10",{"$f":"VLOOKUP(A6,Min_Tests!A:AB,2,FALSE)","v":3},"No run level data submitted.",{"$f":"VLOOKUP(A6,Min_Tests!A:AB,5,FALSE)","v":2824},2824,"10","u10","Sulfur Dioxide",3.9461221721212067E-2,"lb/MMBtu",0.42223507241696911,"lb/MW","Part II","RATA 2007"]
["2824_10",{"$f":"VLOOKUP(A7,Min_Tests!A:AB,2,FALSE)","v":3},"No run level data submitted.",{"$f":"VLOOKUP(A7,Min_Tests!A:AB,5,FALSE)","v":2824},2824,"10","u10","Sulfur Dioxide",4.6424966730837618E-2,"lb/MMBtu",0.49674714401996245,"lb/MW","Part II","RATA 2008"]
["2824_10",{"$f":"VLOOKUP(A8,Min_Tests!A:AB,2,FALSE)","v":3},"No run level data submitted.",{"$f":"VLOOKUP(A8,Min_Tests!A:AB,5,FALSE)","v":2824},2824,"10","u10","Sulfur Dioxide",4.877960288591892E-2,"lb/MMBtu",0.52194175087933237,"lb/MW","Part II","2006 RATA A"]
["2824_10",{"$f":"VLOOKUP(A9,Min_Tests!A:AB,2,FALSE)","v":3},"No run level data submitted.",{"$f":"VLOOKUP(A9,Min_Tests!A:AB,5,FALSE)","v":2824},2824,"10","u10","Sulfur Dioxide",6.7328149361446848E-2,"lb/MMBtu",0.72041119816748123,"lb/MW","Part II","RATA 2009"]
["2824_10",{"$f":"VLOOKUP(A10,Min_Tests!A:AB,2,FALSE)","v":3},"No run level data submitted.",{"$f":"VLOOKUP(A10,Min_Tests!A:AB,5,FALSE)","v":2824},2824,"10","u10","Sulfur Dioxide",0.17516455457027708,"lb/MMBtu",1.8742607339019646,"lb/MW","Part II","RATA 2005"]
["68029_BLR2",{"$f":"VLOOKUP(A11,Min_Tests!A:AB,2,FALSE)","v":4},"No run level data submitted.",{"$f":"VLOOKUP(A11,Min_Tests!A:AB,5,FALSE)","v":68029},68029,"BLR2","Unit_2","Sulfur Dioxide",8.7100000000000025E-3,"lb/MMBtu",8.4073701960784342E-2,"lb/MW","CEMS",""]
["56068_1",{"$f":"VLOOKUP(A12,Min_Tests!A:AB,2,FALSE)","v":5},"Unit began operations February 2010; only 1 test available. Insufficient data to determine rate that is achievable in practice with long-term continuous unit operations.",{"$f":"VLOOKUP(A12,Min_Tests!A:AB,5,FALSE)","v":56068},56068,"1","ERGS-B1","Sulfur Dioxide",8.9999999999999993E-3,"lb/MMBtu",8.6610044313146228E-2,"lb/MW","ETTS",""]
["68029_BLR1",{"$f":"VLOOKUP(A13,Min_Tests!A:AB,2,FALSE)","v":6},"No run level data submitted.",{"$f":"VLOOKUP(A13,Min_Tests!A:AB,5,FALSE)","v":68029},68029,"BLR1","Unit_1","Sulfur Dioxide",9.0000000000000045E-3,"lb/MMBtu",8.6872941176470625E-2,"lb/MW","CEMS",""]
["52071_5A",{"$f":"VLOOKUP(A14,Min_Tests!A:AB,2,FALSE)","v":7},null,{"$f":"VLOOKUP(A14,Min_Tests!A:AB,5,FALSE)","v":52071},52071,"5A","5A","Sulfur Dioxide",1.1155325630951158E-2,"lb/MMBtu",0.11694621522087985,"lb/MW","ERT",""]
["52071_5A",{"$f":"VLOOKUP(A15,Min_Tests!A:AB,2,FALSE)","v":7},null,{"$f":"VLOOKUP(A15,Min_Tests!A:AB,5,FALSE)","v":52071},52071,"5A","5A","Sulfur Dioxide",2.5666666666666667E-2,"lb/MMBtu",0.26907502508706688,"lb/MW","Part II","2-Source Emissions Survey, Stacks"]
["1893_3",{"$f":"VLOOKUP(A16,Min_Tests!A:AB,2,FALSE)","v":8},null,{"$f":"VLOOKUP(A16,Min_Tests!A:AB,5,FALSE)","v":1893},1893,"3","BEC3","Sulfur Dioxide",1.1666666666666669E-2,"lb/MMBtu",0.12929796211509115,"lb/MW","CEMS",""]
["6016_1",{"$f":"VLOOKUP(A17,Min_Tests!A:AB,2,FALSE)","v":9},null,{"$f":"VLOOKUP(A17,Min_Tests!A:AB,5,FALSE)","v":6016},6016,"1","001","Sulfur Dioxide",1.3299999999999999E-2,"lb/MMBtu",0.14962499999999998,"lb/MW","Part II","3"]
["6016_1",{"$f":"VLOOKUP(A18,Min_Tests!A:AB,2,FALSE)","v":9},null,{"$f":"VLOOKUP(A18,Min_Tests!A:AB,5,FALSE)","v":6016},6016,"1","001","Sulfur Dioxide",3.8199999999999998E-2,"lb/MMBtu",0.42974999999999997,"lb/MW","Part II","2"]
["641_5",{"$f":"VLOOKUP(A19,Min_Tests!A:AB,2,FALSE)","v":10},null,{"$f":"VLOOKUP(A19,Min_Tests!A:AB,5,FALSE)","v":641},641,"5","Unit 5","Sulfur Dioxide",2.5000000000000012E-2,"lb/MMBtu",0.24933841463414644,"lb/MW","CEMS",""]
["641_6",{"$f":"VLOOKUP(A20,Min_Tests!A:AB,2,FALSE)","v":11},null,{"$f":"VLOOKUP(A20,Min_Tests!A:AB,5,FALSE)","v":641},641,"6","Unit 6","Sulfur Dioxide",2.5000000000000012E-2,"lb/MMBtu",0.24948031250000011,"lb/MW","CEMS",""]
["641_7",{"$f":"VLOOKUP(A21,Min_Tests!A:AB,2,FALSE)","v":12},null,{"$f":"VLOOKUP(A21,Min_Tests!A:AB,5,FALSE)","v":641},641,"7","Unit 7","Sulfur Dioxide",2.5000000000000012E-2,"lb/MMBtu",0.26398960000000016,"lb/MW","CEMS",""]
["641_4",{"$f":"VLOOKUP(A22,Min_Tests!A:AB,2,FALSE)","v":13},null,{"$f":"VLOOKUP(A22,Min_Tests!A:AB,5,FALSE)","v":641},641,"4","Unit 4","Sulfur Dioxide",2.5000000000000012E-2,"lb/MMBtu",0.26489085365853671,"lb/MW","CEMS",""]
["10768_S-1715-3-13",{"$f":"VLOOKUP(A23,Min_Tests!A:AB,2,FALSE)","v":14},null,{"$f":"VLOOKUP(A23,Min_Tests!A:AB,5,FALSE)","v":10768},10768,"S-1715-3-13","Config 1","Sulfur Dioxide",2.3199999999999998E-2,"lb/MMBtu",0.26561422222222225,"lb/MW","Part II","2008 RATA Tests R016878"]
["10768_S-1715-3-13",{"$f":"VLOOKUP(A24,Min_Tests!A:AB,2,FALSE)","v":14},null,{"$f":"VLOOKUP(A24,Min_Tests!A:AB,5,FALSE)","v":10768},10768,"S-1715-3-13","Config 1","Sulfur Dioxide",2.3800000000000002E-2,"lb/MMBtu",0.27248355555555559,"lb/MW","Part II","2009 Compliance Tests R017667"]
["10768_S-1715-3-13",{"$f":"VLOOKUP(A25,Min_Tests!A:AB,2,FALSE)","v":14},null,{"$f":"VLOOKUP(A25,Min_Tests!A:AB,5,FALSE)","v":10768},10768,"S-1715-3-13","Config 1","Sulfur Dioxide",2.3866666666666678E-2,"lb/MMBtu",0.273246814814815,"lb/MW","CEMS",""]
["10768_S-1715-3-13",{"$f":"VLOOKUP(A26,Min_Tests!A:AB,2,FALSE)","v":14},null,{"$f":"VLOOKUP(A26,Min_Tests!A:AB,5,FALSE)","v":10768},10768,"S-1715-3-13","Config 1","Sulfur Dioxide",2.64E-2,"lb/MMBtu",0.30225066666666667,"lb/MW","Part II","2007 RATA Tests R16080"]
["10768_S-1715-3-13",{"$f":"VLOOKUP(A27,Min_Tests!A:AB,2,FALSE)","v":14},null,{"$f":"VLOOKUP(A27,Min_Tests!A:AB,5,FALSE)","v":10768},10768,"S-1715-3-13","Config 1","Sulfur Dioxide",2.6599999999999999E-2,"lb/MMBtu",0.30454044444444445,"lb/MW","Part II","2006 RATA Compliance R015280"]
["10768_S-1715-3-13",{"$f":"VLOOKUP(A28,Min_Tests!A:AB,2,FALSE)","v":14},null,{"$f":"VLOOKUP(A28,Min_Tests!A:AB,5,FALSE)","v":10768},10768,"S-1715-3-13","Config 1","Sulfur Dioxide",2.7699999999999999E-2,"lb/MMBtu",0.31713422222222226,"lb/MW","Part II","2005 RATA compliance R014534"]
["3845_BD21",{"$f":"VLOOKUP(A29,Min_Tests!A:AB,2,FALSE)","v":15},null,{"$f":"VLOOKUP(A29,Min_Tests!A:AB,5,FALSE)","v":3845},3845,"BD21","BW21CONFIG","Sulfur Dioxide",2.1299999999999999E-2,"lb/MMBtu",0.27350895522388058,"lb/MW","Part II","2007 Compliance Unit 1"]
["3845_BD21",{"$f":"VLOOKUP(A30,Min_Tests!A:AB,2,FALSE)","v":15},null,{"$f":"VLOOKUP(A30,Min_Tests!A:AB,5,FALSE)","v":3845},3845,"BD21","BW21CONFIG","Sulfur Dioxide",2.4333333333333332E-2,"lb/MMBtu",0.31245936981757877,"lb/MW","Part II","2005 Compliance Unit 1"]
["3845_BD21",{"$f":"VLOOKUP(A31,Min_Tests!A:AB,2,FALSE)","v":15},null,{"$f":"VLOOKUP(A31,Min_Tests!A:AB,5,FALSE)","v":3845},3845,"BD21","BW21CONFIG","Sulfur Dioxide",3.9E-2,"lb/MMBtu",0.50079104477611946,"lb/MW","Part II","2008 Compliance Unit 1"]
["3845_BD21",{"$f":"VLOOKUP(A32,Min_Tests!A:AB,2,FALSE)","v":15},null,{"$f":"VLOOKUP(A32,Min_Tests!A:AB,5,FALSE)","v":3845},3845,"BD21","BW21CONFIG","Sulfur Dioxide",4.0666666666666663E-2,"lb/MMBtu",0.52219237147595354,"lb/MW","Part II","2009 Compliance Unit 1"]
["3845_BD21",{"$f":"VLOOKUP(A33,Min_Tests!A:AB,2,FALSE)","v":15},null,{"$f":"VLOOKUP(A33,Min_Tests!A:AB,5,FALSE)","v":3845},3845,"BD21","BW21CONFIG","Sulfur Dioxide",4.2266666666666668E-2,"lb/MMBtu",0.54273764510779443,"lb/MW","Part II","2006 Compliance Unit 1"]
["3845_BD21",{"$f":"VLOOKUP(A34,Min_Tests!A:AB,2,FALSE)","v":15},null,{"$f":"VLOOKUP(A34,Min_Tests!A:AB,5,FALSE)","v":3845},3845,"BD21","BW21CONFIG","Sulfur Dioxide",5.7066666666666675E-2,"lb/MMBtu",0.73278142620232189,"lb/MW","CEMS",""]
["10769_C-E CONTRACT 24687",{"$f":"VLOOKUP(A35,Min_Tests!A:AB,2,FALSE)","v":16},null,{"$f":"VLOOKUP(A35,Min_Tests!A:AB,5,FALSE)","v":10769},10769,"C-E CONTRACT 24687","Config 1","Sulfur Dioxide",2.4500000000000001E-2,"lb/MMBtu",0.27761902777777775,"lb/MW","Part II","2008 R016879"]
["10769_C-E CONTRACT 24687",{"$f":"VLOOKUP(A36,Min_Tests!A:AB,2,FALSE)","v":16},null,{"$f":"VLOOKUP(A36,Min_Tests!A:AB,5,FALSE)","v":10769},10769,"C-E CONTRACT 24687","Config 1","Sulfur Dioxide",2.46E-2,"lb/MMBtu",0.27875216666666663,"lb/MW","Part II","2009 R017668"]
["10769_C-E CONTRACT 24687",{"$f":"VLOOKUP(A37,Min_Tests!A:AB,2,FALSE)","v":16},null,{"$f":"VLOOKUP(A37,Min_Tests!A:AB,5,FALSE)","v":10769},10769,"C-E CONTRACT 24687","Config 1","Sulfur Dioxide",2.5000000000000001E-2,"lb/MMBtu",0.28328472222222223,"lb/MW","Part II","2007 R016081"]
["10769_C-E CONTRACT 24687",{"$f":"VLOOKUP(A38,Min_Tests!A:AB,2,FALSE)","v":16},null,{"$f":"VLOOKUP(A38,Min_Tests!A:AB,5,FALSE)","v":10769},10769,"C-E CONTRACT 24687","Config 1","Sulfur Dioxide",2.5033333333333345E-2,"lb/MMBtu",0.2836624351851853,"lb/MW","CEMS",""]
["10769_C-E CONTRACT 24687",{"$f":"VLOOKUP(A39,Min_Tests!A:AB,2,FALSE)","v":16},null,{"$f":"VLOOKUP(A39,Min_Tests!A:AB,5,FALSE)","v":10769},10769,"C-E CONTRACT 24687","Config 1","Sulfur Dioxide",2.69E-2,"lb/MMBtu",0.3048143611111111,"lb/MW","Part II","2006 R015281"]
["10769_C-E CONTRACT 24687",{"$f":"VLOOKUP(A40,Min_Tests!A:AB,2,FALSE)","v":16},null,{"$f":"VLOOKUP(A40,Min_Tests!A:AB,5,FALSE)","v":10769},10769,"C-E CONTRACT 24687","Config 1","Sulfur Dioxide",2.7099999999999999E-2,"lb/MMBtu",0.30708063888888887,"lb/MW","Part II","2005 R014535"]
["6264_1",{"$f":"VLOOKUP(A41,Min_Tests!A:AB,2,FALSE)","v":17},null,{"$f":"VLOOKUP(A41,Min_Tests!A:AB,5,FALSE)","v":6264},6264,"1","Mt-1","Sulfur Dioxide",3.1400000000000011E-2,"lb/MMBtu",0.28450303030303042,"lb/MW","CEMS",""]
["708_2",{"$f":"VLOOKUP(A42,Min_Tests!A:AB,2,FALSE)","v":18},null,{"$f":"VLOOKUP(A42,Min_Tests!A:AB,5,FALSE)","v":708},708,"2","Unit 2","Sulfur Dioxide",2.9366666666666673E-2,"lb/MMBtu",0.29061049043478265,"lb/MW","CEMS",""]
["10771_10771-01",{"$f":"VLOOKUP(A43,Min_Tests!A:AB,2,FALSE)","v":19},null,{"$f":"VLOOKUP(A43,Min_Tests!A:AB,5,FALSE)","v":10771},10771,"10771-01","1 & 2","Sulfur Dioxide",2.3157477373991747E-2,"lb/MMBtu",0.29117122286416097,"lb/MW","ERT",""]
["10771_10771-02",{"$f":"VLOOKUP(A44,Min_Tests!A:AB,2,FALSE)","v":20},null,{"$f":"VLOOKUP(A44,Min_Tests!A:AB,5,FALSE)","v":10771},10771,"10771-02","1 & 2","Sulfur Dioxide",2.3157477373991747E-2,"lb/MMBtu",0.29117122286416097,"lb/MW","ERT",""]
["708_3",{"$f":"VLOOKUP(A45,Min_Tests!A:AB,2,FALSE)","v":21},null,{"$f":"VLOOKUP(A45,Min_Tests!A:AB,5,FALSE)","v":708},708,"3","Unit 3","Sulfur Dioxide",2.9366666666666673E-2,"lb/MMBtu",0.29146850782608702,"lb/MW","CEMS",""]
["708_1",{"$f":"VLOOKUP(A46,Min_Tests!A:AB,2,FALSE)","v":22},null,{"$f":"VLOOKUP(A46,Min_Tests!A:AB,5,FALSE)","v":708},708,"1","Unit 1","Sulfur Dioxide",2.9366666666666673E-2,"lb/MMBtu",0.29590159768115948,"lb/MW","CEMS",""]
["54081_3A",{"$f":"VLOOKUP(A47,Min_Tests!A:AB,2,FALSE)","v":23},null,{"$f":"VLOOKUP(A47,Min_Tests!A:AB,5,FALSE)","v":54081},54081,"3A","GEN3","Sulfur Dioxide",2.2700000000000008E-2,"lb/MMBtu",0.29660278745644608,"lb/MW","CEMS",""]
["54081_3A",{"$f":"VLOOKUP(A48,Min_Tests!A:AB,2,FALSE)","v":23},null,{"$f":"VLOOKUP(A48,Min_Tests!A:AB,5,FALSE)","v":54081},54081,"3A","GEN3","Sulfur Dioxide",2.5246942176443497E-2,"lb/MMBtu",0.32988164864690978,"lb/MW","Part II","2006 Emissions Testing at Boiler Id 3A and 3B"]
["54081_3A",{"$f":"VLOOKUP(A49,Min_Tests!A:AB,2,FALSE)","v":23},null,{"$f":"VLOOKUP(A49,Min_Tests!A:AB,5,FALSE)","v":54081},54081,"3A","GEN3","Sulfur Dioxide",6.5271065175803791E-2,"lb/MMBtu",0.85284492825527602,"lb/MW","ERT",""]
["54081_3B",{"$f":"VLOOKUP(A50,Min_Tests!A:AB,2,FALSE)","v":24},null,{"$f":"VLOOKUP(A50,Min_Tests!A:AB,5,FALSE)","v":54081},54081,"3B","GEN3","Sulfur Dioxide",2.2700000000000008E-2,"lb/MMBtu",0.29660278745644608,"lb/MW","CEMS",""]
["54081_3B",{"$f":"VLOOKUP(A51,Min_Tests!A:AB,2,FALSE)","v":24},null,{"$f":"VLOOKUP(A51,Min_Tests!A:AB,5,FALSE)","v":54081},54081,"3B","GEN3","Sulfur Dioxide",2.5246942176443497E-2,"lb/MMBtu",0.32988164864690978,"lb/MW","Part II","2006 Emissions Testing at Boiler Id 3A and 3B"]
["54081_3B",{"$f":"VLOOKUP(A52,Min_Tests!A:AB,2,FALSE)","v":24},null,{"$f":"VLOOKUP(A52,Min_Tests!A:AB,5,FALSE)","v":54081},54081,"3B","GEN3","Sulfur Dioxide",6.5271065175803791E-2,"lb/MMBtu",0.85284492825527602,"lb/MW","ERT",""]
["3179_1",{"$f":"VLOOKUP(A53,Min_Tests!A:AB,2,FALSE)","v":25},null,{"$f":"VLOOKUP(A53,Min_Tests!A:AB,5,FALSE)","v":3179},3179,"1","001","Sulfur Dioxide",3.1524908057705477E-2,"lb/MMBtu",0.30456267106596813,"lb/MW","ERT",""]
["708_4",{"$f":"VLOOKUP(A54,Min_Tests!A:AB,2,FALSE)","v":26},null,{"$f":"VLOOKUP(A54,Min_Tests!A:AB,5,FALSE)","v":708},708,"4","Unit 4","Sulfur Dioxide",2.9366666666666673E-2,"lb/MMBtu",0.30826698269230773,"lb/MW","CEMS",""]
["54081_2A",{"$f":"VLOOKUP(A55,Min_Tests!A:AB,2,FALSE)","v":27},null,{"$f":"VLOOKUP(A55,Min_Tests!A:AB,5,FALSE)","v":54081},54081,"2A","GEN2","Sulfur Dioxide",2.410000000000001E-2,"lb/MMBtu",0.31489547038327537,"lb/MW","CEMS",""]
["54081_2A",{"$f":"VLOOKUP(A56,Min_Tests!A:AB,2,FALSE)","v":27},null,{"$f":"VLOOKUP(A56,Min_Tests!A:AB,5,FALSE)","v":54081},54081,"2A","GEN2","Sulfur Dioxide",6.5675669546852847E-2,"lb/MMBtu",0.85813157073413993,"lb/MW","ERT",""]
["54081_2B",{"$f":"VLOOKUP(A57,Min_Tests!A:AB,2,FALSE)","v":28},null,{"$f":"VLOOKUP(A57,Min_Tests!A:AB,5,FALSE)","v":54081},54081,"2B","GEN2","Sulfur Dioxide",2.410000000000001E-2,"lb/MMBtu",0.31489547038327537,"lb/MW","CEMS",""]
["54081_2B",{"$f":"VLOOKUP(A58,Min_Tests!A:AB,2,FALSE)","v":28},null,{"$f":"VLOOKUP(A58,Min_Tests!A:AB,5,FALSE)","v":54081},54081,"2B","GEN2","Sulfur Dioxide",6.5675669546852847E-2,"lb/MMBtu",0.85813157073413993,"lb/MW","ERT",""]
["3845_BD22",{"$f":"VLOOKUP(A59,Min_Tests!A:AB,2,FALSE)","v":29},null,{"$f":"VLOOKUP(A59,Min_Tests!A:AB,5,FALSE)","v":3845},3845,"BD22","BW22CONFIG","Sulfur Dioxide",2.3333333333333334E-2,"lb/MMBtu",0.31864197530864202,"lb/MW","Part II","2006 Compliance Unit 2"]
["3845_BD22",{"$f":"VLOOKUP(A60,Min_Tests!A:AB,2,FALSE)","v":29},null,{"$f":"VLOOKUP(A60,Min_Tests!A:AB,5,FALSE)","v":3845},3845,"BD22","BW22CONFIG","Sulfur Dioxide",2.6666666666666668E-2,"lb/MMBtu",0.36416225749559089,"lb/MW","Part II","2008 Compliance Unit 2"]
["3845_BD22",{"$f":"VLOOKUP(A61,Min_Tests!A:AB,2,FALSE)","v":29},null,{"$f":"VLOOKUP(A61,Min_Tests!A:AB,5,FALSE)","v":3845},3845,"BD22","BW22CONFIG","Sulfur Dioxide",3.1599999999999996E-2,"lb/MMBtu",0.4315322751322751,"lb/MW","Part II","2007 Compliance Unit 2"]
["3845_BD22",{"$f":"VLOOKUP(A62,Min_Tests!A:AB,2,FALSE)","v":29},null,{"$f":"VLOOKUP(A62,Min_Tests!A:AB,5,FALSE)","v":3845},3845,"BD22","BW22CONFIG","Sulfur Dioxide",3.6000000000000004E-2,"lb/MMBtu",0.49161904761904768,"lb/MW","Part II","2009 Compliance Unit 2"]
["3845_BD22",{"$f":"VLOOKUP(A63,Min_Tests!A:AB,2,FALSE)","v":29},null,{"$f":"VLOOKUP(A63,Min_Tests!A:AB,5,FALSE)","v":3845},3845,"BD22","BW22CONFIG","Sulfur Dioxide",5.2499999999999984E-2,"lb/MMBtu",0.71694444444444427,"lb/MW","CEMS",""]
["3845_BD22",{"$f":"VLOOKUP(A64,Min_Tests!A:AB,2,FALSE)","v":29},null,{"$f":"VLOOKUP(A64,Min_Tests!A:AB,5,FALSE)","v":3845},3845,"BD22","BW22CONFIG","Sulfur Dioxide",8.1666666666666665E-2,"lb/MMBtu",1.115246913580247,"lb/MW","Part II","2005 Compliance Unit 2"]
["2324_3",{"$f":"VLOOKUP(A65,Min_Tests!A:AB,2,FALSE)","v":30},null,{"$f":"VLOOKUP(A65,Min_Tests!A:AB,5,FALSE)","v":2324},2324,"3","3","Sulfur Dioxide",2.9266666666666673E-2,"lb/MMBtu",0.32615195195195201,"lb/MW","Part II","U3_2009_BIOMASS"]
[{"$f":"E66&\"_\"&F66","v":"2324_3"},{"$f":"VLOOKUP(A66,Min_Tests!A:AB,2,FALSE)","v":30},null,{"$f":"VLOOKUP(A66,Min_Tests!A:AB,5,FALSE)","v":2324},2324,"3","3","Sulfur Dioxide",5.0133333333333335E-2,"lb/MMBtu",0.55869309309309312,"lb/MW","Part II","U3_2009_COMPLIANCE"]
["52071_5B",{"$f":"VLOOKUP(A67,Min_Tests!A:AB,2,FALSE)","v":31},null,{"$f":"VLOOKUP(A67,Min_Tests!A:AB,5,FALSE)","v":52071},52071,"5B","5B","Sulfur Dioxide",3.2000000000000001E-2,"lb/MMBtu",0.33547016114751194,"lb/MW","Part II","2-Source Emissions Survey, Stacks"]
["52071_5B",{"$f":"VLOOKUP(A68,Min_Tests!A:AB,2,FALSE)","v":31},null,{"$f":"VLOOKUP(A68,Min_Tests!A:AB,5,FALSE)","v":52071},52071,"5B","5B","Sulfur Dioxide",4.7983219701493718E-2,"lb/MMBtu",0.50302932642614273,"lb/MW","ERT",""]
["10384_1A",{"$f":"VLOOKUP(A69,Min_Tests!A:AB,2,FALSE)","v":32},null,{"$f":"VLOOKUP(A69,Min_Tests!A:AB,5,FALSE)","v":10384},10384,"1A","Gen 1","Sulfur Dioxide",2.7800000000000009E-2,"lb/MMBtu",0.34180327868852467,"lb/MW","CEMS",""]
["10384_1B",{"$f":"VLOOKUP(A70,Min_Tests!A:AB,2,FALSE)","v":33},null,{"$f":"VLOOKUP(A70,Min_Tests!A:AB,5,FALSE)","v":10384},10384,"1B","Gen 1","Sulfur Dioxide",2.7800000000000009E-2,"lb/MMBtu",0.34180327868852467,"lb/MW","CEMS",""]
["2706_1",{"$f":"VLOOKUP(A71,Min_Tests!A:AB,2,FALSE)","v":34},null,{"$f":"VLOOKUP(A71,Min_Tests!A:AB,5,FALSE)","v":2706},2706,"1","Ash_Cfg_1d","Sulfur Dioxide",3.7999999999999999E-2,"lb/MMBtu",0.35136231884057972,"lb/MW","Part II","Ash_Blr_1_Test_8ab"]
["2706_1",{"$f":"VLOOKUP(A72,Min_Tests!A:AB,2,FALSE)","v":34},null,{"$f":"VLOOKUP(A72,Min_Tests!A:AB,5,FALSE)","v":2706},2706,"1","Ash_Cfg_1d","Sulfur Dioxide",5.1660855288056161E-2,"lb/MMBtu",0.47767573440260624,"lb/MW","ERT",""]
["56224_BLR100",{"$f":"VLOOKUP(A73,Min_Tests!A:AB,2,FALSE)","v":35},null,{"$f":"VLOOKUP(A73,Min_Tests!A:AB,5,FALSE)","v":56224},56224,"BLR100","TSPower","Sulfur Dioxide",4.1666666666666664E-2,"lb/MMBtu",0.36363636363636359,"lb/MW","Part II","Optimal 07/2009"]
["56224_BLR100",{"$f":"VLOOKUP(A74,Min_Tests!A:AB,2,FALSE)","v":35},null,{"$f":"VLOOKUP(A74,Min_Tests!A:AB,5,FALSE)","v":56224},56224,"BLR100","TSPower","Sulfur Dioxide",4.2700000000000009E-2,"lb/MMBtu",0.37265454545454552,"lb/MW","CEMS",""]
["56224_BLR100",{"$f":"VLOOKUP(A75,Min_Tests!A:AB,2,FALSE)","v":35},null,{"$f":"VLOOKUP(A75,Min_Tests!A:AB,5,FALSE)","v":56224},56224,"BLR100","TSPower","Sulfur Dioxide",0.24411111111111106,"lb/MMBtu",2.1304242424242417,"lb/MW","Part II","TRC 04/2008"]
["1082_4",{"$f":"VLOOKUP(A76,Min_Tests!A:AB,2,FALSE)","v":36},null,{"$f":"VLOOKUP(A76,Min_Tests!A:AB,5,FALSE)","v":1082},1082,"4","4","Sulfur Dioxide",4.1000000000000002E-2,"lb/MMBtu",0.37020588235294116,"lb/MW","Part II","8/2007 SO2"]
["1082_4",{"$f":"VLOOKUP(A77,Min_Tests!A:AB,2,FALSE)","v":36},null,{"$f":"VLOOKUP(A77,Min_Tests!A:AB,5,FALSE)","v":1082},1082,"4","4","Sulfur Dioxide",6.0999999999999999E-2,"lb/MMBtu",0.55079411764705877,"lb/MW","Part II","5/2007 SO2"]
["1082_4",{"$f":"VLOOKUP(A78,Min_Tests!A:AB,2,FALSE)","v":36},null,{"$f":"VLOOKUP(A78,Min_Tests!A:AB,5,FALSE)","v":1082},1082,"4","4","Sulfur Dioxide",7.1999999999999995E-2,"lb/MMBtu",0.65011764705882347,"lb/MW","Part II","1/2008 SO2-3"]
["1082_4",{"$f":"VLOOKUP(A79,Min_Tests!A:AB,2,FALSE)","v":36},null,{"$f":"VLOOKUP(A79,Min_Tests!A:AB,5,FALSE)","v":1082},1082,"4","4","Sulfur Dioxide",7.1999999999999995E-2,"lb/MMBtu",0.65011764705882347,"lb/MW","Part II","1/2008 SO2-7"]
["1082_4",{"$f":"VLOOKUP(A80,Min_Tests!A:AB,2,FALSE)","v":36},null,{"$f":"VLOOKUP(A80,Min_Tests!A:AB,5,FALSE)","v":1082},1082,"4","4","Sulfur Dioxide",7.8E-2,"lb/MMBtu",0.70429411764705885,"lb/MW","CEMS",""]
["1082_4",{"$f":"VLOOKUP(A81,Min_Tests!A:AB,2,FALSE)","v":36},null,{"$f":"VLOOKUP(A81,Min_Tests!A:AB,5,FALSE)","v":1082},1082,"4","4","Sulfur Dioxide",8.2000000000000003E-2,"lb/MMBtu",0.74041176470588232,"lb/MW","Part II","1/2008 SO2-5"]
["1082_4",{"$f":"VLOOKUP(A82,Min_Tests!A:AB,2,FALSE)","v":36},null,{"$f":"VLOOKUP(A82,Min_Tests!A:AB,5,FALSE)","v":1082},1082,"4","4","Sulfur Dioxide",8.3000000000000004E-2,"lb/MMBtu",0.74944117647058828,"lb/MW","Part II","1/2008 SO2-2"]
["1082_4",{"$f":"VLOOKUP(A83,Min_Tests!A:AB,2,FALSE)","v":36},null,{"$f":"VLOOKUP(A83,Min_Tests!A:AB,5,FALSE)","v":1082},1082,"4","4","Sulfur Dioxide",8.7999999999999995E-2,"lb/MMBtu",0.7945882352941176,"lb/MW","Part II","1/2008 SO2-1"]
["1082_4",{"$f":"VLOOKUP(A84,Min_Tests!A:AB,2,FALSE)","v":36},null,{"$f":"VLOOKUP(A84,Min_Tests!A:AB,5,FALSE)","v":1082},1082,"4","4","Sulfur Dioxide",8.8999999999999996E-2,"lb/MMBtu",0.80361764705882344,"lb/MW","Part II","1/2008 SO2-8"]
["1082_4",{"$f":"VLOOKUP(A85,Min_Tests!A:AB,2,FALSE)","v":36},null,{"$f":"VLOOKUP(A85,Min_Tests!A:AB,5,FALSE)","v":1082},1082,"4","4","Sulfur Dioxide",9.0999999999999998E-2,"lb/MMBtu",0.82167647058823523,"lb/MW","Part II","1/2008 SO2-4"]
["1082_4",{"$f":"VLOOKUP(A86,Min_Tests!A:AB,2,FALSE)","v":36},null,{"$f":"VLOOKUP(A86,Min_Tests!A:AB,5,FALSE)","v":1082},1082,"4","4","Sulfur Dioxide",9.1999999999999998E-2,"lb/MMBtu",0.83070588235294118,"lb/MW","Part II","1/2008 SO2-6"]
["10774_1",{"$f":"VLOOKUP(A87,Min_Tests!A:AB,2,FALSE)","v":37},null,{"$f":"VLOOKUP(A87,Min_Tests!A:AB,5,FALSE)","v":10774},10774,"1","Unit 1 & 2","Sulfur Dioxide",2.8694882963040458E-2,"lb/MMBtu",0.37514339638445543,"lb/MW","ERT",""]
["10774_2",{"$f":"VLOOKUP(A88,Min_Tests!A:AB,2,FALSE)","v":38},null,{"$f":"VLOOKUP(A88,Min_Tests!A:AB,5,FALSE)","v":10774},10774,"2","Unit 1 & 2","Sulfur Dioxide",2.8694882963040458E-2,"lb/MMBtu",0.37514339638445543,"lb/MW","ERT",""]
["2451_Unit 3",{"$f":"VLOOKUP(A89,Min_Tests!A:AB,2,FALSE)","v":39},null,{"$f":"VLOOKUP(A89,Min_Tests!A:AB,5,FALSE)","v":2451},2451,"Unit 3","Unit 3","Sulfur Dioxide",3.55483870967742E-2,"lb/MMBtu",0.37626399430740043,"lb/MW","CEMS",""]
["3935_2",{"$f":"VLOOKUP(A90,Min_Tests!A:AB,2,FALSE)","v":40},null,{"$f":"VLOOKUP(A90,Min_Tests!A:AB,5,FALSE)","v":3935},3935,"2","AM-2","Sulfur Dioxide",4.5066666666666678E-2,"lb/MMBtu",0.38756339581036398,"lb/MW","CEMS",""]
["994_1",{"$f":"VLOOKUP(A91,Min_Tests!A:AB,2,FALSE)","v":41},null,{"$f":"VLOOKUP(A91,Min_Tests!A:AB,5,FALSE)","v":994},994,"1","1s","Sulfur Dioxide",4.7470588235294126E-2,"lb/MMBtu",0.40955017301038066,"lb/MW","CEMS",""]
["2712_2",{"$f":"VLOOKUP(A92,Min_Tests!A:AB,2,FALSE)","v":42},null,{"$f":"VLOOKUP(A92,Min_Tests!A:AB,5,FALSE)","v":2712},2712,"2","Rox_Cfg_2c","Sulfur Dioxide",4.1999999999999996E-2,"lb/MMBtu",0.41181507823613084,"lb/MW","Part II","Rox_Blr_2_Test_6g"]
["2706_2",{"$f":"VLOOKUP(A93,Min_Tests!A:AB,2,FALSE)","v":43},null,{"$f":"VLOOKUP(A93,Min_Tests!A:AB,5,FALSE)","v":2706},2706,"2","Ash_Cfg_2","Sulfur Dioxide",4.4413856309782805E-2,"lb/MMBtu",0.4140938955941515,"lb/MW","Part II","Ash_Blr_2_Test_7w"]
["2706_2",{"$f":"VLOOKUP(A94,Min_Tests!A:AB,2,FALSE)","v":43},null,{"$f":"VLOOKUP(A94,Min_Tests!A:AB,5,FALSE)","v":2706},2706,"2","Ash_Cfg_2","Sulfur Dioxide",4.6387589212262714E-2,"lb/MMBtu",0.4324960523613906,"lb/MW","ERT",""]
["6076_3",{"$f":"VLOOKUP(A95,Min_Tests!A:AB,2,FALSE)","v":44},null,{"$f":"VLOOKUP(A95,Min_Tests!A:AB,5,FALSE)","v":6076},6076,"3","Unit3","Sulfur Dioxide",4.5223791369981094E-2,"lb/MMBtu",0.42544071061474137,"lb/MW","ERT",""]
["8042_Unit 1",{"$f":"VLOOKUP(A96,Min_Tests!A:AB,2,FALSE)","v":45},null,{"$f":"VLOOKUP(A96,Min_Tests!A:AB,5,FALSE)","v":8042},8042,"Unit 1","1-2008","Sulfur Dioxide",4.8359830471376652E-2,"lb/MMBtu",0.44045047148833522,"lb/MW","ERT",""]
["4078_4",{"$f":"VLOOKUP(A97,Min_Tests!A:AB,2,FALSE)","v":46},null,{"$f":"VLOOKUP(A97,Min_Tests!A:AB,5,FALSE)","v":4078},4078,"4","W4","Sulfur Dioxide",5.000000000000001E-2,"lb/MMBtu",0.45022367275892083,"lb/MW","Part II","W4 CO 2008"]
["4078_4",{"$f":"VLOOKUP(A98,Min_Tests!A:AB,2,FALSE)","v":46},null,{"$f":"VLOOKUP(A98,Min_Tests!A:AB,5,FALSE)","v":4078},4078,"4","W4","Sulfur Dioxide",6.1233333333333348E-2,"lb/MMBtu",0.55137392457209178,"lb/MW","CEMS",""]
["10784_BLR1",{"$f":"VLOOKUP(A99,Min_Tests!A:AB,2,FALSE)","v":47},null,{"$f":"VLOOKUP(A99,Min_Tests!A:AB,5,FALSE)","v":10784},10784,"BLR1","Config1","Sulfur Dioxide",3.1566666666666666E-2,"lb/MMBtu",0.45556439393939391,"lb/MW","ETTS",""]
["10002_1",{"$f":"VLOOKUP(A100,Min_Tests!A:AB,2,FALSE)","v":48},null,{"$f":"VLOOKUP(A100,Min_Tests!A:AB,5,FALSE)","v":10002},10002,"1","Config 1","Sulfur Dioxide",5.1999999999999998E-2,"lb/MMBtu",0.46755555555555556,"lb/MW","Part II","R016634"]
["10002_1",{"$f":"VLOOKUP(A101,Min_Tests!A:AB,2,FALSE)","v":48},null,{"$f":"VLOOKUP(A101,Min_Tests!A:AB,5,FALSE)","v":10002},10002,"1","Config 1","Sulfur Dioxide",5.4566666666666666E-2,"lb/MMBtu",0.49063361823361823,"lb/MW","CEMS",""]
["10002_1",{"$f":"VLOOKUP(A102,Min_Tests!A:AB,2,FALSE)","v":48},null,{"$f":"VLOOKUP(A102,Min_Tests!A:AB,5,FALSE)","v":10002},10002,"1","Config 1","Sulfur Dioxide",5.6017880294883561E-2,"lb/MMBtu",0.5036821373522864,"lb/MW","Part II","06212005"]
["10002_1",{"$f":"VLOOKUP(A103,Min_Tests!A:AB,2,FALSE)","v":48},null,{"$f":"VLOOKUP(A103,Min_Tests!A:AB,5,FALSE)","v":10002},10002,"1","Config 1","Sulfur Dioxide",5.7000000000000002E-2,"lb/MMBtu",0.51251282051282054,"lb/MW","Part II","R017304"]
["10002_1",{"$f":"VLOOKUP(A104,Min_Tests!A:AB,2,FALSE)","v":48},null,{"$f":"VLOOKUP(A104,Min_Tests!A:AB,5,FALSE)","v":10002},10002,"1","Config 1","Sulfur Dioxide",7.0690311929176713E-2,"lb/MMBtu",0.63560861666234103,"lb/MW","Part II","2074.1011.rpt1"]
["10002_1",{"$f":"VLOOKUP(A105,Min_Tests!A:AB,2,FALSE)","v":48},null,{"$f":"VLOOKUP(A105,Min_Tests!A:AB,5,FALSE)","v":10002},10002,"1","Config 1","Sulfur Dioxide",7.566225275234828E-2,"lb/MMBtu",0.68031358885017423,"lb/MW","Part II","2074.1012.rpt1"]
["3935_3",{"$f":"VLOOKUP(A106,Min_Tests!A:AB,2,FALSE)","v":49},null,{"$f":"VLOOKUP(A106,Min_Tests!A:AB,5,FALSE)","v":3935},3935,"3","AM-3","Sulfur Dioxide",5.2142857142857157E-2,"lb/MMBtu",0.47875164835164852,"lb/MW","CEMS",""]
["113_1",{"$f":"VLOOKUP(A107,Min_Tests!A:AB,2,FALSE)","v":50},null,{"$f":"VLOOKUP(A107,Min_Tests!A:AB,5,FALSE)","v":113},113,"1","001","Sulfur Dioxide",0.05,"lb/MMBtu",0.48473282442748095,"lb/MW","Part II","17"]
["113_1",{"$f":"VLOOKUP(A108,Min_Tests!A:AB,2,FALSE)","v":50},null,{"$f":"VLOOKUP(A108,Min_Tests!A:AB,5,FALSE)","v":113},113,"1","001","Sulfur Dioxide",6.5000000000000002E-2,"lb/MMBtu",0.6301526717557252,"lb/MW","Part II","23"]
["113_1",{"$f":"VLOOKUP(A109,Min_Tests!A:AB,2,FALSE)","v":50},null,{"$f":"VLOOKUP(A109,Min_Tests!A:AB,5,FALSE)","v":113},113,"1","001","Sulfur Dioxide",8.3000000000000004E-2,"lb/MMBtu",0.80465648854961835,"lb/MW","Part II","30"]
["113_1",{"$f":"VLOOKUP(A110,Min_Tests!A:AB,2,FALSE)","v":50},null,{"$f":"VLOOKUP(A110,Min_Tests!A:AB,5,FALSE)","v":113},113,"1","001","Sulfur Dioxide",0.14000000000000001,"lb/MMBtu",1.3572519083969468,"lb/MW","Part II","9"]
["8223_2",{"$f":"VLOOKUP(A111,Min_Tests!A:AB,2,FALSE)","v":51},null,{"$f":"VLOOKUP(A111,Min_Tests!A:AB,5,FALSE)","v":8223},8223,"2","2","Sulfur Dioxide",5.6000000000000001E-2,"lb/MMBtu",0.49879069767441858,"lb/MW","Part II","U2 PERF 06JUN05"]
["8223_2",{"$f":"VLOOKUP(A112,Min_Tests!A:AB,2,FALSE)","v":51},null,{"$f":"VLOOKUP(A112,Min_Tests!A:AB,5,FALSE)","v":8223},8223,"2","2","Sulfur Dioxide",0.14199999999999999,"lb/MMBtu",1.2647906976744185,"lb/MW","Part II","U2 PERF 09MAY19"]
["8223_2",{"$f":"VLOOKUP(A113,Min_Tests!A:AB,2,FALSE)","v":51},null,{"$f":"VLOOKUP(A113,Min_Tests!A:AB,5,FALSE)","v":8223},8223,"2","2","Sulfur Dioxide",0.16,"lb/MMBtu",1.4251162790697673,"lb/MW","Part II","U2 PERF 07JUN5-8"]
["8223_2",{"$f":"VLOOKUP(A114,Min_Tests!A:AB,2,FALSE)","v":51},null,{"$f":"VLOOKUP(A114,Min_Tests!A:AB,5,FALSE)","v":8223},8223,"2","2","Sulfur Dioxide",0.30399999999999999,"lb/MMBtu",2.7077209302325582,"lb/MW","Part II","U2 PERF 08MAY13"]
["8223_2",{"$f":"VLOOKUP(A115,Min_Tests!A:AB,2,FALSE)","v":51},null,{"$f":"VLOOKUP(A115,Min_Tests!A:AB,5,FALSE)","v":8223},8223,"2","2","Sulfur Dioxide",0.47699999999999998,"lb/MMBtu",4.2486279069767443,"lb/MW","Part II","U2 PERF 05JUN05"]
["7213_1",{"$f":"VLOOKUP(A116,Min_Tests!A:AB,2,FALSE)","v":52},null,{"$f":"VLOOKUP(A116,Min_Tests!A:AB,5,FALSE)","v":7213},7213,"1","Unit 1","Sulfur Dioxide",4.3841657779696223E-2,"lb/MMBtu",0.5007714182121682,"lb/MW","ERT",""]
["7790_1-1",{"$f":"VLOOKUP(A117,Min_Tests!A:AB,2,FALSE)","v":53},null,{"$f":"VLOOKUP(A117,Min_Tests!A:AB,5,FALSE)","v":7790},7790,"1-1","1-1","Sulfur Dioxide",4.9429792976800398E-2,"lb/MMBtu",0.50135932876468969,"lb/MW","Part II","Stack SO2-Nox RATA 2006"]
["7790_1-1",{"$f":"VLOOKUP(A118,Min_Tests!A:AB,2,FALSE)","v":53},null,{"$f":"VLOOKUP(A118,Min_Tests!A:AB,5,FALSE)","v":7790},7790,"1-1","1-1","Sulfur Dioxide",6.6787932124816249E-2,"lb/MMBtu",0.67742045440885046,"lb/MW","Part II","Stack SO2-NOX 2005"]
["703_4",{"$f":"VLOOKUP(A119,Min_Tests!A:AB,2,FALSE)","v":54},null,{"$f":"VLOOKUP(A119,Min_Tests!A:AB,5,FALSE)","v":703},703,"4","Unit 4","Sulfur Dioxide",5.3933333333333347E-2,"lb/MMBtu",0.51376806623794224,"lb/MW","CEMS",""]
["3948_1",{"$f":"VLOOKUP(A120,Min_Tests!A:AB,2,FALSE)","v":55},null,{"$f":"VLOOKUP(A120,Min_Tests!A:AB,5,FALSE)","v":3948},3948,"1","MI-1","Sulfur Dioxide",6.1299999999999993E-2,"lb/MMBtu",0.52716648291069457,"lb/MW","CEMS",""]
["54081_4A",{"$f":"VLOOKUP(A121,Min_Tests!A:AB,2,FALSE)","v":56},null,{"$f":"VLOOKUP(A121,Min_Tests!A:AB,5,FALSE)","v":54081},54081,"4A","GEN4","Sulfur Dioxide",4.2300000000000011E-2,"lb/MMBtu",0.55270034843205584,"lb/MW","CEMS",""]
["54081_4A",{"$f":"VLOOKUP(A122,Min_Tests!A:AB,2,FALSE)","v":56},null,{"$f":"VLOOKUP(A122,Min_Tests!A:AB,5,FALSE)","v":54081},54081,"4A","GEN4","Sulfur Dioxide",8.9953476184438524E-2,"lb/MMBtu",1.1753502985771584,"lb/MW","Part II","2006 Emissions Testing  at Boilers 4A and 4B"]
["54081_4A",{"$f":"VLOOKUP(A123,Min_Tests!A:AB,2,FALSE)","v":56},null,{"$f":"VLOOKUP(A123,Min_Tests!A:AB,5,FALSE)","v":54081},54081,"4A","GEN4","Sulfur Dioxide",9.4105851603070501E-2,"lb/MMBtu",1.2296060749530118,"lb/MW","ERT",""]
["54081_4B",{"$f":"VLOOKUP(A124,Min_Tests!A:AB,2,FALSE)","v":57},null,{"$f":"VLOOKUP(A124,Min_Tests!A:AB,5,FALSE)","v":54081},54081,"4B","GEN4","Sulfur Dioxide",4.2300000000000011E-2,"lb/MMBtu",0.55270034843205584,"lb/MW","CEMS",""]
["54081_4B",{"$f":"VLOOKUP(A125,Min_Tests!A:AB,2,FALSE)","v":57},null,{"$f":"VLOOKUP(A125,Min_Tests!A:AB,5,FALSE)","v":54081},54081,"4B","GEN4","Sulfur Dioxide",8.9953476184438524E-2,"lb/MMBtu",1.1753502985771584,"lb/MW","Part II","2006 Emissions Testing  at Boilers 4A and 4B"]
["54081_4B",{"$f":"VLOOKUP(A126,Min_Tests!A:AB,2,FALSE)","v":57},null,{"$f":"VLOOKUP(A126,Min_Tests!A:AB,5,FALSE)","v":54081},54081,"4B","GEN4","Sulfur Dioxide",9.4105851603070501E-2,"lb/MMBtu",1.2296060749530118,"lb/MW","ERT",""]
["113_2",{"$f":"VLOOKUP(A127,Min_Tests!A:AB,2,FALSE)","v":58},null,{"$f":"VLOOKUP(A127,Min_Tests!A:AB,5,FALSE)","v":113},113,"2","002","Sulfur Dioxide",6.0999999999999999E-2,"lb/MMBtu",0.5875999999999999,"lb/MW","Part II","6"]
["113_2",{"$f":"VLOOKUP(A128,Min_Tests!A:AB,2,FALSE)","v":58},null,{"$f":"VLOOKUP(A128,Min_Tests!A:AB,5,FALSE)","v":113},113,"2","002","Sulfur Dioxide",8.6999999999999994E-2,"lb/MMBtu",0.83805245901639336,"lb/MW","Part II","3"]
["113_2",{"$f":"VLOOKUP(A129,Min_Tests!A:AB,2,FALSE)","v":58},null,{"$f":"VLOOKUP(A129,Min_Tests!A:AB,5,FALSE)","v":113},113,"2","002","Sulfur Dioxide",0.109,"lb/MMBtu",1.0499737704918033,"lb/MW","Part II","18"]
[{"$f":"E130&\"_\"&F130","v":"113_2"},{"$f":"VLOOKUP(A130,Min_Tests!A:AB,2,FALSE)","v":58},null,{"$f":"VLOOKUP(A130,Min_Tests!A:AB,5,FALSE)","v":113},113,"2","002","Sulfur Dioxide",0.114,"lb/MMBtu",1.0981377049180328,"lb/MW","Part II","10"]
["113_2",{"$f":"VLOOKUP(A131,Min_Tests!A:AB,2,FALSE)","v":58},null,{"$f":"VLOOKUP(A131,Min_Tests!A:AB,5,FALSE)","v":113},113,"2","002","Sulfur Dioxide",0.19900000000000001,"lb/MMBtu",1.9169245901639345,"lb/MW","Part II","24"]
["6018_2",{"$f":"VLOOKUP(A132,Min_Tests!A:AB,2,FALSE)","v":59},null,{"$f":"VLOOKUP(A132,Min_Tests!A:AB,5,FALSE)","v":6018},6018,"2","2","Sulfur Dioxide",6.0855869763289959E-2,"lb/MMBtu",0.59039274611385983,"lb/MW","ERT",""]
["8_10",{"$f":"VLOOKUP(A133,Min_Tests!A:AB,2,FALSE)","v":60},null,{"$f":"VLOOKUP(A133,Min_Tests!A:AB,5,FALSE)","v":8},8,"10","Unit 10","Sulfur Dioxide",6.5176224871357616E-2,"lb/MMBtu",0.59055036771730318,"lb/MW","Part II","UNITS 8-10 FGD PERFORMANCE TESTING Part 3"]
["6180_1",{"$f":"VLOOKUP(A134,Min_Tests!A:AB,2,FALSE)","v":61},null,{"$f":"VLOOKUP(A134,Min_Tests!A:AB,5,FALSE)","v":6180},6180,"1","OG1","Sulfur Dioxide",5.3999999999999999E-2,"lb/MMBtu",0.5928763769889841,"lb/MW","Part II","1-Compliance Test Report"]
["6180_1",{"$f":"VLOOKUP(A135,Min_Tests!A:AB,2,FALSE)","v":61},null,{"$f":"VLOOKUP(A135,Min_Tests!A:AB,5,FALSE)","v":6180},6180,"1","OG1","Sulfur Dioxide",5.6334649225308044E-2,"lb/MMBtu",0.61850893947492436,"lb/MW","ERT",""]
["8_8",{"$f":"VLOOKUP(A136,Min_Tests!A:AB,2,FALSE)","v":62},null,{"$f":"VLOOKUP(A136,Min_Tests!A:AB,5,FALSE)","v":8},8,"8","Unit 8","Sulfur Dioxide",6.5176224871357616E-2,"lb/MMBtu",0.59623108094025745,"lb/MW","Part II","UNITS 8-10 FGD PERFORMANCE TESTING Part 3"]
["2324_1",{"$f":"VLOOKUP(A137,Min_Tests!A:AB,2,FALSE)","v":63},null,{"$f":"VLOOKUP(A137,Min_Tests!A:AB,5,FALSE)","v":2324},2324,"1","1","Sulfur Dioxide",5.5E-2,"lb/MMBtu",0.60202702702702704,"lb/MW","Part II","U1_2009_COMPLIANCE"]
["2324_1",{"$f":"VLOOKUP(A138,Min_Tests!A:AB,2,FALSE)","v":63},null,{"$f":"VLOOKUP(A138,Min_Tests!A:AB,5,FALSE)","v":2324},2324,"1","1","Sulfur Dioxide",6.2147118518731483E-2,"lb/MMBtu",0.68025900000233108,"lb/MW","ERT",""]
["2451_Unit 4",{"$f":"VLOOKUP(A139,Min_Tests!A:AB,2,FALSE)","v":64},null,{"$f":"VLOOKUP(A139,Min_Tests!A:AB,5,FALSE)","v":2451},2451,"Unit 4","Unit 4","Sulfur Dioxide",5.8870967741935482E-2,"lb/MMBtu",0.61132738377609108,"lb/MW","CEMS",""]
["3944_2",{"$f":"VLOOKUP(A140,Min_Tests!A:AB,2,FALSE)","v":65},null,{"$f":"VLOOKUP(A140,Min_Tests!A:AB,5,FALSE)","v":3944},3944,"2","Boiler2","Sulfur Dioxide",7.0078157316521394E-2,"lb/MMBtu",0.61186737934454083,"lb/MW","ERT",""]
["8_9",{"$f":"VLOOKUP(A141,Min_Tests!A:AB,2,FALSE)","v":66},null,{"$f":"VLOOKUP(A141,Min_Tests!A:AB,5,FALSE)","v":8},8,"9","Unit 9","Sulfur Dioxide",6.5176224871357616E-2,"lb/MMBtu",0.61252431171902533,"lb/MW","Part II","UNITS 8-10 FGD PERFORMANCE TESTING Part 3"]
["2324_4",{"$f":"VLOOKUP(A142,Min_Tests!A:AB,2,FALSE)","v":67},null,{"$f":"VLOOKUP(A142,Min_Tests!A:AB,5,FALSE)","v":2324},2324,"4","4","Sulfur Dioxide",5.9100000000000007E-2,"lb/MMBtu",0.62170676156583637,"lb/MW","Part II","U4_2009_COMPLIANCE"]
["2324_4",{"$f":"VLOOKUP(A143,Min_Tests!A:AB,2,FALSE)","v":67},null,{"$f":"VLOOKUP(A143,Min_Tests!A:AB,5,FALSE)","v":2324},2324,"4","4","Sulfur Dioxide",6.0999999999999999E-2,"lb/MMBtu",0.64169395017793585,"lb/MW","Part II","U4_2008_COMPLIANCE"]
["2324_4",{"$f":"VLOOKUP(A144,Min_Tests!A:AB,2,FALSE)","v":67},null,{"$f":"VLOOKUP(A144,Min_Tests!A:AB,5,FALSE)","v":2324},2324,"4","4","Sulfur Dioxide",7.0999999999999994E-2,"lb/MMBtu",0.7468896797153024,"lb/MW","Part II","U4_2007_COMPLIANCE"]
["2324_4",{"$f":"VLOOKUP(A145,Min_Tests!A:AB,2,FALSE)","v":67},null,{"$f":"VLOOKUP(A145,Min_Tests!A:AB,5,FALSE)","v":2324},2324,"4","4","Sulfur Dioxide",7.1800000000000003E-2,"lb/MMBtu",0.75530533807829181,"lb/MW","Part II","U4_2005_COMPLIANCE ALT"]
["2324_4",{"$f":"VLOOKUP(A146,Min_Tests!A:AB,2,FALSE)","v":67},null,{"$f":"VLOOKUP(A146,Min_Tests!A:AB,5,FALSE)","v":2324},2324,"4","4","Sulfur Dioxide",8.8400000000000006E-2,"lb/MMBtu",0.9299302491103203,"lb/MW","Part II","U4_2005_COMPLIANCE"]
["2324_4",{"$f":"VLOOKUP(A147,Min_Tests!A:AB,2,FALSE)","v":67},null,{"$f":"VLOOKUP(A147,Min_Tests!A:AB,5,FALSE)","v":2324},2324,"4","4","Sulfur Dioxide",9.8000000000000004E-2,"lb/MMBtu",1.0309181494661921,"lb/MW","Part II","U4_2006_COMPLIANCE"]
["8224_2",{"$f":"VLOOKUP(A148,Min_Tests!A:AB,2,FALSE)","v":68},null,{"$f":"VLOOKUP(A148,Min_Tests!A:AB,5,FALSE)","v":8224},8224,"2","2","Sulfur Dioxide",5.8666666666666666E-2,"lb/MMBtu",0.62553170490994325,"lb/MW","Part II","U2_2009_COMPLIANCE"]
["8224_2",{"$f":"VLOOKUP(A149,Min_Tests!A:AB,2,FALSE)","v":68},null,{"$f":"VLOOKUP(A149,Min_Tests!A:AB,5,FALSE)","v":8224},8224,"2","2","Sulfur Dioxide",0.11,"lb/MMBtu",1.1728719467061437,"lb/MW","Part II","U2_2008_COMPLIANCE"]
["8224_2",{"$f":"VLOOKUP(A150,Min_Tests!A:AB,2,FALSE)","v":68},null,{"$f":"VLOOKUP(A150,Min_Tests!A:AB,5,FALSE)","v":8224},8224,"2","2","Sulfur Dioxide",0.15,"lb/MMBtu",1.5993708364174686,"lb/MW","Part II","U2_2007_COMPLIANCE"]
["8224_2",{"$f":"VLOOKUP(A151,Min_Tests!A:AB,2,FALSE)","v":68},null,{"$f":"VLOOKUP(A151,Min_Tests!A:AB,5,FALSE)","v":8224},8224,"2","2","Sulfur Dioxide",0.1522,"lb/MMBtu",1.6228282753515915,"lb/MW","Part II","U2_2006_COMPLIANCE"]
["1606_1",{"$f":"VLOOKUP(A152,Min_Tests!A:AB,2,FALSE)","v":69},null,{"$f":"VLOOKUP(A152,Min_Tests!A:AB,5,FALSE)","v":1606},1606,"1","1 current","Sulfur Dioxide",6.6000000000000003E-2,"lb/MMBtu",0.63019354838709685,"lb/MW","Part II","Turbosorp - initial compliance test"]
["703_3",{"$f":"VLOOKUP(A153,Min_Tests!A:AB,2,FALSE)","v":70},null,{"$f":"VLOOKUP(A153,Min_Tests!A:AB,5,FALSE)","v":703},703,"3","Unit 3","Sulfur Dioxide",7.1933333333333335E-2,"lb/MMBtu",0.63103559071096826,"lb/MW","CEMS",""]
["628_5",{"$f":"VLOOKUP(A154,Min_Tests!A:AB,2,FALSE)","v":71},null,{"$f":"VLOOKUP(A154,Min_Tests!A:AB,5,FALSE)","v":628},628,"5","CryR_Cfg_5c","Sulfur Dioxide",6.5224192332729192E-2,"lb/MMBtu",0.63123752240658249,"lb/MW","ERT",""]
["8223_1",{"$f":"VLOOKUP(A155,Min_Tests!A:AB,2,FALSE)","v":72},null,{"$f":"VLOOKUP(A155,Min_Tests!A:AB,5,FALSE)","v":8223},8223,"1","1","Sulfur Dioxide",7.0999999999999994E-2,"lb/MMBtu",0.63683840749414522,"lb/MW","Part II","U1 PERF 06MAY22"]
["8223_1",{"$f":"VLOOKUP(A156,Min_Tests!A:AB,2,FALSE)","v":72},null,{"$f":"VLOOKUP(A156,Min_Tests!A:AB,5,FALSE)","v":8223},8223,"1","1","Sulfur Dioxide",0.14199999999999999,"lb/MMBtu",1.2736768149882904,"lb/MW","Part II","U1 PERF 07JUN06"]
["8223_1",{"$f":"VLOOKUP(A157,Min_Tests!A:AB,2,FALSE)","v":72},null,{"$f":"VLOOKUP(A157,Min_Tests!A:AB,5,FALSE)","v":8223},8223,"1","1","Sulfur Dioxide",0.17199999999999999,"lb/MMBtu",1.5427634660421545,"lb/MW","Part II","U1 PERF 08JUN09"]
["8223_1",{"$f":"VLOOKUP(A158,Min_Tests!A:AB,2,FALSE)","v":72},null,{"$f":"VLOOKUP(A158,Min_Tests!A:AB,5,FALSE)","v":8223},8223,"1","1","Sulfur Dioxide",0.20899999999999999,"lb/MMBtu",1.8746370023419203,"lb/MW","Part II","U1 PERF 09MAY20"]
["8223_1",{"$f":"VLOOKUP(A159,Min_Tests!A:AB,2,FALSE)","v":72},null,{"$f":"VLOOKUP(A159,Min_Tests!A:AB,5,FALSE)","v":8223},8223,"1","1","Sulfur Dioxide",0.36099999999999999,"lb/MMBtu",3.2380093676814989,"lb/MW","Part II","U1 PERF 05MAY01"]
["3948_2",{"$f":"VLOOKUP(A160,Min_Tests!A:AB,2,FALSE)","v":73},null,{"$f":"VLOOKUP(A160,Min_Tests!A:AB,5,FALSE)","v":3948},3948,"2","MI-2","Sulfur Dioxide",7.506666666666667E-2,"lb/MMBtu",0.64555678059536947,"lb/MW","CEMS",""]
["8223_4",{"$f":"VLOOKUP(A161,Min_Tests!A:AB,2,FALSE)","v":74},null,{"$f":"VLOOKUP(A161,Min_Tests!A:AB,5,FALSE)","v":8223},8223,"4","4","Sulfur Dioxide",6.9233333333333327E-2,"lb/MMBtu",0.64617777777777774,"lb/MW","CEMS",""]
["56319_0001",{"$f":"VLOOKUP(A162,Min_Tests!A:AB,2,FALSE)","v":75},null,{"$f":"VLOOKUP(A162,Min_Tests!A:AB,5,FALSE)","v":56319},56319,"0001","WYG2Cfg","Sulfur Dioxide",4.8000000000000022E-2,"lb/MMBtu",0.65000000000000024,"lb/MW","CEMS",""]
["2451_Unit 1",{"$f":"VLOOKUP(A163,Min_Tests!A:AB,2,FALSE)","v":76},null,{"$f":"VLOOKUP(A163,Min_Tests!A:AB,5,FALSE)","v":2451},2451,"Unit 1","Unit 1","Sulfur Dioxide",6.5473684210526309E-2,"lb/MMBtu",0.65597553342816495,"lb/MW","CEMS",""]
["54081_1A",{"$f":"VLOOKUP(A164,Min_Tests!A:AB,2,FALSE)","v":77},null,{"$f":"VLOOKUP(A164,Min_Tests!A:AB,5,FALSE)","v":54081},54081,"1A","GEN1","Sulfur Dioxide",5.1563358287846174E-2,"lb/MMBtu",0.67373725985861721,"lb/MW","ERT",""]
["54081_1B",{"$f":"VLOOKUP(A165,Min_Tests!A:AB,2,FALSE)","v":78},null,{"$f":"VLOOKUP(A165,Min_Tests!A:AB,5,FALSE)","v":54081},54081,"1B","GEN1","Sulfur Dioxide",5.1563358287846174E-2,"lb/MMBtu",0.67373725985861721,"lb/MW","ERT",""]
["8223_3",{"$f":"VLOOKUP(A166,Min_Tests!A:AB,2,FALSE)","v":79},null,{"$f":"VLOOKUP(A166,Min_Tests!A:AB,5,FALSE)","v":8223},8223,"3","3","Sulfur Dioxide",7.4366666666666664E-2,"lb/MMBtu",0.69408888888888887,"lb/MW","CEMS",""]
["8223_3",{"$f":"VLOOKUP(A167,Min_Tests!A:AB,2,FALSE)","v":79},null,{"$f":"VLOOKUP(A167,Min_Tests!A:AB,5,FALSE)","v":8223},8223,"3","3","Sulfur Dioxide",9.9000000000000005E-2,"lb/MMBtu",0.92400000000000015,"lb/MW","Part II","U3 INITIAL PERF TESTS (VOC, SO2, NOX, CO)"]
["10384_2A",{"$f":"VLOOKUP(A168,Min_Tests!A:AB,2,FALSE)","v":80},null,{"$f":"VLOOKUP(A168,Min_Tests!A:AB,5,FALSE)","v":10384},10384,"2A","Gen 2","Sulfur Dioxide",5.6800000000000003E-2,"lb/MMBtu",0.69836065573770501,"lb/MW","CEMS",""]
["10384_2B",{"$f":"VLOOKUP(A169,Min_Tests!A:AB,2,FALSE)","v":81},null,{"$f":"VLOOKUP(A169,Min_Tests!A:AB,5,FALSE)","v":10384},10384,"2B","Gen 2","Sulfur Dioxide",5.6800000000000003E-2,"lb/MMBtu",0.69836065573770501,"lb/MW","CEMS",""]
["130_3",{"$f":"VLOOKUP(A170,Min_Tests!A:AB,2,FALSE)","v":82},null,{"$f":"VLOOKUP(A170,Min_Tests!A:AB,5,FALSE)","v":130},130,"3","C3","Sulfur Dioxide",7.4300000000000019E-2,"lb/MMBtu",0.72017504000000021,"lb/MW","CEMS",""]
["6761_101",{"$f":"VLOOKUP(A171,Min_Tests!A:AB,2,FALSE)","v":83},null,{"$f":"VLOOKUP(A171,Min_Tests!A:AB,5,FALSE)","v":6761},6761,"101","Rawhide101","Sulfur Dioxide",7.8533333333333344E-2,"lb/MMBtu",0.72096174863387985,"lb/MW","CEMS",""]
["1012_3",{"$f":"VLOOKUP(A172,Min_Tests!A:AB,2,FALSE)","v":84},null,{"$f":"VLOOKUP(A172,Min_Tests!A:AB,5,FALSE)","v":1012},1012,"3","Config3","Sulfur Dioxide",8.0045454545454545E-2,"lb/MMBtu",0.74997291732657589,"lb/MW","CEMS",""]
["2727_Unit 1",{"$f":"VLOOKUP(A173,Min_Tests!A:AB,2,FALSE)","v":85},null,{"$f":"VLOOKUP(A173,Min_Tests!A:AB,5,FALSE)","v":2727},2727,"Unit 1","U12007","Sulfur Dioxide",8.2923525221707775E-2,"lb/MMBtu",0.75837709991512847,"lb/MW","ERT",""]
["2727_Unit 2",{"$f":"VLOOKUP(A174,Min_Tests!A:AB,2,FALSE)","v":86},null,{"$f":"VLOOKUP(A174,Min_Tests!A:AB,5,FALSE)","v":2727},2727,"Unit 2","U22007","Sulfur Dioxide",8.2923525221707775E-2,"lb/MMBtu",0.75941364398039979,"lb/MW","ERT",""]
["2718_ES-3",{"$f":"VLOOKUP(A175,Min_Tests!A:AB,2,FALSE)","v":87},null,{"$f":"VLOOKUP(A175,Min_Tests!A:AB,5,FALSE)","v":2718},2718,"ES-3","3-2009","Sulfur Dioxide",9.7061529410868777E-2,"lb/MMBtu",0.768217007202187,"lb/MW","ERT",""]
["2718_ES-4",{"$f":"VLOOKUP(A176,Min_Tests!A:AB,2,FALSE)","v":88},null,{"$f":"VLOOKUP(A176,Min_Tests!A:AB,5,FALSE)","v":2718},2718,"ES-4","4-2009","Sulfur Dioxide",9.7061529410868777E-2,"lb/MMBtu",0.77701459804193629,"lb/MW","ERT",""]
["10043_B01",{"$f":"VLOOKUP(A177,Min_Tests!A:AB,2,FALSE)","v":89},null,{"$f":"VLOOKUP(A177,Min_Tests!A:AB,5,FALSE)","v":10043},10043,"B01","Unit1","Sulfur Dioxide",9.0995908666725925E-2,"lb/MMBtu",0.79663774405789023,"lb/MW","ERT",""]
["10043_B01",{"$f":"VLOOKUP(A178,Min_Tests!A:AB,2,FALSE)","v":89},null,{"$f":"VLOOKUP(A178,Min_Tests!A:AB,5,FALSE)","v":10043},10043,"B01","Unit1","Sulfur Dioxide",0.10625,"lb/MMBtu",0.93018204385601988,"lb/MW","Part II","2005 Annual Stack Test-3"]
["2727_Unit 4",{"$f":"VLOOKUP(A179,Min_Tests!A:AB,2,FALSE)","v":90},null,{"$f":"VLOOKUP(A179,Min_Tests!A:AB,5,FALSE)","v":2727},2727,"Unit 4","U4","Sulfur Dioxide",9.4491230902303269E-2,"lb/MMBtu",0.81394746299244047,"lb/MW","ERT",""]
["645_1",{"$f":"VLOOKUP(A180,Min_Tests!A:AB,2,FALSE)","v":91},null,{"$f":"VLOOKUP(A180,Min_Tests!A:AB,5,FALSE)","v":645},645,"1","BB01_pre-SCR","Sulfur Dioxide",8.2901143425934784E-2,"lb/MMBtu",0.81627296587926512,"lb/MW","Part II","BB#1_FY2008"]
["645_1",{"$f":"VLOOKUP(A181,Min_Tests!A:AB,2,FALSE)","v":91},null,{"$f":"VLOOKUP(A181,Min_Tests!A:AB,5,FALSE)","v":645},645,"1","BB01_pre-SCR","Sulfur Dioxide",0.12427134433624651,"lb/MMBtu",1.2236180904522613,"lb/MW","Part II","BB#1_FY2009"]
["645_1",{"$f":"VLOOKUP(A182,Min_Tests!A:AB,2,FALSE)","v":91},null,{"$f":"VLOOKUP(A182,Min_Tests!A:AB,5,FALSE)","v":645},645,"1","BB01_pre-SCR","Sulfur Dioxide",0.18328508174386923,"lb/MMBtu",1.8046875000000002,"lb/MW","Part II","BB#1_FY2007"]
["1012_2",{"$f":"VLOOKUP(A183,Min_Tests!A:AB,2,FALSE)","v":92},null,{"$f":"VLOOKUP(A183,Min_Tests!A:AB,5,FALSE)","v":1012},1012,"2","Config2","Sulfur Dioxide",8.0045454545454545E-2,"lb/MMBtu",0.82526863636363634,"lb/MW","CEMS",""]
["2451_Unit 2",{"$f":"VLOOKUP(A184,Min_Tests!A:AB,2,FALSE)","v":93},null,{"$f":"VLOOKUP(A184,Min_Tests!A:AB,5,FALSE)","v":2451},2451,"Unit 2","Unit 2","Sulfur Dioxide",8.328571428571431E-2,"lb/MMBtu",0.83015598455598472,"lb/MW","CEMS",""]
["2324_2",{"$f":"VLOOKUP(A185,Min_Tests!A:AB,2,FALSE)","v":94},null,{"$f":"VLOOKUP(A185,Min_Tests!A:AB,5,FALSE)","v":2324},2324,"2","2","Sulfur Dioxide",8.3000000000000004E-2,"lb/MMBtu",0.9085135135135135,"lb/MW","Part II","U2_2009_COMPLIANCE"]
["6041_4",{"$f":"VLOOKUP(A186,Min_Tests!A:AB,2,FALSE)","v":95},null,{"$f":"VLOOKUP(A186,Min_Tests!A:AB,5,FALSE)","v":6041},6041,"4","Unit 04","Sulfur Dioxide",9.7766666666666696E-2,"lb/MMBtu",0.91248888888888924,"lb/MW","CEMS",""]
["6041_4",{"$f":"VLOOKUP(A187,Min_Tests!A:AB,2,FALSE)","v":95},null,{"$f":"VLOOKUP(A187,Min_Tests!A:AB,5,FALSE)","v":6041},6041,"4","Unit 04","Sulfur Dioxide",9.9333333333333329E-2,"lb/MMBtu",0.92711111111111111,"lb/MW","Part II","Gaseous Compliance_04/09/09"]
["6041_4",{"$f":"VLOOKUP(A188,Min_Tests!A:AB,2,FALSE)","v":95},null,{"$f":"VLOOKUP(A188,Min_Tests!A:AB,5,FALSE)","v":6041},6041,"4","Unit 04","Sulfur Dioxide",0.11143333333333333,"lb/MMBtu",1.0400444444444445,"lb/MW","Part II","Compliance_H2SO4_05/28/09"]
["994_2",{"$f":"VLOOKUP(A189,Min_Tests!A:AB,2,FALSE)","v":96},null,{"$f":"VLOOKUP(A189,Min_Tests!A:AB,5,FALSE)","v":994},994,"2","2ss","Sulfur Dioxide",9.8233333333333311E-2,"lb/MMBtu",0.91478411985018704,"lb/MW","CEMS",""]
["6639_G2",{"$f":"VLOOKUP(A190,Min_Tests!A:AB,2,FALSE)","v":97},null,{"$f":"VLOOKUP(A190,Min_Tests!A:AB,5,FALSE)","v":6639},6639,"G2","2","Sulfur Dioxide",8.0266666666666667E-2,"lb/MMBtu",0.91571168758716881,"lb/MW","CEMS",""]
["7213_2",{"$f":"VLOOKUP(A191,Min_Tests!A:AB,2,FALSE)","v":98},null,{"$f":"VLOOKUP(A191,Min_Tests!A:AB,5,FALSE)","v":7213},7213,"2","Unit 2","Sulfur Dioxide",7.9174518289863619E-2,"lb/MMBtu",0.91962844861567394,"lb/MW","ERT",""]
["6096_NC2",{"$f":"VLOOKUP(A192,Min_Tests!A:AB,2,FALSE)","v":99},null,{"$f":"VLOOKUP(A192,Min_Tests!A:AB,5,FALSE)","v":6096},6096,"NC2","NC2","Sulfur Dioxide",9.2366666666666666E-2,"lb/MMBtu",0.93724456666666667,"lb/MW","CEMS",""]
["728_Y1BR",{"$f":"VLOOKUP(A193,Min_Tests!A:AB,2,FALSE)","v":100},null,{"$f":"VLOOKUP(A193,Min_Tests!A:AB,5,FALSE)","v":728},728,"Y1BR","Y1BR","Sulfur Dioxide",9.3700000000000019E-2,"lb/MMBtu",0.95866659252336472,"lb/MW","CEMS",""]
[{"$f":"E194&\"_\"&F194","v":"160_2"},{"$f":"VLOOKUP(A194,Min_Tests!A:AB,2,FALSE)","v":101},null,{"$f":"VLOOKUP(A194,Min_Tests!A:AB,5,FALSE)","v":160},160,"2","ST2","Sulfur Dioxide",0.10256585416622069,"lb/MMBtu",0.97162091695666153,"lb/MW","Part II","Test 7"]
["160_2",{"$f":"VLOOKUP(A195,Min_Tests!A:AB,2,FALSE)","v":101},null,{"$f":"VLOOKUP(A195,Min_Tests!A:AB,5,FALSE)","v":160},160,"2","ST2","Sulfur Dioxide",0.14125582469518461,"lb/MMBtu",1.3381365078223668,"lb/MW","Part II","Test 1"]
["160_2",{"$f":"VLOOKUP(A196,Min_Tests!A:AB,2,FALSE)","v":101},null,{"$f":"VLOOKUP(A196,Min_Tests!A:AB,5,FALSE)","v":160},160,"2","ST2","Sulfur Dioxide",0.33021071929793305,"lb/MMBtu",3.1281330856292198,"lb/MW","Part II","Test 3"]
["160_2",{"$f":"VLOOKUP(A197,Min_Tests!A:AB,2,FALSE)","v":101},null,{"$f":"VLOOKUP(A197,Min_Tests!A:AB,5,FALSE)","v":160},160,"2","ST2","Sulfur Dioxide",0.36297701925228137,"lb/MMBtu",3.4385329030511667,"lb/MW","Part II","Test 5"]
["160_2",{"$f":"VLOOKUP(A198,Min_Tests!A:AB,2,FALSE)","v":101},null,{"$f":"VLOOKUP(A198,Min_Tests!A:AB,5,FALSE)","v":160},160,"2","ST2","Sulfur Dioxide",0.43153189108445605,"lb/MMBtu",4.0879629494628631,"lb/MW","Part II","Test 9"]
["963_34",{"$f":"VLOOKUP(A199,Min_Tests!A:AB,2,FALSE)","v":102},null,{"$f":"VLOOKUP(A199,Min_Tests!A:AB,5,FALSE)","v":963},963,"34","34","Sulfur Dioxide",0.11800000000000002,"lb/MMBtu",0.99014036617262446,"lb/MW","CEMS",""]
["52007_BLR1",{"$f":"VLOOKUP(A200,Min_Tests!A:AB,2,FALSE)","v":103},null,{"$f":"VLOOKUP(A200,Min_Tests!A:AB,5,FALSE)","v":52007},52007,"BLR1","Unit 1 & 2","Sulfur Dioxide",8.3128224638290851E-2,"lb/MMBtu",1.0030076578067462,"lb/MW","ERT",""]
["52007_BLR2",{"$f":"VLOOKUP(A201,Min_Tests!A:AB,2,FALSE)","v":104},null,{"$f":"VLOOKUP(A201,Min_Tests!A:AB,5,FALSE)","v":52007},52007,"BLR2","Unit 1 & 2","Sulfur Dioxide",8.3128224638290851E-2,"lb/MMBtu",1.0030076578067462,"lb/MW","ERT",""]
["113_4",{"$f":"VLOOKUP(A202,Min_Tests!A:AB,2,FALSE)","v":105},null,{"$f":"VLOOKUP(A202,Min_Tests!A:AB,5,FALSE)","v":113},113,"4","004","Sulfur Dioxide",0.1,"lb/MMBtu",1.0042352941176471,"lb/MW","Part II","26"]
["113_4",{"$f":"VLOOKUP(A203,Min_Tests!A:AB,2,FALSE)","v":105},null,{"$f":"VLOOKUP(A203,Min_Tests!A:AB,5,FALSE)","v":113},113,"4","004","Sulfur Dioxide",0.14000000000000001,"lb/MMBtu",1.4059294117647061,"lb/MW","Part II","20"]
["113_4",{"$f":"VLOOKUP(A204,Min_Tests!A:AB,2,FALSE)","v":105},null,{"$f":"VLOOKUP(A204,Min_Tests!A:AB,5,FALSE)","v":113},113,"4","004","Sulfur Dioxide",0.15057526065142857,"lb/MMBtu",1.5121299116712874,"lb/MW","ETTS",""]
["2718_ES-2",{"$f":"VLOOKUP(A205,Min_Tests!A:AB,2,FALSE)","v":106},null,{"$f":"VLOOKUP(A205,Min_Tests!A:AB,5,FALSE)","v":2718},2718,"ES-2","2-2009","Sulfur Dioxide",0.11924514949161609,"lb/MMBtu",1.0166154270217438,"lb/MW","ERT",""]
["1356_1",{"$f":"VLOOKUP(A206,Min_Tests!A:AB,2,FALSE)","v":107},null,{"$f":"VLOOKUP(A206,Min_Tests!A:AB,5,FALSE)","v":1356},1356,"1","GH1","Sulfur Dioxide",8.443333333333336E-2,"lb/MMBtu",1.020669102564103,"lb/MW","CEMS",""]
["3954_3",{"$f":"VLOOKUP(A207,Min_Tests!A:AB,2,FALSE)","v":108},null,{"$f":"VLOOKUP(A207,Min_Tests!A:AB,5,FALSE)","v":3954},3954,"3","Unit 3","Sulfur Dioxide",9.8266666666666683E-2,"lb/MMBtu",1.039716803620341,"lb/MW","CEMS",""]
["55749_PC1",{"$f":"VLOOKUP(A208,Min_Tests!A:AB,2,FALSE)","v":109},null,{"$f":"VLOOKUP(A208,Min_Tests!A:AB,5,FALSE)","v":55749},55749,"PC1","PC1","Sulfur Dioxide",9.5333333333333339E-2,"lb/MMBtu",1.0446610644257703,"lb/MW","CEMS",""]
["55749_PC1",{"$f":"VLOOKUP(A209,Min_Tests!A:AB,2,FALSE)","v":109},null,{"$f":"VLOOKUP(A209,Min_Tests!A:AB,5,FALSE)","v":55749},55749,"PC1","PC1","Sulfur Dioxide",0.104,"lb/MMBtu",1.1396302521008403,"lb/MW","Part II","1"]
["477_5",{"$f":"VLOOKUP(A210,Min_Tests!A:AB,2,FALSE)","v":110},null,{"$f":"VLOOKUP(A210,Min_Tests!A:AB,5,FALSE)","v":477},477,"5","Unit 5","Sulfur Dioxide",0.11116085312966667,"lb/MMBtu",1.0463866021644643,"lb/MW","ETTS",""]
["477_5",{"$f":"VLOOKUP(A211,Min_Tests!A:AB,2,FALSE)","v":110},null,{"$f":"VLOOKUP(A211,Min_Tests!A:AB,5,FALSE)","v":477},477,"5","Unit 5","Sulfur Dioxide",0.11411538461538463,"lb/MMBtu",1.0741983908948196,"lb/MW","CEMS",""]
["469_4",{"$f":"VLOOKUP(A212,Min_Tests!A:AB,2,FALSE)","v":111},null,{"$f":"VLOOKUP(A212,Min_Tests!A:AB,5,FALSE)","v":469},469,"4","Unit 4","Sulfur Dioxide",0.11387154009666667,"lb/MMBtu",1.0465478358753699,"lb/MW","ETTS",""]
["469_4",{"$f":"VLOOKUP(A213,Min_Tests!A:AB,2,FALSE)","v":111},null,{"$f":"VLOOKUP(A213,Min_Tests!A:AB,5,FALSE)","v":469},469,"4","Unit 4","Sulfur Dioxide",0.12536666666666668,"lb/MMBtu",1.152194952132289,"lb/MW","CEMS",""]
["995_7",{"$f":"VLOOKUP(A214,Min_Tests!A:AB,2,FALSE)","v":112},null,{"$f":"VLOOKUP(A214,Min_Tests!A:AB,5,FALSE)","v":995},995,"7","7","Sulfur Dioxide",0.11432504656908832,"lb/MMBtu",1.0640024220464015,"lb/MW","ERT",""]
["113_3",{"$f":"VLOOKUP(A215,Min_Tests!A:AB,2,FALSE)","v":113},null,{"$f":"VLOOKUP(A215,Min_Tests!A:AB,5,FALSE)","v":113},113,"3","003","Sulfur Dioxide",0.113,"lb/MMBtu",1.0851704918032787,"lb/MW","Part II","28"]
["113_3",{"$f":"VLOOKUP(A216,Min_Tests!A:AB,2,FALSE)","v":113},null,{"$f":"VLOOKUP(A216,Min_Tests!A:AB,5,FALSE)","v":113},113,"3","003","Sulfur Dioxide",0.124,"lb/MMBtu",1.1908065573770492,"lb/MW","Part II","27"]
["113_3",{"$f":"VLOOKUP(A217,Min_Tests!A:AB,2,FALSE)","v":113},null,{"$f":"VLOOKUP(A217,Min_Tests!A:AB,5,FALSE)","v":113},113,"3","003","Sulfur Dioxide",0.13794274810714288,"lb/MMBtu",1.3247026531338408,"lb/MW","ETTS",""]
["113_3",{"$f":"VLOOKUP(A218,Min_Tests!A:AB,2,FALSE)","v":113},null,{"$f":"VLOOKUP(A218,Min_Tests!A:AB,5,FALSE)","v":113},113,"3","003","Sulfur Dioxide",2.1,"lb/MMBtu",20.166885245901639,"lb/MW","Part II","29"]
["995_8",{"$f":"VLOOKUP(A219,Min_Tests!A:AB,2,FALSE)","v":114},null,{"$f":"VLOOKUP(A219,Min_Tests!A:AB,5,FALSE)","v":995},995,"8","8","Sulfur Dioxide",0.11432504656908832,"lb/MMBtu",1.0958315543298409,"lb/MW","ERT",""]
["1356_4",{"$f":"VLOOKUP(A220,Min_Tests!A:AB,2,FALSE)","v":115},null,{"$f":"VLOOKUP(A220,Min_Tests!A:AB,5,FALSE)","v":1356},1356,"4","GH4","Sulfur Dioxide",9.9100000000000008E-2,"lb/MMBtu",1.126342285714286,"lb/MW","CEMS",""]
["2718_ES-5",{"$f":"VLOOKUP(A221,Min_Tests!A:AB,2,FALSE)","v":116},null,{"$f":"VLOOKUP(A221,Min_Tests!A:AB,5,FALSE)","v":2718},2718,"ES-5","5-2009","Sulfur Dioxide",0.11924514949161609,"lb/MMBtu",1.1305928123898406,"lb/MW","ERT",""]
["2727_Unit 3",{"$f":"VLOOKUP(A222,Min_Tests!A:AB,2,FALSE)","v":117},null,{"$f":"VLOOKUP(A222,Min_Tests!A:AB,5,FALSE)","v":2727},2727,"Unit 3","U3","Sulfur Dioxide",0.13037421534856655,"lb/MMBtu",1.136695533848338,"lb/MW","ERT",""]
["6041_1",{"$f":"VLOOKUP(A223,Min_Tests!A:AB,2,FALSE)","v":118},null,{"$f":"VLOOKUP(A223,Min_Tests!A:AB,5,FALSE)","v":6041},6041,"1","Unit 01","Sulfur Dioxide",0.10866666666666668,"lb/MMBtu",1.1501608527131784,"lb/MW","Part II","U1SO2_07/13-14/09"]
["6041_1",{"$f":"VLOOKUP(A224,Min_Tests!A:AB,2,FALSE)","v":118},null,{"$f":"VLOOKUP(A224,Min_Tests!A:AB,5,FALSE)","v":6041},6041,"1","Unit 01","Sulfur Dioxide",0.127,"lb/MMBtu",1.3442063953488372,"lb/MW","Part II","Acid Gas Emissions Test (8/5/09)"]
["6041_1",{"$f":"VLOOKUP(A225,Min_Tests!A:AB,2,FALSE)","v":118},null,{"$f":"VLOOKUP(A225,Min_Tests!A:AB,5,FALSE)","v":6041},6041,"1","Unit 01","Sulfur Dioxide",0.24906666666666669,"lb/MMBtu",2.6361968992248066,"lb/MW","CEMS",""]
["7504_2",{"$f":"VLOOKUP(A226,Min_Tests!A:AB,2,FALSE)","v":119},null,{"$f":"VLOOKUP(A226,Min_Tests!A:AB,5,FALSE)","v":7504},7504,"2","NS2Cfg","Sulfur Dioxide",9.2100000000000015E-2,"lb/MMBtu",1.1512500000000001,"lb/MW","CEMS",""]
["525_2",{"$f":"VLOOKUP(A227,Min_Tests!A:AB,2,FALSE)","v":120},null,{"$f":"VLOOKUP(A227,Min_Tests!A:AB,5,FALSE)","v":525},525,"2","Unit 2","Sulfur Dioxide",0.12140945273666666,"lb/MMBtu",1.1553067923573332,"lb/MW","ETTS",""]
["525_2",{"$f":"VLOOKUP(A228,Min_Tests!A:AB,2,FALSE)","v":120},null,{"$f":"VLOOKUP(A228,Min_Tests!A:AB,5,FALSE)","v":525},525,"2","Unit 2","Sulfur Dioxide",0.13686206896551725,"lb/MMBtu",1.3023506352087115,"lb/MW","CEMS",""]
["525_1",{"$f":"VLOOKUP(A229,Min_Tests!A:AB,2,FALSE)","v":121},null,{"$f":"VLOOKUP(A229,Min_Tests!A:AB,5,FALSE)","v":525},525,"1","Unit 1","Sulfur Dioxide",0.11896666666666669,"lb/MMBtu",1.1560968646864689,"lb/MW","CEMS",""]
["525_1",{"$f":"VLOOKUP(A230,Min_Tests!A:AB,2,FALSE)","v":121},null,{"$f":"VLOOKUP(A230,Min_Tests!A:AB,5,FALSE)","v":525},525,"1","Unit 1","Sulfur Dioxide",0.12021440316999998,"lb/MMBtu",1.1682221456569801,"lb/MW","ETTS",""]
["50888_BLR1",{"$f":"VLOOKUP(A231,Min_Tests!A:AB,2,FALSE)","v":122},null,{"$f":"VLOOKUP(A231,Min_Tests!A:AB,5,FALSE)","v":50888},50888,"BLR1","GEN1","Sulfur Dioxide",0.1235357720062057,"lb/MMBtu",1.1700164852819153,"lb/MW","ERT",""]
["2828_2",{"$f":"VLOOKUP(A232,Min_Tests!A:AB,2,FALSE)","v":123},null,{"$f":"VLOOKUP(A232,Min_Tests!A:AB,5,FALSE)","v":2828},2828,"2","CD-U2","Sulfur Dioxide",0.13689999999999999,"lb/MMBtu",1.1738418400520154,"lb/MW","CEMS",""]
["2718_ES-1",{"$f":"VLOOKUP(A233,Min_Tests!A:AB,2,FALSE)","v":124},null,{"$f":"VLOOKUP(A233,Min_Tests!A:AB,5,FALSE)","v":2718},2718,"ES-1","1-2009","Sulfur Dioxide",0.11924514949161609,"lb/MMBtu",1.1762092498094709,"lb/MW","ERT",""]
["160_3",{"$f":"VLOOKUP(A234,Min_Tests!A:AB,2,FALSE)","v":125},null,{"$f":"VLOOKUP(A234,Min_Tests!A:AB,5,FALSE)","v":160},160,"3","ST3","Sulfur Dioxide",0.12490650035692662,"lb/MMBtu",1.1832570341973929,"lb/MW","Part II","Test 2"]
["160_3",{"$f":"VLOOKUP(A235,Min_Tests!A:AB,2,FALSE)","v":125},null,{"$f":"VLOOKUP(A235,Min_Tests!A:AB,5,FALSE)","v":160},160,"3","ST3","Sulfur Dioxide",0.25782551071563597,"lb/MMBtu",2.4424177146749582,"lb/MW","Part II","Test 8"]
["160_3",{"$f":"VLOOKUP(A236,Min_Tests!A:AB,2,FALSE)","v":125},null,{"$f":"VLOOKUP(A236,Min_Tests!A:AB,5,FALSE)","v":160},160,"3","ST3","Sulfur Dioxide",0.27344090470699245,"lb/MMBtu",2.5903445617904985,"lb/MW","Part II","Test 10"]
["160_3",{"$f":"VLOOKUP(A237,Min_Tests!A:AB,2,FALSE)","v":125},null,{"$f":"VLOOKUP(A237,Min_Tests!A:AB,5,FALSE)","v":160},160,"3","ST3","Sulfur Dioxide",0.34910940239079424,"lb/MMBtu",3.3071629971453924,"lb/MW","Part II","Test 4"]
["160_3",{"$f":"VLOOKUP(A238,Min_Tests!A:AB,2,FALSE)","v":125},null,{"$f":"VLOOKUP(A238,Min_Tests!A:AB,5,FALSE)","v":160},160,"3","ST3","Sulfur Dioxide",0.36358285694241349,"lb/MMBtu",3.4442720896137735,"lb/MW","Part II","Test 6"]
["55076_AA-002",{"$f":"VLOOKUP(A239,Min_Tests!A:AB,2,FALSE)","v":126},null,{"$f":"VLOOKUP(A239,Min_Tests!A:AB,5,FALSE)","v":55076},55076,"AA-002","002","Sulfur Dioxide",0.12496423704539082,"lb/MMBtu",1.1908092076529384,"lb/MW","ERT",""]
["55076_AA-001",{"$f":"VLOOKUP(A240,Min_Tests!A:AB,2,FALSE)","v":127},null,{"$f":"VLOOKUP(A240,Min_Tests!A:AB,5,FALSE)","v":55076},55076,"AA-001","001","Sulfur Dioxide",0.12496423704539082,"lb/MMBtu",1.2001565325839334,"lb/MW","ERT",""]
["50976_AABO1",{"$f":"VLOOKUP(A241,Min_Tests!A:AB,2,FALSE)","v":128},null,{"$f":"VLOOKUP(A241,Min_Tests!A:AB,5,FALSE)","v":50976},50976,"AABO1","001","Sulfur Dioxide",0.12666666666666668,"lb/MMBtu",1.200701754385965,"lb/MW","Part II","10669-3"]
["50976_AABO1",{"$f":"VLOOKUP(A242,Min_Tests!A:AB,2,FALSE)","v":128},null,{"$f":"VLOOKUP(A242,Min_Tests!A:AB,5,FALSE)","v":50976},50976,"AABO1","001","Sulfur Dioxide",0.13213333333333332,"lb/MMBtu",1.252521514312096,"lb/MW","Part II","11350"]
["50976_AABO1",{"$f":"VLOOKUP(A243,Min_Tests!A:AB,2,FALSE)","v":128},null,{"$f":"VLOOKUP(A243,Min_Tests!A:AB,5,FALSE)","v":50976},50976,"AABO1","001","Sulfur Dioxide",0.1391,"lb/MMBtu",1.3185601108033242,"lb/MW","Part II","10396"]
["50976_AABO1",{"$f":"VLOOKUP(A244,Min_Tests!A:AB,2,FALSE)","v":128},null,{"$f":"VLOOKUP(A244,Min_Tests!A:AB,5,FALSE)","v":50976},50976,"AABO1","001","Sulfur Dioxide",0.14216666666666666,"lb/MMBtu",1.3476297322253001,"lb/MW","Part II","I-9222"]
["50976_AABO1",{"$f":"VLOOKUP(A245,Min_Tests!A:AB,2,FALSE)","v":128},null,{"$f":"VLOOKUP(A245,Min_Tests!A:AB,5,FALSE)","v":50976},50976,"AABO1","001","Sulfur Dioxide",0.14692128868684484,"lb/MMBtu",1.3926998611811165,"lb/MW","ERT",""]
["3954_1",{"$f":"VLOOKUP(A246,Min_Tests!A:AB,2,FALSE)","v":129},null,{"$f":"VLOOKUP(A246,Min_Tests!A:AB,5,FALSE)","v":3954},3954,"1","Unit 1&2","Sulfur Dioxide",0.10113599955326762,"lb/MMBtu",1.2046559124203593,"lb/MW","ERT",""]
["3954_2",{"$f":"VLOOKUP(A247,Min_Tests!A:AB,2,FALSE)","v":130},null,{"$f":"VLOOKUP(A247,Min_Tests!A:AB,5,FALSE)","v":3954},3954,"2","Unit 1&2","Sulfur Dioxide",0.10113599955326762,"lb/MMBtu",1.2046559124203593,"lb/MW","ERT",""]
["50776_BLR1",{"$f":"VLOOKUP(A248,Min_Tests!A:AB,2,FALSE)","v":131},null,{"$f":"VLOOKUP(A248,Min_Tests!A:AB,5,FALSE)","v":50776},50776,"BLR1","BG1","Sulfur Dioxide",9.3700605318000021E-2,"lb/MMBtu",1.209040068619355,"lb/MW","ERT",""]
["50776_BLR2",{"$f":"VLOOKUP(A249,Min_Tests!A:AB,2,FALSE)","v":132},null,{"$f":"VLOOKUP(A249,Min_Tests!A:AB,5,FALSE)","v":50776},50776,"BLR2","BG2","Sulfur Dioxide",9.3700605318000021E-2,"lb/MMBtu",1.209040068619355,"lb/MW","ERT",""]
["469_3",{"$f":"VLOOKUP(A250,Min_Tests!A:AB,2,FALSE)","v":133},null,{"$f":"VLOOKUP(A250,Min_Tests!A:AB,5,FALSE)","v":469},469,"3","Unit 3","Sulfur Dioxide",0.11096959117000001,"lb/MMBtu",1.2623631674308484,"lb/MW","ETTS",""]
["469_3",{"$f":"VLOOKUP(A251,Min_Tests!A:AB,2,FALSE)","v":133},null,{"$f":"VLOOKUP(A251,Min_Tests!A:AB,5,FALSE)","v":469},469,"3","Unit 3","Sulfur Dioxide",0.12910000000000002,"lb/MMBtu",1.4686103030303033,"lb/MW","CEMS",""]
["10343_SG-101",{"$f":"VLOOKUP(A252,Min_Tests!A:AB,2,FALSE)","v":134},null,{"$f":"VLOOKUP(A252,Min_Tests!A:AB,5,FALSE)","v":10343},10343,"SG-101","SG-101","Sulfur Dioxide",0.10864386280863732,"lb/MMBtu",1.275933737636322,"lb/MW","ERT",""]
["3118_2",{"$f":"VLOOKUP(A253,Min_Tests!A:AB,2,FALSE)","v":135},null,{"$f":"VLOOKUP(A253,Min_Tests!A:AB,5,FALSE)","v":3118},3118,"2","CON-2","Sulfur Dioxide",0.13457753874080378,"lb/MMBtu",1.2918581042586772,"lb/MW","ERT",""]
["2832_Unit 8",{"$f":"VLOOKUP(A254,Min_Tests!A:AB,2,FALSE)","v":136},null,{"$f":"VLOOKUP(A254,Min_Tests!A:AB,5,FALSE)","v":2832},2832,"Unit 8","U8","Sulfur Dioxide",0.14466666666666669,"lb/MMBtu",1.3159406060606063,"lb/MW","Part II","U8083007FGD"]
["3118_1",{"$f":"VLOOKUP(A255,Min_Tests!A:AB,2,FALSE)","v":137},null,{"$f":"VLOOKUP(A255,Min_Tests!A:AB,5,FALSE)","v":3118},3118,"1","CON-1","Sulfur Dioxide",0.13917258373969707,"lb/MMBtu",1.335967590706387,"lb/MW","ERT",""]
["127_1",{"$f":"VLOOKUP(A256,Min_Tests!A:AB,2,FALSE)","v":138},null,{"$f":"VLOOKUP(A256,Min_Tests!A:AB,5,FALSE)","v":127},127,"1","OKL-1","Sulfur Dioxide",0.13561733020971514,"lb/MMBtu",1.3764146946657658,"lb/MW","ERT",""]
["127_1",{"$f":"VLOOKUP(A257,Min_Tests!A:AB,2,FALSE)","v":138},null,{"$f":"VLOOKUP(A257,Min_Tests!A:AB,5,FALSE)","v":127},127,"1","OKL-1","Sulfur Dioxide",0.18450000000000003,"lb/MMBtu",1.8725373134328362,"lb/MW","CEMS",""]
[{"$f":"E258&\"_\"&F258","v":"2079_5A"},{"$f":"VLOOKUP(A258,Min_Tests!A:AB,2,FALSE)","v":139},null,{"$f":"VLOOKUP(A258,Min_Tests!A:AB,5,FALSE)","v":2079},2079,"5A","5A","Sulfur Dioxide",0.12535393243236512,"lb/MMBtu",1.3928214714707234,"lb/MW","ERT",""]
["6041_2",{"$f":"VLOOKUP(A259,Min_Tests!A:AB,2,FALSE)","v":140},null,{"$f":"VLOOKUP(A259,Min_Tests!A:AB,5,FALSE)","v":6041},6041,"2","Unit 02","Sulfur Dioxide",0.14053333333333332,"lb/MMBtu",1.4179939939939938,"lb/MW","CEMS",""]
["2832_Unit 7",{"$f":"VLOOKUP(A260,Min_Tests!A:AB,2,FALSE)","v":141},null,{"$f":"VLOOKUP(A260,Min_Tests!A:AB,5,FALSE)","v":2832},2832,"Unit 7","U7","Sulfur Dioxide",0.15766666666666668,"lb/MMBtu",1.4319000000000002,"lb/MW","Part II","U8082907FGD"]
["3399_1",{"$f":"VLOOKUP(A261,Min_Tests!A:AB,2,FALSE)","v":142},null,{"$f":"VLOOKUP(A261,Min_Tests!A:AB,5,FALSE)","v":3399},3399,"1","1","Sulfur Dioxide",0.13267855656852576,"lb/MMBtu",1.4421138494717454,"lb/MW","ERT",""]
["55479_3",{"$f":"VLOOKUP(A262,Min_Tests!A:AB,2,FALSE)","v":143},null,{"$f":"VLOOKUP(A262,Min_Tests!A:AB,5,FALSE)","v":55479},55479,"3","WYG1Cfg","Sulfur Dioxide",0.12766666666666671,"lb/MMBtu",1.4772857142857148,"lb/MW","CEMS",""]
["2840_4",{"$f":"VLOOKUP(A263,Min_Tests!A:AB,2,FALSE)","v":144},null,{"$f":"VLOOKUP(A263,Min_Tests!A:AB,5,FALSE)","v":2840},2840,"4","CV-4","Sulfur Dioxide",0.157,"lb/MMBtu",1.4851099227569817,"lb/MW","CEMS",""]
["3944_1",{"$f":"VLOOKUP(A264,Min_Tests!A:AB,2,FALSE)","v":145},null,{"$f":"VLOOKUP(A264,Min_Tests!A:AB,5,FALSE)","v":3944},3944,"1","Boiler1","Sulfur Dioxide",0.1782925631469047,"lb/MMBtu",1.4868004652611289,"lb/MW","ERT",""]
["130_4",{"$f":"VLOOKUP(A265,Min_Tests!A:AB,2,FALSE)","v":146},null,{"$f":"VLOOKUP(A265,Min_Tests!A:AB,5,FALSE)","v":130},130,"4","C4","Sulfur Dioxide",0.1386,"lb/MMBtu",1.5075244799999998,"lb/MW","CEMS",""]
["10566_Boil 1",{"$f":"VLOOKUP(A266,Min_Tests!A:AB,2,FALSE)","v":147},null,{"$f":"VLOOKUP(A266,Min_Tests!A:AB,5,FALSE)","v":10566},10566,"Boil 1","Boil 1","Sulfur Dioxide",0.15911461545440739,"lb/MMBtu",1.5487155904228984,"lb/MW","ERT",""]
["10678_BLR1",{"$f":"VLOOKUP(A267,Min_Tests!A:AB,2,FALSE)","v":148},null,{"$f":"VLOOKUP(A267,Min_Tests!A:AB,5,FALSE)","v":10678},10678,"BLR1","BLR1","Sulfur Dioxide",0.15393333333333331,"lb/MMBtu",1.5599085808580857,"lb/MW","CEMS",""]
["10672_CBC",{"$f":"VLOOKUP(A268,Min_Tests!A:AB,2,FALSE)","v":149},null,{"$f":"VLOOKUP(A268,Min_Tests!A:AB,5,FALSE)","v":10672},10672,"CBC","CBC1","Sulfur Dioxide",0.13556666666666667,"lb/MMBtu",1.5663844202898551,"lb/MW","CEMS",""]
["6113_4",{"$f":"VLOOKUP(A269,Min_Tests!A:AB,2,FALSE)","v":150},null,{"$f":"VLOOKUP(A269,Min_Tests!A:AB,5,FALSE)","v":6113},6113,"4","4","Sulfur Dioxide",0.16690713839146307,"lb/MMBtu",1.5819564629690106,"lb/MW","ERT",""]
["6113_4",{"$f":"VLOOKUP(A270,Min_Tests!A:AB,2,FALSE)","v":150},null,{"$f":"VLOOKUP(A270,Min_Tests!A:AB,5,FALSE)","v":6113},6113,"4","4","Sulfur Dioxide",0.38100000000000001,"lb/MMBtu",3.6111422087745839,"lb/MW","Part II","U4010606"]
["10566_Boil 2",{"$f":"VLOOKUP(A271,Min_Tests!A:AB,2,FALSE)","v":151},null,{"$f":"VLOOKUP(A271,Min_Tests!A:AB,5,FALSE)","v":10566},10566,"Boil 2","Boil 2","Sulfur Dioxide",0.16815798007889027,"lb/MMBtu",1.6367376727678651,"lb/MW","ERT",""]
["645_3",{"$f":"VLOOKUP(A272,Min_Tests!A:AB,2,FALSE)","v":152},null,{"$f":"VLOOKUP(A272,Min_Tests!A:AB,5,FALSE)","v":645},645,"3","BB03_SCR_iso","Sulfur Dioxide",0.16233292831105711,"lb/MMBtu",1.67,"lb/MW","Part II","BB#3_FY2009"]
["3944_3",{"$f":"VLOOKUP(A273,Min_Tests!A:AB,2,FALSE)","v":153},null,{"$f":"VLOOKUP(A273,Min_Tests!A:AB,5,FALSE)","v":3944},3944,"3","Boiler3","Sulfur Dioxide",0.20523489335526338,"lb/MMBtu",1.742717100224751,"lb/MW","ERT",""]
["2403_U2",{"$f":"VLOOKUP(A274,Min_Tests!A:AB,2,FALSE)","v":154},null,{"$f":"VLOOKUP(A274,Min_Tests!A:AB,5,FALSE)","v":2403},2403,"U2","HUDU2E2PT2OS1-Coal","Sulfur Dioxide",0.18298619730722043,"lb/MMBtu",1.8306941067570939,"lb/MW","Part II","HUD2 2009 5YR ST CoNg"]
["568_BHB3",{"$f":"VLOOKUP(A275,Min_Tests!A:AB,2,FALSE)","v":155},null,{"$f":"VLOOKUP(A275,Min_Tests!A:AB,5,FALSE)","v":568},568,"BHB3","BHSEMU3OS2-Coal","Sulfur Dioxide",0.18065583697492216,"lb/MMBtu",1.8379377955265035,"lb/MW","ERT",""]
["1382_H1",{"$f":"VLOOKUP(A276,Min_Tests!A:AB,2,FALSE)","v":156},null,{"$f":"VLOOKUP(A276,Min_Tests!A:AB,5,FALSE)","v":1382},1382,"H1","1","Sulfur Dioxide",0.17536666666666664,"lb/MMBtu",1.8993656431868351,"lb/MW","CEMS",""]
["207_PPBoiler2",{"$f":"VLOOKUP(A277,Min_Tests!A:AB,2,FALSE)","v":157},null,{"$f":"VLOOKUP(A277,Min_Tests!A:AB,5,FALSE)","v":207},207,"PPBoiler2","PPUnit2Configuration","Sulfur Dioxide",0.20700000000000005,"lb/MMBtu",1.9269818181818186,"lb/MW","CEMS",""]
["963_31",{"$f":"VLOOKUP(A278,Min_Tests!A:AB,2,FALSE)","v":158},null,{"$f":"VLOOKUP(A278,Min_Tests!A:AB,5,FALSE)","v":963},963,"31","31","Sulfur Dioxide",0.1821666666666667,"lb/MMBtu",1.9474021481481483,"lb/MW","CEMS",""]
["207_PPBoiler1",{"$f":"VLOOKUP(A279,Min_Tests!A:AB,2,FALSE)","v":159},null,{"$f":"VLOOKUP(A279,Min_Tests!A:AB,5,FALSE)","v":207},207,"PPBoiler1","PPUnit1Configuration","Sulfur Dioxide",0.21052000000000001,"lb/MMBtu",1.9597498181818183,"lb/MW","CEMS",""]
["963_32",{"$f":"VLOOKUP(A280,Min_Tests!A:AB,2,FALSE)","v":160},null,{"$f":"VLOOKUP(A280,Min_Tests!A:AB,5,FALSE)","v":963},963,"32","32","Sulfur Dioxide",0.1821666666666667,"lb/MMBtu",1.9646675000000005,"lb/MW","CEMS",""]
["2828_1",{"$f":"VLOOKUP(A281,Min_Tests!A:AB,2,FALSE)","v":161},null,{"$f":"VLOOKUP(A281,Min_Tests!A:AB,5,FALSE)","v":2828},2828,"1","CD-U1","Sulfur Dioxide",0.23494999999999999,"lb/MMBtu",2.014566401170351,"lb/MW","CEMS",""]
["3122_3",{"$f":"VLOOKUP(A282,Min_Tests!A:AB,2,FALSE)","v":162},null,{"$f":"VLOOKUP(A282,Min_Tests!A:AB,5,FALSE)","v":3122},3122,"3","HC3CONFIG","Sulfur Dioxide",0.22583333333333339,"lb/MMBtu",2.0507659313725495,"lb/MW","CEMS",""]
["10673_BLR B",{"$f":"VLOOKUP(A283,Min_Tests!A:AB,2,FALSE)","v":163},null,{"$f":"VLOOKUP(A283,Min_Tests!A:AB,5,FALSE)","v":10673},10673,"BLR B","002","Sulfur Dioxide",0.22503333333333334,"lb/MMBtu",2.0933642692939247,"lb/MW","CEMS",""]
["50951_1",{"$f":"VLOOKUP(A284,Min_Tests!A:AB,2,FALSE)","v":164},null,{"$f":"VLOOKUP(A284,Min_Tests!A:AB,5,FALSE)","v":50951},50951,"1","Config 1","Sulfur Dioxide",0.18148502722607515,"lb/MMBtu",2.1173253176375435,"lb/MW","ERT",""]
["50951_1",{"$f":"VLOOKUP(A285,Min_Tests!A:AB,2,FALSE)","v":164},null,{"$f":"VLOOKUP(A285,Min_Tests!A:AB,5,FALSE)","v":50951},50951,"1","Config 1","Sulfur Dioxide",0.18385714285714286,"lb/MMBtu",2.145,"lb/MW","Part II","2007 compliance tests avg"]
["50951_1",{"$f":"VLOOKUP(A286,Min_Tests!A:AB,2,FALSE)","v":164},null,{"$f":"VLOOKUP(A286,Min_Tests!A:AB,5,FALSE)","v":50951},50951,"1","Config 1","Sulfur Dioxide",0.19271428571428573,"lb/MMBtu",2.2483333333333335,"lb/MW","Part II","2009 Compliance Tests"]
["50951_1",{"$f":"VLOOKUP(A287,Min_Tests!A:AB,2,FALSE)","v":164},null,{"$f":"VLOOKUP(A287,Min_Tests!A:AB,5,FALSE)","v":50951},50951,"1","Config 1","Sulfur Dioxide",0.20971428571428574,"lb/MMBtu",2.4466666666666668,"lb/MW","Part II","2008 Compliance tests avg"]
["50951_1",{"$f":"VLOOKUP(A288,Min_Tests!A:AB,2,FALSE)","v":164},null,{"$f":"VLOOKUP(A288,Min_Tests!A:AB,5,FALSE)","v":50951},50951,"1","Config 1","Sulfur Dioxide",0.34514285714285714,"lb/MMBtu",4.0266666666666664,"lb/MW","Part II","2005 Compliance test avg"]
["50951_1",{"$f":"VLOOKUP(A289,Min_Tests!A:AB,2,FALSE)","v":164},null,{"$f":"VLOOKUP(A289,Min_Tests!A:AB,5,FALSE)","v":50951},50951,"1","Config 1","Sulfur Dioxide",0.45571428571428574,"lb/MMBtu",5.3166666666666664,"lb/MW","Part II","2006 Compliance test avg"]
["10673_BLR A",{"$f":"VLOOKUP(A290,Min_Tests!A:AB,2,FALSE)","v":165},null,{"$f":"VLOOKUP(A290,Min_Tests!A:AB,5,FALSE)","v":10673},10673,"BLR A","001","Sulfur Dioxide",0.22333333333333338,"lb/MMBtu",2.2474154351395739,"lb/MW","CEMS",""]
["3399_2",{"$f":"VLOOKUP(A291,Min_Tests!A:AB,2,FALSE)","v":166},null,{"$f":"VLOOKUP(A291,Min_Tests!A:AB,5,FALSE)","v":3399},3399,"2","2","Sulfur Dioxide",0.20865998783620629,"lb/MMBtu",2.2679735600966113,"lb/MW","ERT",""]
["1382_H2",{"$f":"VLOOKUP(A292,Min_Tests!A:AB,2,FALSE)","v":167},null,{"$f":"VLOOKUP(A292,Min_Tests!A:AB,5,FALSE)","v":1382},1382,"H2","2","Sulfur Dioxide",0.21489999999999998,"lb/MMBtu",2.3168479491623337,"lb/MW","CEMS",""]
["6041_3",{"$f":"VLOOKUP(A293,Min_Tests!A:AB,2,FALSE)","v":168},null,{"$f":"VLOOKUP(A293,Min_Tests!A:AB,5,FALSE)","v":6041},6041,"3","Unit 03","Sulfur Dioxide",0.28070000000000006,"lb/MMBtu",2.3391666666666673,"lb/MW","CEMS",""]
["3788_4",{"$f":"VLOOKUP(A294,Min_Tests!A:AB,2,FALSE)","v":169},null,{"$f":"VLOOKUP(A294,Min_Tests!A:AB,5,FALSE)","v":3788},3788,"4","4","Sulfur Dioxide",0.27,"lb/MMBtu",2.4025000000000003,"lb/MW","Part II","C4 PM 0108"]
["3788_4",{"$f":"VLOOKUP(A295,Min_Tests!A:AB,2,FALSE)","v":169},null,{"$f":"VLOOKUP(A295,Min_Tests!A:AB,5,FALSE)","v":3788},3788,"4","4","Sulfur Dioxide",0.27,"lb/MMBtu",2.4025000000000003,"lb/MW","Part II","C4 PM 1208"]
["8102_2",{"$f":"VLOOKUP(A296,Min_Tests!A:AB,2,FALSE)","v":170},null,{"$f":"VLOOKUP(A296,Min_Tests!A:AB,5,FALSE)","v":8102},8102,"2","GA-2","Sulfur Dioxide",0.26869230769230767,"lb/MMBtu",2.4296298368298368,"lb/MW","CEMS",""]
["1356_3",{"$f":"VLOOKUP(A297,Min_Tests!A:AB,2,FALSE)","v":171},null,{"$f":"VLOOKUP(A297,Min_Tests!A:AB,5,FALSE)","v":1356},1356,"3","GH3","Sulfur Dioxide",0.21783333333333335,"lb/MMBtu",2.4347542857142859,"lb/MW","CEMS",""]
["10675_B",{"$f":"VLOOKUP(A298,Min_Tests!A:AB,2,FALSE)","v":172},null,{"$f":"VLOOKUP(A298,Min_Tests!A:AB,5,FALSE)","v":10675},10675,"B","B","Sulfur Dioxide",0.25286666666666668,"lb/MMBtu",2.4362730769230772,"lb/MW","CEMS",""]
["10675_B",{"$f":"VLOOKUP(A299,Min_Tests!A:AB,2,FALSE)","v":172},null,{"$f":"VLOOKUP(A299,Min_Tests!A:AB,5,FALSE)","v":10675},10675,"B","B","Sulfur Dioxide",0.28999999999999998,"lb/MMBtu",2.7940384615384612,"lb/MW","Part II","1"]
["10675_B",{"$f":"VLOOKUP(A300,Min_Tests!A:AB,2,FALSE)","v":172},null,{"$f":"VLOOKUP(A300,Min_Tests!A:AB,5,FALSE)","v":10675},10675,"B","B","Sulfur Dioxide",0.28999999999999998,"lb/MMBtu",2.7940384615384612,"lb/MW","Part II","2"]
["10675_B",{"$f":"VLOOKUP(A301,Min_Tests!A:AB,2,FALSE)","v":172},null,{"$f":"VLOOKUP(A301,Min_Tests!A:AB,5,FALSE)","v":10675},10675,"B","B","Sulfur Dioxide",0.28999999999999998,"lb/MMBtu",2.7940384615384612,"lb/MW","Part II","4"]
["10675_B",{"$f":"VLOOKUP(A302,Min_Tests!A:AB,2,FALSE)","v":172},null,{"$f":"VLOOKUP(A302,Min_Tests!A:AB,5,FALSE)","v":10675},10675,"B","B","Sulfur Dioxide",0.28999999999999998,"lb/MMBtu",2.7940384615384612,"lb/MW","Part II","5"]
["10675_A",{"$f":"VLOOKUP(A303,Min_Tests!A:AB,2,FALSE)","v":173},null,{"$f":"VLOOKUP(A303,Min_Tests!A:AB,5,FALSE)","v":10675},10675,"A","A","Sulfur Dioxide",0.25759999999999994,"lb/MMBtu",2.4818769230769226,"lb/MW","CEMS",""]
["10675_A",{"$f":"VLOOKUP(A304,Min_Tests!A:AB,2,FALSE)","v":173},null,{"$f":"VLOOKUP(A304,Min_Tests!A:AB,5,FALSE)","v":10675},10675,"A","A","Sulfur Dioxide",0.28999999999999998,"lb/MMBtu",2.7940384615384612,"lb/MW","Part II","1"]
["10675_A",{"$f":"VLOOKUP(A305,Min_Tests!A:AB,2,FALSE)","v":173},null,{"$f":"VLOOKUP(A305,Min_Tests!A:AB,5,FALSE)","v":10675},10675,"A","A","Sulfur Dioxide",0.28999999999999998,"lb/MMBtu",2.7940384615384612,"lb/MW","Part II","2"]
["10675_A",{"$f":"VLOOKUP(A306,Min_Tests!A:AB,2,FALSE)","v":173},null,{"$f":"VLOOKUP(A306,Min_Tests!A:AB,5,FALSE)","v":10675},10675,"A","A","Sulfur Dioxide",0.28999999999999998,"lb/MMBtu",2.7940384615384612,"lb/MW","Part II","4"]
["10675_A",{"$f":"VLOOKUP(A307,Min_Tests!A:AB,2,FALSE)","v":173},null,{"$f":"VLOOKUP(A307,Min_Tests!A:AB,5,FALSE)","v":10675},10675,"A","A","Sulfur Dioxide",0.28999999999999998,"lb/MMBtu",2.7940384615384612,"lb/MW","Part II","5"]
["3149_2",{"$f":"VLOOKUP(A308,Min_Tests!A:AB,2,FALSE)","v":174},null,{"$f":"VLOOKUP(A308,Min_Tests!A:AB,5,FALSE)","v":3149},3149,"2","U2","Sulfur Dioxide",0.27721706375550142,"lb/MMBtu",2.5338059653107008,"lb/MW","ERT",""]
["8102_1",{"$f":"VLOOKUP(A309,Min_Tests!A:AB,2,FALSE)","v":175},null,{"$f":"VLOOKUP(A309,Min_Tests!A:AB,5,FALSE)","v":8102},8102,"1","GA-1","Sulfur Dioxide",0.29073333333333334,"lb/MMBtu",2.6289341414141418,"lb/MW","CEMS",""]
["10849_BLR1",{"$f":"VLOOKUP(A310,Min_Tests!A:AB,2,FALSE)","v":176},null,{"$f":"VLOOKUP(A310,Min_Tests!A:AB,5,FALSE)","v":10849},10849,"BLR1","GEN1","Sulfur Dioxide",0.33666666666666667,"lb/MMBtu",2.7824517822133332,"lb/MW","Part II","AUG 2009 SULFUR DIOXIDE"]
["10849_BLR1",{"$f":"VLOOKUP(A311,Min_Tests!A:AB,2,FALSE)","v":176},null,{"$f":"VLOOKUP(A311,Min_Tests!A:AB,5,FALSE)","v":10849},10849,"BLR1","GEN1","Sulfur Dioxide",0.44133333333333324,"lb/MMBtu",3.6474912471786656,"lb/MW","CEMS",""]
["645_4",{"$f":"VLOOKUP(A312,Min_Tests!A:AB,2,FALSE)","v":177},null,{"$f":"VLOOKUP(A312,Min_Tests!A:AB,5,FALSE)","v":645},645,"4","BB04_SCR_iso","Sulfur Dioxide",0.30394856468080217,"lb/MMBtu",2.8303167420814481,"lb/MW","Part II","BB#4_FY2009"]
["645_4",{"$f":"VLOOKUP(A313,Min_Tests!A:AB,2,FALSE)","v":177},null,{"$f":"VLOOKUP(A313,Min_Tests!A:AB,5,FALSE)","v":645},645,"4","BB04_SCR_iso","Sulfur Dioxide",0.32389902046667196,"lb/MMBtu",3.0160919540229885,"lb/MW","Part II","BB#4_FY2008"]
["3788_5",{"$f":"VLOOKUP(A314,Min_Tests!A:AB,2,FALSE)","v":178},null,{"$f":"VLOOKUP(A314,Min_Tests!A:AB,5,FALSE)","v":3788},3788,"5","5","Sulfur Dioxide",0.32,"lb/MMBtu",2.8474074074074078,"lb/MW","Part II","C5 PM 0908"]
["6664_101",{"$f":"VLOOKUP(A315,Min_Tests!A:AB,2,FALSE)","v":179},null,{"$f":"VLOOKUP(A315,Min_Tests!A:AB,5,FALSE)","v":6664},6664,"101","101","Sulfur Dioxide",0.26829999999999998,"lb/MMBtu",2.8743095652173913,"lb/MW","CEMS",""]
["50611_031",{"$f":"VLOOKUP(A316,Min_Tests!A:AB,2,FALSE)","v":180},null,{"$f":"VLOOKUP(A316,Min_Tests!A:AB,5,FALSE)","v":50611},50611,"031","001","Sulfur Dioxide",0.16833333333333336,"lb/MMBtu",2.8756944444444446,"lb/MW","CEMS",""]
["6177_U2B",{"$f":"VLOOKUP(A317,Min_Tests!A:AB,2,FALSE)","v":181},null,{"$f":"VLOOKUP(A317,Min_Tests!A:AB,5,FALSE)","v":6177},6177,"U2B","U2B","Sulfur Dioxide",0.28000000000000003,"lb/MMBtu",2.8938239159001315,"lb/MW","Part II","10"]
["6177_U2B",{"$f":"VLOOKUP(A318,Min_Tests!A:AB,2,FALSE)","v":181},null,{"$f":"VLOOKUP(A318,Min_Tests!A:AB,5,FALSE)","v":6177},6177,"U2B","U2B","Sulfur Dioxide",0.3,"lb/MMBtu",3.100525624178712,"lb/MW","Part II","7"]
["6177_U2B",{"$f":"VLOOKUP(A319,Min_Tests!A:AB,2,FALSE)","v":181},null,{"$f":"VLOOKUP(A319,Min_Tests!A:AB,5,FALSE)","v":6177},6177,"U2B","U2B","Sulfur Dioxide",0.49,"lb/MMBtu",5.0641918528252292,"lb/MW","Part II","9"]
["6177_U2B",{"$f":"VLOOKUP(A320,Min_Tests!A:AB,2,FALSE)","v":181},null,{"$f":"VLOOKUP(A320,Min_Tests!A:AB,5,FALSE)","v":6177},6177,"U2B","U2B","Sulfur Dioxide",0.55000000000000004,"lb/MMBtu",5.6842969776609724,"lb/MW","Part II","6"]
["6177_U2B",{"$f":"VLOOKUP(A321,Min_Tests!A:AB,2,FALSE)","v":181},null,{"$f":"VLOOKUP(A321,Min_Tests!A:AB,5,FALSE)","v":6177},6177,"U2B","U2B","Sulfur Dioxide",0.63,"lb/MMBtu",6.5111038107752952,"lb/MW","Part II","8"]
[{"$f":"E322&\"_\"&F322","v":"2378_2"},{"$f":"VLOOKUP(A322,Min_Tests!A:AB,2,FALSE)","v":182},null,{"$f":"VLOOKUP(A322,Min_Tests!A:AB,5,FALSE)","v":2378},2378,"2","2 Coal w or w/o TDF","Sulfur Dioxide",0.30993224462365587,"lb/MMBtu",2.9640860215053757,"lb/MW","Part II","CAM 238-026"]
["2378_2",{"$f":"VLOOKUP(A323,Min_Tests!A:AB,2,FALSE)","v":182},null,{"$f":"VLOOKUP(A323,Min_Tests!A:AB,5,FALSE)","v":2378},2378,"2","2 Coal w or w/o TDF","Sulfur Dioxide",0.51498383926499602,"lb/MMBtu",4.9251293653556099,"lb/MW","Part II","CAM 238-015"]
["6177_U1B",{"$f":"VLOOKUP(A324,Min_Tests!A:AB,2,FALSE)","v":183},null,{"$f":"VLOOKUP(A324,Min_Tests!A:AB,5,FALSE)","v":6177},6177,"U1B","U1B","Sulfur Dioxide",0.28999999999999998,"lb/MMBtu",2.9971747700394213,"lb/MW","Part II","1"]
["6177_U1B",{"$f":"VLOOKUP(A325,Min_Tests!A:AB,2,FALSE)","v":183},null,{"$f":"VLOOKUP(A325,Min_Tests!A:AB,5,FALSE)","v":6177},6177,"U1B","U1B","Sulfur Dioxide",0.31,"lb/MMBtu",3.2038764783180023,"lb/MW","Part II","5"]
["6177_U1B",{"$f":"VLOOKUP(A326,Min_Tests!A:AB,2,FALSE)","v":183},null,{"$f":"VLOOKUP(A326,Min_Tests!A:AB,5,FALSE)","v":6177},6177,"U1B","U1B","Sulfur Dioxide",0.36,"lb/MMBtu",3.7206307490144543,"lb/MW","Part II","2"]
["6177_U1B",{"$f":"VLOOKUP(A327,Min_Tests!A:AB,2,FALSE)","v":183},null,{"$f":"VLOOKUP(A327,Min_Tests!A:AB,5,FALSE)","v":6177},6177,"U1B","U1B","Sulfur Dioxide",0.47,"lb/MMBtu",4.8574901445466487,"lb/MW","Part II","4"]
["6177_U1B",{"$f":"VLOOKUP(A328,Min_Tests!A:AB,2,FALSE)","v":183},null,{"$f":"VLOOKUP(A328,Min_Tests!A:AB,5,FALSE)","v":6177},6177,"U1B","U1B","Sulfur Dioxide",0.48,"lb/MMBtu",4.9608409986859385,"lb/MW","Part II","3"]
["3161_2",{"$f":"VLOOKUP(A329,Min_Tests!A:AB,2,FALSE)","v":184},null,{"$f":"VLOOKUP(A329,Min_Tests!A:AB,5,FALSE)","v":3161},3161,"2","Unit 2","Sulfur Dioxide",0.38019999999999998,"lb/MMBtu",3.149267256637168,"lb/MW","CEMS",""]
["6085_18",{"$f":"VLOOKUP(A330,Min_Tests!A:AB,2,FALSE)","v":185},null,{"$f":"VLOOKUP(A330,Min_Tests!A:AB,5,FALSE)","v":6085},6085,"18","R.M.0018","Sulfur Dioxide",0.31636356854335479,"lb/MMBtu",3.1934205506653646,"lb/MW","ERT",""]
["3130_1",{"$f":"VLOOKUP(A331,Min_Tests!A:AB,2,FALSE)","v":186},null,{"$f":"VLOOKUP(A331,Min_Tests!A:AB,5,FALSE)","v":3130},3130,"1","SEW-1","Sulfur Dioxide",0.33537253472545636,"lb/MMBtu",3.5543755817056915,"lb/MW","ERT",""]
["3130_2",{"$f":"VLOOKUP(A332,Min_Tests!A:AB,2,FALSE)","v":187},null,{"$f":"VLOOKUP(A332,Min_Tests!A:AB,5,FALSE)","v":3130},3130,"2","SEW-1","Sulfur Dioxide",0.33537253472545636,"lb/MMBtu",3.5543755817056915,"lb/MW","ERT",""]
["8219_1",{"$f":"VLOOKUP(A333,Min_Tests!A:AB,2,FALSE)","v":188},null,{"$f":"VLOOKUP(A333,Min_Tests!A:AB,5,FALSE)","v":8219},8219,"1","Unit 1","Sulfur Dioxide",0.39066666666666672,"lb/MMBtu",3.6375407407407416,"lb/MW","Part II","Airtech 2341"]
["6019_1",{"$f":"VLOOKUP(A334,Min_Tests!A:AB,2,FALSE)","v":189},null,{"$f":"VLOOKUP(A334,Min_Tests!A:AB,5,FALSE)","v":6019},6019,"1","1","Sulfur Dioxide",0.40490067388679246,"lb/MMBtu",3.6395049209596912,"lb/MW","ERT",""]
["3136_2",{"$f":"VLOOKUP(A335,Min_Tests!A:AB,2,FALSE)","v":190},null,{"$f":"VLOOKUP(A335,Min_Tests!A:AB,5,FALSE)","v":3136},3136,"2","KEY-2-4","Sulfur Dioxide",0.39333333333333331,"lb/MMBtu",3.6538817663817662,"lb/MW","Part II","K206-2"]
["50039_001",{"$f":"VLOOKUP(A336,Min_Tests!A:AB,2,FALSE)","v":191},null,{"$f":"VLOOKUP(A336,Min_Tests!A:AB,5,FALSE)","v":50039},50039,"001","001","Sulfur Dioxide",0.25912594783514392,"lb/MMBtu",3.685843223517133,"lb/MW","ERT",""]
["2554_4",{"$f":"VLOOKUP(A337,Min_Tests!A:AB,2,FALSE)","v":192},null,{"$f":"VLOOKUP(A337,Min_Tests!A:AB,5,FALSE)","v":2554},2554,"4","4","Sulfur Dioxide",0.40713586621785885,"lb/MMBtu",3.8333407711589174,"lb/MW","ERT",""]
["3140_2",{"$f":"VLOOKUP(A338,Min_Tests!A:AB,2,FALSE)","v":193},null,{"$f":"VLOOKUP(A338,Min_Tests!A:AB,5,FALSE)","v":3140},3140,"2","U2","Sulfur Dioxide",0.40277115279491854,"lb/MMBtu",3.8842307101596467,"lb/MW","ERT",""]
["3136_1",{"$f":"VLOOKUP(A339,Min_Tests!A:AB,2,FALSE)","v":194},null,{"$f":"VLOOKUP(A339,Min_Tests!A:AB,5,FALSE)","v":3136},3136,"1","KEY-1-4","Sulfur Dioxide",0.42016666666666663,"lb/MMBtu",3.9031508190883191,"lb/MW","Part II","K-205"]
["3140_1",{"$f":"VLOOKUP(A340,Min_Tests!A:AB,2,FALSE)","v":195},null,{"$f":"VLOOKUP(A340,Min_Tests!A:AB,5,FALSE)","v":3140},3140,"1","U1","Sulfur Dioxide",0.40277115279491854,"lb/MMBtu",4.0826348669666741,"lb/MW","ERT",""]
["2535_1",{"$f":"VLOOKUP(A341,Min_Tests!A:AB,2,FALSE)","v":196},null,{"$f":"VLOOKUP(A341,Min_Tests!A:AB,5,FALSE)","v":2535},2535,"1","Unit_1","Sulfur Dioxide",0.45856666666666673,"lb/MMBtu",4.087954065040651,"lb/MW","CEMS",""]
["10113_CFB1",{"$f":"VLOOKUP(A342,Min_Tests!A:AB,2,FALSE)","v":197},null,{"$f":"VLOOKUP(A342,Min_Tests!A:AB,5,FALSE)","v":10113},10113,"CFB1","CFB1","Sulfur Dioxide",0.34643133768651119,"lb/MMBtu",4.0941885362951327,"lb/MW","ERT",""]
["10113_CFB2",{"$f":"VLOOKUP(A343,Min_Tests!A:AB,2,FALSE)","v":198},null,{"$f":"VLOOKUP(A343,Min_Tests!A:AB,5,FALSE)","v":10113},10113,"CFB2","CFB2","Sulfur Dioxide",0.34643133768651119,"lb/MMBtu",4.0941885362951327,"lb/MW","ERT",""]
["3149_1",{"$f":"VLOOKUP(A344,Min_Tests!A:AB,2,FALSE)","v":199},null,{"$f":"VLOOKUP(A344,Min_Tests!A:AB,5,FALSE)","v":3149},3149,"1","U1","Sulfur Dioxide",0.45804453827123409,"lb/MMBtu",4.1603317597810081,"lb/MW","ERT",""]
["10641_B1",{"$f":"VLOOKUP(A345,Min_Tests!A:AB,2,FALSE)","v":200},null,{"$f":"VLOOKUP(A345,Min_Tests!A:AB,5,FALSE)","v":10641},10641,"B1","001","Sulfur Dioxide",0.37532674624343593,"lb/MMBtu",4.2894485284964103,"lb/MW","ERT",""]
["1250_3",{"$f":"VLOOKUP(A346,Min_Tests!A:AB,2,FALSE)","v":201},null,{"$f":"VLOOKUP(A346,Min_Tests!A:AB,5,FALSE)","v":1250},1250,"3","3","Sulfur Dioxide",0.39750000000000002,"lb/MMBtu",4.4204741379310351,"lb/MW","ETTS",""]
["1250_3",{"$f":"VLOOKUP(A347,Min_Tests!A:AB,2,FALSE)","v":201},null,{"$f":"VLOOKUP(A347,Min_Tests!A:AB,5,FALSE)","v":1250},1250,"3","3","Sulfur Dioxide",233.32529032819443,"lb/MMBtu",2594.7381424428522,"lb/MW","CEMS",""]
["2554_1",{"$f":"VLOOKUP(A348,Min_Tests!A:AB,2,FALSE)","v":202},null,{"$f":"VLOOKUP(A348,Min_Tests!A:AB,5,FALSE)","v":2554},2554,"1","1","Sulfur Dioxide",0.40825745061659663,"lb/MMBtu",4.4293531877485339,"lb/MW","ERT",""]
["6139_1",{"$f":"VLOOKUP(A349,Min_Tests!A:AB,2,FALSE)","v":203},null,{"$f":"VLOOKUP(A349,Min_Tests!A:AB,5,FALSE)","v":6139},6139,"1","WE-1","Sulfur Dioxide",0.47975000000000007,"lb/MMBtu",4.4329587813620073,"lb/MW","CEMS",""]
["891_Boiler 9",{"$f":"VLOOKUP(A350,Min_Tests!A:AB,2,FALSE)","v":204},null,{"$f":"VLOOKUP(A350,Min_Tests!A:AB,5,FALSE)","v":891},891,"Boiler 9","Boiler 9","Sulfur Dioxide",0.43072413793103448,"lb/MMBtu",4.5042461825220448,"lb/MW","CEMS",""]
["10743_CFB1",{"$f":"VLOOKUP(A351,Min_Tests!A:AB,2,FALSE)","v":205},null,{"$f":"VLOOKUP(A351,Min_Tests!A:AB,5,FALSE)","v":10743},10743,"CFB1","Unit 1&2","Sulfur Dioxide",0.29464176906827866,"lb/MMBtu",4.6228277560712687,"lb/MW","ERT",""]
["10743_CFB2",{"$f":"VLOOKUP(A352,Min_Tests!A:AB,2,FALSE)","v":206},null,{"$f":"VLOOKUP(A352,Min_Tests!A:AB,5,FALSE)","v":10743},10743,"CFB2","Unit 1&2","Sulfur Dioxide",0.29464176906827866,"lb/MMBtu",4.6228277560712687,"lb/MW","ERT",""]
["884_4",{"$f":"VLOOKUP(A353,Min_Tests!A:AB,2,FALSE)","v":207},null,{"$f":"VLOOKUP(A353,Min_Tests!A:AB,5,FALSE)","v":884},884,"4","WC4CONFIG","Sulfur Dioxide",0.47749999999999992,"lb/MMBtu",4.6292215405904065,"lb/MW","CEMS",""]
["50974_#1 CFB boiler",{"$f":"VLOOKUP(A354,Min_Tests!A:AB,2,FALSE)","v":208},null,{"$f":"VLOOKUP(A354,Min_Tests!A:AB,5,FALSE)","v":50974},50974,"#1 CFB boiler","Gen 1","Sulfur Dioxide",0.36757015513489266,"lb/MMBtu",4.7367288032846995,"lb/MW","ERT",""]
["50974_#2 CFB Boiler",{"$f":"VLOOKUP(A355,Min_Tests!A:AB,2,FALSE)","v":209},null,{"$f":"VLOOKUP(A355,Min_Tests!A:AB,5,FALSE)","v":50974},50974,"#2 CFB Boiler","Gen 1","Sulfur Dioxide",0.36757015513489266,"lb/MMBtu",4.7367288032846995,"lb/MW","ERT",""]
["874_5",{"$f":"VLOOKUP(A356,Min_Tests!A:AB,2,FALSE)","v":210},null,{"$f":"VLOOKUP(A356,Min_Tests!A:AB,5,FALSE)","v":874},874,"5","JOL5 CONFIG","Sulfur Dioxide",0.43349999999999994,"lb/MMBtu",4.750386082822085,"lb/MW","CEMS",""]
["6288_001",{"$f":"VLOOKUP(A357,Min_Tests!A:AB,2,FALSE)","v":211},null,{"$f":"VLOOKUP(A357,Min_Tests!A:AB,5,FALSE)","v":6288},6288,"001","1","Sulfur Dioxide",0.34595441962872497,"lb/MMBtu",4.8018473444467027,"lb/MW","ERT",""]
["10671_1A",{"$f":"VLOOKUP(A358,Min_Tests!A:AB,2,FALSE)","v":212},null,{"$f":"VLOOKUP(A358,Min_Tests!A:AB,5,FALSE)","v":10671},10671,"1A","Unit 1","Sulfur Dioxide",0.34833333333333338,"lb/MMBtu",4.8350192188363463,"lb/MW","CEMS",""]
["10671_1b",{"$f":"VLOOKUP(A359,Min_Tests!A:AB,2,FALSE)","v":213},null,{"$f":"VLOOKUP(A359,Min_Tests!A:AB,5,FALSE)","v":10671},10671,"1b","Unit 1","Sulfur Dioxide",0.34833333333333338,"lb/MMBtu",4.8350192188363463,"lb/MW","CEMS",""]
["10671_2a",{"$f":"VLOOKUP(A360,Min_Tests!A:AB,2,FALSE)","v":214},null,{"$f":"VLOOKUP(A360,Min_Tests!A:AB,5,FALSE)","v":10671},10671,"2a","Unit 2","Sulfur Dioxide",0.34833333333333338,"lb/MMBtu",4.8350192188363463,"lb/MW","CEMS",""]
["10671_2b",{"$f":"VLOOKUP(A361,Min_Tests!A:AB,2,FALSE)","v":215},null,{"$f":"VLOOKUP(A361,Min_Tests!A:AB,5,FALSE)","v":10671},10671,"2b","Unit 2","Sulfur Dioxide",0.34833333333333338,"lb/MMBtu",4.8350192188363463,"lb/MW","CEMS",""]
["976_123",{"$f":"VLOOKUP(A362,Min_Tests!A:AB,2,FALSE)","v":216},null,{"$f":"VLOOKUP(A362,Min_Tests!A:AB,5,FALSE)","v":976},976,"123","123","Sulfur Dioxide",0.47881682015825494,"lb/MMBtu",4.9876752099818225,"lb/MW","ERT",""]
["10641_B2",{"$f":"VLOOKUP(A363,Min_Tests!A:AB,2,FALSE)","v":217},null,{"$f":"VLOOKUP(A363,Min_Tests!A:AB,5,FALSE)","v":10641},10641,"B2","002","Sulfur Dioxide",0.44677576216328202,"lb/MMBtu",5.1060087104375089,"lb/MW","ERT",""]
["2963_3313",{"$f":"VLOOKUP(A364,Min_Tests!A:AB,2,FALSE)","v":218},null,{"$f":"VLOOKUP(A364,Min_Tests!A:AB,5,FALSE)","v":2963},2963,"3313","NE-3","Sulfur Dioxide",0.52496153846153837,"lb/MMBtu",5.1156966248037667,"lb/MW","CEMS",""]
["2824_1",{"$f":"VLOOKUP(A365,Min_Tests!A:AB,2,FALSE)","v":219},null,{"$f":"VLOOKUP(A365,Min_Tests!A:AB,5,FALSE)","v":2824},2824,"1","u1","Sulfur Dioxide",0.37624331130273792,"lb/MMBtu",5.1305906086736988,"lb/MW","Part II","2006 RATA B"]
["2824_1",{"$f":"VLOOKUP(A366,Min_Tests!A:AB,2,FALSE)","v":219},null,{"$f":"VLOOKUP(A366,Min_Tests!A:AB,5,FALSE)","v":2824},2824,"1","u1","Sulfur Dioxide",0.37903254455333041,"lb/MMBtu",5.1686256075454144,"lb/MW","Part II","2006 RATA B"]
["2824_1",{"$f":"VLOOKUP(A367,Min_Tests!A:AB,2,FALSE)","v":219},null,{"$f":"VLOOKUP(A367,Min_Tests!A:AB,5,FALSE)","v":2824},2824,"1","u1","Sulfur Dioxide",0.47379068069166264,"lb/MMBtu",6.460782009431763,"lb/MW","Part II","RATA 2009"]
["2824_1",{"$f":"VLOOKUP(A368,Min_Tests!A:AB,2,FALSE)","v":219},null,{"$f":"VLOOKUP(A368,Min_Tests!A:AB,5,FALSE)","v":2824},2824,"1","u1","Sulfur Dioxide",0.47674666158223628,"lb/MMBtu",6.5010908397577678,"lb/MW","Part II","RATA 2008"]
["2824_1",{"$f":"VLOOKUP(A369,Min_Tests!A:AB,2,FALSE)","v":219},null,{"$f":"VLOOKUP(A369,Min_Tests!A:AB,5,FALSE)","v":2824},2824,"1","u1","Sulfur Dioxide",0.48963170648986415,"lb/MMBtu",6.676795997589057,"lb/MW","Part II","RATA 2009"]
["2824_1",{"$f":"VLOOKUP(A370,Min_Tests!A:AB,2,FALSE)","v":219},null,{"$f":"VLOOKUP(A370,Min_Tests!A:AB,5,FALSE)","v":2824},2824,"1","u1","Sulfur Dioxide",0.49373976198394381,"lb/MMBtu",6.7328149361446883,"lb/MW","Part II","RATA 2008"]
["2824_1",{"$f":"VLOOKUP(A371,Min_Tests!A:AB,2,FALSE)","v":219},null,{"$f":"VLOOKUP(A371,Min_Tests!A:AB,5,FALSE)","v":2824},2824,"1","u1","Sulfur Dioxide",0.51024777834206969,"lb/MMBtu",6.9579242501191327,"lb/MW","Part II","RATA 2005"]
["2824_1",{"$f":"VLOOKUP(A372,Min_Tests!A:AB,2,FALSE)","v":219},null,{"$f":"VLOOKUP(A372,Min_Tests!A:AB,5,FALSE)","v":2824},2824,"1","u1","Sulfur Dioxide",0.52263860234913073,"lb/MMBtu",7.1268900320336011,"lb/MW","Part II","RATA 2005"]
["2824_1",{"$f":"VLOOKUP(A373,Min_Tests!A:AB,2,FALSE)","v":219},null,{"$f":"VLOOKUP(A373,Min_Tests!A:AB,5,FALSE)","v":2824},2824,"1","u1","Sulfur Dioxide",0.56178795797258096,"lb/MMBtu",7.6607448814442858,"lb/MW","Part II","2006 RATA A"]
["2824_1",{"$f":"VLOOKUP(A374,Min_Tests!A:AB,2,FALSE)","v":219},null,{"$f":"VLOOKUP(A374,Min_Tests!A:AB,5,FALSE)","v":2824},2824,"1","u1","Sulfur Dioxide",0.61592788489916173,"lb/MMBtu",8.3990166122612973,"lb/MW","Part II","2006 RATA A"]
["2824_1",{"$f":"VLOOKUP(A375,Min_Tests!A:AB,2,FALSE)","v":219},null,{"$f":"VLOOKUP(A375,Min_Tests!A:AB,5,FALSE)","v":2824},2824,"1","u1","Sulfur Dioxide",0.62340879038376629,"lb/MMBtu",8.5010289597786315,"lb/MW","Part II","RATA 2007"]
["2824_1",{"$f":"VLOOKUP(A376,Min_Tests!A:AB,2,FALSE)","v":219},null,{"$f":"VLOOKUP(A376,Min_Tests!A:AB,5,FALSE)","v":2824},2824,"1","u1","Sulfur Dioxide",0.67517635315970714,"lb/MMBtu",9.2069502703596431,"lb/MW","Part II","RATA 2007"]
["4078_3",{"$f":"VLOOKUP(A377,Min_Tests!A:AB,2,FALSE)","v":220},null,{"$f":"VLOOKUP(A377,Min_Tests!A:AB,5,FALSE)","v":4078},4078,"3","W3","Sulfur Dioxide",0.56486666666666663,"lb/MMBtu",5.2894139387308527,"lb/MW","CEMS",""]
["465_4",{"$f":"VLOOKUP(A378,Min_Tests!A:AB,2,FALSE)","v":221},null,{"$f":"VLOOKUP(A378,Min_Tests!A:AB,5,FALSE)","v":465},465,"4","Unit 4","Sulfur Dioxide",0.3697593387425,"lb/MMBtu",5.3564967258171992,"lb/MW","ETTS",""]
["465_4",{"$f":"VLOOKUP(A379,Min_Tests!A:AB,2,FALSE)","v":221},null,{"$f":"VLOOKUP(A379,Min_Tests!A:AB,5,FALSE)","v":465},465,"4","Unit 4","Sulfur Dioxide",0.38799999999999996,"lb/MMBtu",5.6207389830508472,"lb/MW","CEMS",""]
["6166_MB2",{"$f":"VLOOKUP(A380,Min_Tests!A:AB,2,FALSE)","v":222},null,{"$f":"VLOOKUP(A380,Min_Tests!A:AB,5,FALSE)","v":6166},6166,"MB2","RP-2","Sulfur Dioxide",0.57263333333333322,"lb/MMBtu",5.3680036868686862,"lb/MW","CEMS",""]
["469_2",{"$f":"VLOOKUP(A381,Min_Tests!A:AB,2,FALSE)","v":223},null,{"$f":"VLOOKUP(A381,Min_Tests!A:AB,5,FALSE)","v":469},469,"2","Unit 2","Sulfur Dioxide",0.44218137887333331,"lb/MMBtu",5.3992673630849124,"lb/MW","ETTS",""]
["469_2",{"$f":"VLOOKUP(A382,Min_Tests!A:AB,2,FALSE)","v":223},null,{"$f":"VLOOKUP(A382,Min_Tests!A:AB,5,FALSE)","v":469},469,"2","Unit 2","Sulfur Dioxide",0.52592592592592591,"lb/MMBtu",6.4218323586744637,"lb/MW","CEMS",""]
["3403_2",{"$f":"VLOOKUP(A383,Min_Tests!A:AB,2,FALSE)","v":224},null,{"$f":"VLOOKUP(A383,Min_Tests!A:AB,5,FALSE)","v":3403},3403,"2","2","Sulfur Dioxide",0.59524106261296883,"lb/MMBtu",5.4563764072855472,"lb/MW","ERT",""]
["10143_AAB01",{"$f":"VLOOKUP(A384,Min_Tests!A:AB,2,FALSE)","v":225},null,{"$f":"VLOOKUP(A384,Min_Tests!A:AB,5,FALSE)","v":10143},10143,"AAB01","AAB01","Sulfur Dioxide",0.5969738757427816,"lb/MMBtu",5.4866911938496878,"lb/MW","ERT",""]
["1374_1374",{"$f":"VLOOKUP(A385,Min_Tests!A:AB,2,FALSE)","v":226},null,{"$f":"VLOOKUP(A385,Min_Tests!A:AB,5,FALSE)","v":1374},1374,"1374","Unit001","Sulfur Dioxide",0.67907279778766672,"lb/MMBtu",5.6327140729879126,"lb/MW","CEMS",""]
[{"$f":"E386&\"_\"&F386","v":"1374_1374-2"},{"$f":"VLOOKUP(A386,Min_Tests!A:AB,2,FALSE)","v":227},null,{"$f":"VLOOKUP(A386,Min_Tests!A:AB,5,FALSE)","v":1374},1374,"1374-2","Unit001","Sulfur Dioxide",0.67907279778766672,"lb/MMBtu",5.6327140729879126,"lb/MW","CEMS",""]
["887_1",{"$f":"VLOOKUP(A387,Min_Tests!A:AB,2,FALSE)","v":228},null,{"$f":"VLOOKUP(A387,Min_Tests!A:AB,5,FALSE)","v":887},887,"1","1","Sulfur Dioxide",0.58319999999999994,"lb/MMBtu",5.7270049099836324,"lb/MW","CEMS",""]
["469_1",{"$f":"VLOOKUP(A388,Min_Tests!A:AB,2,FALSE)","v":229},null,{"$f":"VLOOKUP(A388,Min_Tests!A:AB,5,FALSE)","v":469},469,"1","Unit 1","Sulfur Dioxide",0.48371148998999997,"lb/MMBtu",5.7549264450092306,"lb/MW","ETTS",""]
["469_1",{"$f":"VLOOKUP(A389,Min_Tests!A:AB,2,FALSE)","v":229},null,{"$f":"VLOOKUP(A389,Min_Tests!A:AB,5,FALSE)","v":469},469,"1","Unit 1","Sulfur Dioxide",0.51596153846153847,"lb/MMBtu",6.1386193293885603,"lb/MW","CEMS",""]
["883_8",{"$f":"VLOOKUP(A390,Min_Tests!A:AB,2,FALSE)","v":230},null,{"$f":"VLOOKUP(A390,Min_Tests!A:AB,5,FALSE)","v":883},883,"8","WK8CONFIG","Sulfur Dioxide",0.56689999999999996,"lb/MMBtu",5.8627406652741509,"lb/MW","CEMS",""]
["6073_1",{"$f":"VLOOKUP(A391,Min_Tests!A:AB,2,FALSE)","v":231},null,{"$f":"VLOOKUP(A391,Min_Tests!A:AB,5,FALSE)","v":6073},6073,"1","Unit 1","Sulfur Dioxide",0.60799999999999998,"lb/MMBtu",5.8946630316573554,"lb/MW","Part II","Unit 1 NOX and SO2 Oct 08"]
["6073_1",{"$f":"VLOOKUP(A392,Min_Tests!A:AB,2,FALSE)","v":231},null,{"$f":"VLOOKUP(A392,Min_Tests!A:AB,5,FALSE)","v":6073},6073,"1","Unit 1","Sulfur Dioxide",0.67200000000000004,"lb/MMBtu",6.5151538770949724,"lb/MW","Part II","Unit 1 NOX and SO2 Sept 05"]
["6073_1",{"$f":"VLOOKUP(A393,Min_Tests!A:AB,2,FALSE)","v":231},null,{"$f":"VLOOKUP(A393,Min_Tests!A:AB,5,FALSE)","v":6073},6073,"1","Unit 1","Sulfur Dioxide",0.748,"lb/MMBtu",7.2519867560521414,"lb/MW","Part II","Unit 1 NOX and SO2 Aug 06"]
["2161_4",{"$f":"VLOOKUP(A394,Min_Tests!A:AB,2,FALSE)","v":232},null,{"$f":"VLOOKUP(A394,Min_Tests!A:AB,5,FALSE)","v":2161},2161,"4","Unit_4_JRPS","Sulfur Dioxide",0.59609999999999996,"lb/MMBtu",5.9609999999999994,"lb/MW","CEMS",""]
["2535_2",{"$f":"VLOOKUP(A395,Min_Tests!A:AB,2,FALSE)","v":233},null,{"$f":"VLOOKUP(A395,Min_Tests!A:AB,5,FALSE)","v":2535},2535,"2","Unit_2","Sulfur Dioxide",0.72806666666666664,"lb/MMBtu",6.2839087301587302,"lb/MW","CEMS",""]
["1393_6",{"$f":"VLOOKUP(A396,Min_Tests!A:AB,2,FALSE)","v":234},null,{"$f":"VLOOKUP(A396,Min_Tests!A:AB,5,FALSE)","v":1393},1393,"6","001","Sulfur Dioxide",0.64056246334668954,"lb/MMBtu",6.3625523298970323,"lb/MW","ERT",""]
["47_3",{"$f":"VLOOKUP(A397,Min_Tests!A:AB,2,FALSE)","v":235},null,{"$f":"VLOOKUP(A397,Min_Tests!A:AB,5,FALSE)","v":47},47,"3","3","Sulfur Dioxide",0.60787809417848948,"lb/MMBtu",6.4465471887628816,"lb/MW","ERT",""]
["465_3",{"$f":"VLOOKUP(A398,Min_Tests!A:AB,2,FALSE)","v":236},null,{"$f":"VLOOKUP(A398,Min_Tests!A:AB,5,FALSE)","v":465},465,"3","Unit 3","Sulfur Dioxide",0.41341018914,"lb/MMBtu",6.5008752242265002,"lb/MW","ETTS",""]
["465_3",{"$f":"VLOOKUP(A399,Min_Tests!A:AB,2,FALSE)","v":236},null,{"$f":"VLOOKUP(A399,Min_Tests!A:AB,5,FALSE)","v":465},465,"3","Unit 3","Sulfur Dioxide",0.50068181818181823,"lb/MMBtu",7.8732215909090915,"lb/MW","CEMS",""]
["4072_8",{"$f":"VLOOKUP(A400,Min_Tests!A:AB,2,FALSE)","v":237},null,{"$f":"VLOOKUP(A400,Min_Tests!A:AB,5,FALSE)","v":4072},4072,"8","8","Sulfur Dioxide",0.60706666666666675,"lb/MMBtu",6.6473579888808327,"lb/MW","CEMS",""]
["2049_4",{"$f":"VLOOKUP(A401,Min_Tests!A:AB,2,FALSE)","v":238},null,{"$f":"VLOOKUP(A401,Min_Tests!A:AB,5,FALSE)","v":2049},2049,"4","Unit 4","Sulfur Dioxide",0.77900000000000003,"lb/MMBtu",6.9388957600000012,"lb/MW","Part II","Unit 4 RATA Test Report ‐ June 19, 2007"]
["2049_4",{"$f":"VLOOKUP(A402,Min_Tests!A:AB,2,FALSE)","v":238},null,{"$f":"VLOOKUP(A402,Min_Tests!A:AB,5,FALSE)","v":2049},2049,"4","Unit 4","Sulfur Dioxide",0.93200000000000005,"lb/MMBtu",8.301734080000001,"lb/MW","Part II","Unit 4 RATA Test Report ‐ June 20‐21, 2005"]
["2049_4",{"$f":"VLOOKUP(A403,Min_Tests!A:AB,2,FALSE)","v":238},null,{"$f":"VLOOKUP(A403,Min_Tests!A:AB,5,FALSE)","v":2049},2049,"4","Unit 4","Sulfur Dioxide",0.94199999999999995,"lb/MMBtu",8.3908084800000005,"lb/MW","Part II","Unit 4 RATA Test Report ‐ June 30, 2009"]
["2049_4",{"$f":"VLOOKUP(A404,Min_Tests!A:AB,2,FALSE)","v":238},null,{"$f":"VLOOKUP(A404,Min_Tests!A:AB,5,FALSE)","v":2049},2049,"4","Unit 4","Sulfur Dioxide",1.0367999999999999,"lb/MMBtu",9.2352337920000007,"lb/MW","Part II","Unit 4 RATA Test Report ‐ June 3, 2008"]
["2049_4",{"$f":"VLOOKUP(A405,Min_Tests!A:AB,2,FALSE)","v":238},null,{"$f":"VLOOKUP(A405,Min_Tests!A:AB,5,FALSE)","v":2049},2049,"4","Unit 4","Sulfur Dioxide",1.0860000000000001,"lb/MMBtu",9.6734798400000024,"lb/MW","Part II","Unit 4 RATA Test Report ‐ June 26, 2006"]
["8224_1",{"$f":"VLOOKUP(A406,Min_Tests!A:AB,2,FALSE)","v":239},null,{"$f":"VLOOKUP(A406,Min_Tests!A:AB,5,FALSE)","v":8224},8224,"1","1","Sulfur Dioxide",0.67,"lb/MMBtu",7.0439425051334705,"lb/MW","Part II","U1_2008_COMPLIANCE"]
["8224_1",{"$f":"VLOOKUP(A407,Min_Tests!A:AB,2,FALSE)","v":239},null,{"$f":"VLOOKUP(A407,Min_Tests!A:AB,5,FALSE)","v":8224},8224,"1","1","Sulfur Dioxide",0.76600000000000001,"lb/MMBtu",8.0532238193018486,"lb/MW","Part II","U1_2009_COMPLIANCE"]
["8224_1",{"$f":"VLOOKUP(A408,Min_Tests!A:AB,2,FALSE)","v":239},null,{"$f":"VLOOKUP(A408,Min_Tests!A:AB,5,FALSE)","v":8224},8224,"1","1","Sulfur Dioxide",0.83,"lb/MMBtu",8.7260780287474322,"lb/MW","Part II","U1_2007_COMPLIANCE"]
["1943_002",{"$f":"VLOOKUP(A409,Min_Tests!A:AB,2,FALSE)","v":240},null,{"$f":"VLOOKUP(A409,Min_Tests!A:AB,5,FALSE)","v":1943},1943,"002","2","Sulfur Dioxide",0.57276666666666665,"lb/MMBtu",7.0505972542559032,"lb/MW","CEMS",""]
["6073_2",{"$f":"VLOOKUP(A410,Min_Tests!A:AB,2,FALSE)","v":241},null,{"$f":"VLOOKUP(A410,Min_Tests!A:AB,5,FALSE)","v":6073},6073,"2","Unit 2","Sulfur Dioxide",0.74,"lb/MMBtu",7.1331692537313431,"lb/MW","Part II","Unit 2 NOX and SO2 Sept 05"]
["6073_2",{"$f":"VLOOKUP(A411,Min_Tests!A:AB,2,FALSE)","v":241},null,{"$f":"VLOOKUP(A411,Min_Tests!A:AB,5,FALSE)","v":6073},6073,"2","Unit 2","Sulfur Dioxide",0.82,"lb/MMBtu",7.9043226865671636,"lb/MW","Part II","Unit 2 NOX and SO2 Aug 06"]
["6073_2",{"$f":"VLOOKUP(A412,Min_Tests!A:AB,2,FALSE)","v":241},null,{"$f":"VLOOKUP(A412,Min_Tests!A:AB,5,FALSE)","v":6073},6073,"2","Unit 2","Sulfur Dioxide",0.86499999999999999,"lb/MMBtu",8.3380964925373142,"lb/MW","Part II","Unit 2 NOX and SO2 Sept 08"]
["60_1",{"$f":"VLOOKUP(A413,Min_Tests!A:AB,2,FALSE)","v":242},null,{"$f":"VLOOKUP(A413,Min_Tests!A:AB,5,FALSE)","v":60},60,"1","1","Sulfur Dioxide",0.70876122842824418,"lb/MMBtu",7.1647621309175742,"lb/MW","ERT",""]
["54144_BRBR1",{"$f":"VLOOKUP(A414,Min_Tests!A:AB,2,FALSE)","v":243},null,{"$f":"VLOOKUP(A414,Min_Tests!A:AB,5,FALSE)","v":54144},54144,"BRBR1","BRBRI","Sulfur Dioxide",0.57840271237535623,"lb/MMBtu",7.2300339046919531,"lb/MW","ERT",""]
["54144_BRBR1",{"$f":"VLOOKUP(A415,Min_Tests!A:AB,2,FALSE)","v":243},null,{"$f":"VLOOKUP(A415,Min_Tests!A:AB,5,FALSE)","v":54144},54144,"BRBR1","BRBRI","Sulfur Dioxide",0.66,"lb/MMBtu",8.25,"lb/MW","Part II","RATA2006"]
["54144_BRBR1",{"$f":"VLOOKUP(A416,Min_Tests!A:AB,2,FALSE)","v":243},null,{"$f":"VLOOKUP(A416,Min_Tests!A:AB,5,FALSE)","v":54144},54144,"BRBR1","BRBRI","Sulfur Dioxide",0.69,"lb/MMBtu",8.625,"lb/MW","Part II","RATA2007"]
["1241_2",{"$f":"VLOOKUP(A417,Min_Tests!A:AB,2,FALSE)","v":244},null,{"$f":"VLOOKUP(A417,Min_Tests!A:AB,5,FALSE)","v":1241},1241,"2","2","Sulfur Dioxide",0.68767539826049229,"lb/MMBtu",7.7300738198624677,"lb/MW","ERT",""]
["3775_1",{"$f":"VLOOKUP(A418,Min_Tests!A:AB,2,FALSE)","v":245},null,{"$f":"VLOOKUP(A418,Min_Tests!A:AB,5,FALSE)","v":3775},3775,"1","CR-1","Sulfur Dioxide",0.86496666666666655,"lb/MMBtu",7.9009063913043471,"lb/MW","CEMS",""]
["6085_14",{"$f":"VLOOKUP(A419,Min_Tests!A:AB,2,FALSE)","v":246},null,{"$f":"VLOOKUP(A419,Min_Tests!A:AB,5,FALSE)","v":6085},6085,"14","R.M.0014","Sulfur Dioxide",0.81867597602959463,"lb/MMBtu",8.1342805310632809,"lb/MW","ERT",""]
["2049_5",{"$f":"VLOOKUP(A420,Min_Tests!A:AB,2,FALSE)","v":247},null,{"$f":"VLOOKUP(A420,Min_Tests!A:AB,5,FALSE)","v":2049},2049,"5","Unit 5","Sulfur Dioxide",0.87860000000000005,"lb/MMBtu",8.3517255920000011,"lb/MW","Part II","Unit 5 RATA Test Report ‐ June 29, 2009"]
["2049_5",{"$f":"VLOOKUP(A421,Min_Tests!A:AB,2,FALSE)","v":247},null,{"$f":"VLOOKUP(A421,Min_Tests!A:AB,5,FALSE)","v":2049},2049,"5","Unit 5","Sulfur Dioxide",1.0027999999999999,"lb/MMBtu",9.5323360159999986,"lb/MW","Part II","Unit 5 RATA Test Report ‐ July 26, 2007"]
["2049_5",{"$f":"VLOOKUP(A422,Min_Tests!A:AB,2,FALSE)","v":247},null,{"$f":"VLOOKUP(A422,Min_Tests!A:AB,5,FALSE)","v":2049},2049,"5","Unit 5","Sulfur Dioxide",1.0595000000000001,"lb/MMBtu",10.071310340000002,"lb/MW","Part II","Unit 5 RATA Test Report ‐ June 4, 2008"]
["2049_5",{"$f":"VLOOKUP(A423,Min_Tests!A:AB,2,FALSE)","v":247},null,{"$f":"VLOOKUP(A423,Min_Tests!A:AB,5,FALSE)","v":2049},2049,"5","Unit 5","Sulfur Dioxide",1.0745,"lb/MMBtu",10.213896140000001,"lb/MW","Part II","Unit 5 RATA Test Report ‐ August 2, 2005"]
["2049_5",{"$f":"VLOOKUP(A424,Min_Tests!A:AB,2,FALSE)","v":247},null,{"$f":"VLOOKUP(A424,Min_Tests!A:AB,5,FALSE)","v":2049},2049,"5","Unit 5","Sulfur Dioxide",1.1153,"lb/MMBtu",10.601729515999999,"lb/MW","Part II","Unit 5 RATA Test Report ‐ July 17, 2006"]
["2480_3",{"$f":"VLOOKUP(A425,Min_Tests!A:AB,2,FALSE)","v":248},null,{"$f":"VLOOKUP(A425,Min_Tests!A:AB,5,FALSE)","v":2480},2480,"3","3","Sulfur Dioxide",0.96577255184564781,"lb/MMBtu",9.0978573724589999,"lb/MW","ERT",""]
["10151_BLR1A",{"$f":"VLOOKUP(A426,Min_Tests!A:AB,2,FALSE)","v":249},null,{"$f":"VLOOKUP(A426,Min_Tests!A:AB,5,FALSE)","v":10151},10151,"BLR1A","GEN1","Sulfur Dioxide",0.64453333333333329,"lb/MMBtu",9.1591578947368415,"lb/MW","CEMS",""]
["10151_BLR1B",{"$f":"VLOOKUP(A427,Min_Tests!A:AB,2,FALSE)","v":250},null,{"$f":"VLOOKUP(A427,Min_Tests!A:AB,5,FALSE)","v":10151},10151,"BLR1B","GEN1","Sulfur Dioxide",0.64453333333333329,"lb/MMBtu",9.1591578947368415,"lb/MW","CEMS",""]
["1626_1",{"$f":"VLOOKUP(A428,Min_Tests!A:AB,2,FALSE)","v":251},null,{"$f":"VLOOKUP(A428,Min_Tests!A:AB,5,FALSE)","v":1626},1626,"1","Unit 1","Sulfur Dioxide",0.76237860451432604,"lb/MMBtu",9.1857356517342854,"lb/MW","ERT",""]
["6147_2",{"$f":"VLOOKUP(A429,Min_Tests!A:AB,2,FALSE)","v":252},null,{"$f":"VLOOKUP(A429,Min_Tests!A:AB,5,FALSE)","v":6147},6147,"2","2","Sulfur Dioxide",0.81611045859422093,"lb/MMBtu",9.798924888781384,"lb/MW","ERT",""]
["2480_4",{"$f":"VLOOKUP(A430,Min_Tests!A:AB,2,FALSE)","v":253},null,{"$f":"VLOOKUP(A430,Min_Tests!A:AB,5,FALSE)","v":2480},2480,"4","4","Sulfur Dioxide",0.94266462506591819,"lb/MMBtu",9.8623806213045917,"lb/MW","ERT",""]
["663_B-2",{"$f":"VLOOKUP(A431,Min_Tests!A:AB,2,FALSE)","v":254},null,{"$f":"VLOOKUP(A431,Min_Tests!A:AB,5,FALSE)","v":663},663,"B-2","001","Sulfur Dioxide",1.04,"lb/MMBtu",10.745191489361703,"lb/MW","Part II","5"]
["3935_1",{"$f":"VLOOKUP(A432,Min_Tests!A:AB,2,FALSE)","v":255},null,{"$f":"VLOOKUP(A432,Min_Tests!A:AB,5,FALSE)","v":3935},3935,"1","AM-1","Sulfur Dioxide",1.2656999999999996,"lb/MMBtu",10.884740904079381,"lb/MW","CEMS",""]
["2848_H-5",{"$f":"VLOOKUP(A433,Min_Tests!A:AB,2,FALSE)","v":256},null,{"$f":"VLOOKUP(A433,Min_Tests!A:AB,5,FALSE)","v":2848},2848,"H-5","H-5","Sulfur Dioxide",1.0933333333333333,"lb/MMBtu",11.124232804232802,"lb/MW","Part II","2005 H-5"]
["2848_H-5",{"$f":"VLOOKUP(A434,Min_Tests!A:AB,2,FALSE)","v":256},null,{"$f":"VLOOKUP(A434,Min_Tests!A:AB,5,FALSE)","v":2848},2848,"H-5","H-5","Sulfur Dioxide",1.3266666666666669,"lb/MMBtu",13.498306878306879,"lb/MW","Part II","2007 H-5"]
["2848_H-5",{"$f":"VLOOKUP(A435,Min_Tests!A:AB,2,FALSE)","v":256},null,{"$f":"VLOOKUP(A435,Min_Tests!A:AB,5,FALSE)","v":2848},2848,"H-5","H-5","Sulfur Dioxide",1.4133333333333333,"lb/MMBtu",14.38010582010582,"lb/MW","Part II","2006 H-5"]
["2848_H-5",{"$f":"VLOOKUP(A436,Min_Tests!A:AB,2,FALSE)","v":256},null,{"$f":"VLOOKUP(A436,Min_Tests!A:AB,5,FALSE)","v":2848},2848,"H-5","H-5","Sulfur Dioxide",1.6033333333333335,"lb/MMBtu",16.313280423280425,"lb/MW","Part II","2008 H-5"]
["2828_3",{"$f":"VLOOKUP(A437,Min_Tests!A:AB,2,FALSE)","v":257},null,{"$f":"VLOOKUP(A437,Min_Tests!A:AB,5,FALSE)","v":2828},2828,"3","CD-U3","Sulfur Dioxide",1.4083913043478258,"lb/MMBtu",11.429637123745817,"lb/MW","CEMS",""]
["988_4",{"$f":"VLOOKUP(A438,Min_Tests!A:AB,2,FALSE)","v":258},null,{"$f":"VLOOKUP(A438,Min_Tests!A:AB,5,FALSE)","v":988},988,"4","TC-4","Sulfur Dioxide",1.3718965517241377,"lb/MMBtu",11.809149203214503,"lb/MW","CEMS",""]
["10603_031",{"$f":"VLOOKUP(A439,Min_Tests!A:AB,2,FALSE)","v":259},null,{"$f":"VLOOKUP(A439,Min_Tests!A:AB,5,FALSE)","v":10603},10603,"031","EPC01","Sulfur Dioxide",0.83702771609454862,"lb/MMBtu",11.97815524755992,"lb/MW","ERT",""]
["2848_H-1",{"$f":"VLOOKUP(A440,Min_Tests!A:AB,2,FALSE)","v":260},null,{"$f":"VLOOKUP(A440,Min_Tests!A:AB,5,FALSE)","v":2848},2848,"H-1","H-1","Sulfur Dioxide",1.05,"lb/MMBtu",12.025471698113208,"lb/MW","Part II","2005 H-1"]
["2848_H-1",{"$f":"VLOOKUP(A441,Min_Tests!A:AB,2,FALSE)","v":260},null,{"$f":"VLOOKUP(A441,Min_Tests!A:AB,5,FALSE)","v":2848},2848,"H-1","H-1","Sulfur Dioxide",1.2466666666666668,"lb/MMBtu",14.277861635220127,"lb/MW","Part II","2008 H-1"]
["2848_H-1",{"$f":"VLOOKUP(A442,Min_Tests!A:AB,2,FALSE)","v":260},null,{"$f":"VLOOKUP(A442,Min_Tests!A:AB,5,FALSE)","v":2848},2848,"H-1","H-1","Sulfur Dioxide",1.3266666666666667,"lb/MMBtu",15.194088050314464,"lb/MW","Part II","2006 H-1"]
["2848_H-1",{"$f":"VLOOKUP(A443,Min_Tests!A:AB,2,FALSE)","v":260},null,{"$f":"VLOOKUP(A443,Min_Tests!A:AB,5,FALSE)","v":2848},2848,"H-1","H-1","Sulfur Dioxide",1.3533333333333335,"lb/MMBtu",15.499496855345914,"lb/MW","Part II","2006 H-1 retest"]
["2848_H-1",{"$f":"VLOOKUP(A444,Min_Tests!A:AB,2,FALSE)","v":260},null,{"$f":"VLOOKUP(A444,Min_Tests!A:AB,5,FALSE)","v":2848},2848,"H-1","H-1","Sulfur Dioxide",1.4000000000000001,"lb/MMBtu",16.033962264150944,"lb/MW","Part II","2007 H-1"]
["2848_H-3",{"$f":"VLOOKUP(A445,Min_Tests!A:AB,2,FALSE)","v":261},null,{"$f":"VLOOKUP(A445,Min_Tests!A:AB,5,FALSE)","v":2848},2848,"H-3","H-3","Sulfur Dioxide",1.0766666666666669,"lb/MMBtu",12.334293333333335,"lb/MW","Part II","2005 H-3"]
["2848_H-3",{"$f":"VLOOKUP(A446,Min_Tests!A:AB,2,FALSE)","v":261},null,{"$f":"VLOOKUP(A446,Min_Tests!A:AB,5,FALSE)","v":2848},2848,"H-3","H-3","Sulfur Dioxide",1.1966666666666665,"lb/MMBtu",13.709013333333331,"lb/MW","Part II","2007 H-3"]
["2848_H-3",{"$f":"VLOOKUP(A447,Min_Tests!A:AB,2,FALSE)","v":261},null,{"$f":"VLOOKUP(A447,Min_Tests!A:AB,5,FALSE)","v":2848},2848,"H-3","H-3","Sulfur Dioxide",1.3666666666666665,"lb/MMBtu",15.65653333333333,"lb/MW","Part II","2008 H-3"]
["2848_H-3",{"$f":"VLOOKUP(A448,Min_Tests!A:AB,2,FALSE)","v":261},null,{"$f":"VLOOKUP(A448,Min_Tests!A:AB,5,FALSE)","v":2848},2848,"H-3","H-3","Sulfur Dioxide",1.4166666666666667,"lb/MMBtu",16.229333333333333,"lb/MW","Part II","2006 H-3"]
["2848_H-2",{"$f":"VLOOKUP(A449,Min_Tests!A:AB,2,FALSE)","v":262},null,{"$f":"VLOOKUP(A449,Min_Tests!A:AB,5,FALSE)","v":2848},2848,"H-2","H-2","Sulfur Dioxide",1.1633333333333333,"lb/MMBtu",12.599119496855346,"lb/MW","Part II","2008 H-2"]
[{"$f":"E450&\"_\"&F450","v":"2848_H-2"},{"$f":"VLOOKUP(A450,Min_Tests!A:AB,2,FALSE)","v":262},null,{"$f":"VLOOKUP(A450,Min_Tests!A:AB,5,FALSE)","v":2848},2848,"H-2","H-2","Sulfur Dioxide",1.3133333333333335,"lb/MMBtu",14.223647798742141,"lb/MW","Part II","2007 H-2"]
["2848_H-2",{"$f":"VLOOKUP(A451,Min_Tests!A:AB,2,FALSE)","v":262},null,{"$f":"VLOOKUP(A451,Min_Tests!A:AB,5,FALSE)","v":2848},2848,"H-2","H-2","Sulfur Dioxide",1.3166666666666667,"lb/MMBtu",14.259748427672957,"lb/MW","Part II","2006 H-2"]
["2848_H-2",{"$f":"VLOOKUP(A452,Min_Tests!A:AB,2,FALSE)","v":262},null,{"$f":"VLOOKUP(A452,Min_Tests!A:AB,5,FALSE)","v":2848},2848,"H-2","H-2","Sulfur Dioxide",1.3266666666666667,"lb/MMBtu",14.36805031446541,"lb/MW","Part II","2005 H-2"]
["628_1",{"$f":"VLOOKUP(A453,Min_Tests!A:AB,2,FALSE)","v":263},null,{"$f":"VLOOKUP(A453,Min_Tests!A:AB,5,FALSE)","v":628},628,"1","CryR_Cfg_1","Sulfur Dioxide",1.3670117968378968,"lb/MMBtu",13.113060661167523,"lb/MW","ERT",""]
["2848_H-6",{"$f":"VLOOKUP(A454,Min_Tests!A:AB,2,FALSE)","v":264},null,{"$f":"VLOOKUP(A454,Min_Tests!A:AB,5,FALSE)","v":2848},2848,"H-6","H-6","Sulfur Dioxide",1.2300000000000002,"lb/MMBtu",13.133553719008267,"lb/MW","Part II","2007 H-6"]
["2848_H-6",{"$f":"VLOOKUP(A455,Min_Tests!A:AB,2,FALSE)","v":264},null,{"$f":"VLOOKUP(A455,Min_Tests!A:AB,5,FALSE)","v":2848},2848,"H-6","H-6","Sulfur Dioxide",1.32,"lb/MMBtu",14.094545454545456,"lb/MW","Part II","2005 H-6"]
["2848_H-6",{"$f":"VLOOKUP(A456,Min_Tests!A:AB,2,FALSE)","v":264},null,{"$f":"VLOOKUP(A456,Min_Tests!A:AB,5,FALSE)","v":2848},2848,"H-6","H-6","Sulfur Dioxide",1.3699999999999999,"lb/MMBtu",14.628429752066115,"lb/MW","Part II","2006 H-6"]
["2848_H-6",{"$f":"VLOOKUP(A457,Min_Tests!A:AB,2,FALSE)","v":264},null,{"$f":"VLOOKUP(A457,Min_Tests!A:AB,5,FALSE)","v":2848},2848,"H-6","H-6","Sulfur Dioxide",1.57,"lb/MMBtu",16.763966942148762,"lb/MW","Part II","2008 H-6"]
["2848_H-4",{"$f":"VLOOKUP(A458,Min_Tests!A:AB,2,FALSE)","v":265},null,{"$f":"VLOOKUP(A458,Min_Tests!A:AB,5,FALSE)","v":2848},2848,"H-4","H-4","Sulfur Dioxide",1.23,"lb/MMBtu",13.376250000000001,"lb/MW","Part II","2007 H-4"]
["2848_H-4",{"$f":"VLOOKUP(A459,Min_Tests!A:AB,2,FALSE)","v":265},null,{"$f":"VLOOKUP(A459,Min_Tests!A:AB,5,FALSE)","v":2848},2848,"H-4","H-4","Sulfur Dioxide",1.3033333333333335,"lb/MMBtu",14.173750000000002,"lb/MW","Part II","2005 H-4"]
["2848_H-4",{"$f":"VLOOKUP(A460,Min_Tests!A:AB,2,FALSE)","v":265},null,{"$f":"VLOOKUP(A460,Min_Tests!A:AB,5,FALSE)","v":2848},2848,"H-4","H-4","Sulfur Dioxide",1.3133333333333332,"lb/MMBtu",14.282499999999999,"lb/MW","Part II","2006 H-4"]
["2848_H-4",{"$f":"VLOOKUP(A461,Min_Tests!A:AB,2,FALSE)","v":265},null,{"$f":"VLOOKUP(A461,Min_Tests!A:AB,5,FALSE)","v":2848},2848,"H-4","H-4","Sulfur Dioxide",1.5766666666666669,"lb/MMBtu",17.146250000000002,"lb/MW","Part II","2008 H-4"]
["2917_9",{"$f":"VLOOKUP(A462,Min_Tests!A:AB,2,FALSE)","v":266},null,{"$f":"VLOOKUP(A462,Min_Tests!A:AB,5,FALSE)","v":2917},2917,"9","Unit 9","Sulfur Dioxide",0.9356540745994294,"lb/MMBtu",13.48007550164,"lb/MW","ERT",""]
["6648_4",{"$f":"VLOOKUP(A463,Min_Tests!A:AB,2,FALSE)","v":267},null,{"$f":"VLOOKUP(A463,Min_Tests!A:AB,5,FALSE)","v":6648},6648,"4","4","Sulfur Dioxide",1.0080393928289542,"lb/MMBtu",13.860541651398119,"lb/MW","Part II","15-Air Heater Inlet, ESP Inlet, and Stack Sampling"]
["2716_1",{"$f":"VLOOKUP(A464,Min_Tests!A:AB,2,FALSE)","v":268},null,{"$f":"VLOOKUP(A464,Min_Tests!A:AB,5,FALSE)","v":2716},2716,"1","Wea_Cfg_1","Sulfur Dioxide",1.6064603724188229,"lb/MMBtu",14.306590486446876,"lb/MW","ERT",""]
["2716_2",{"$f":"VLOOKUP(A465,Min_Tests!A:AB,2,FALSE)","v":269},null,{"$f":"VLOOKUP(A465,Min_Tests!A:AB,5,FALSE)","v":2716},2716,"2","Wea_Cfg_1","Sulfur Dioxide",1.6064603724188229,"lb/MMBtu",14.306590486446876,"lb/MW","ERT",""]
["2837_1",{"$f":"VLOOKUP(A466,Min_Tests!A:AB,2,FALSE)","v":270},null,{"$f":"VLOOKUP(A466,Min_Tests!A:AB,5,FALSE)","v":2837},2837,"1","Unit 1","Sulfur Dioxide",1.8618807220013907,"lb/MMBtu",15.580321319525526,"lb/MW","ERT",""]
["2107_2",{"$f":"VLOOKUP(A467,Min_Tests!A:AB,2,FALSE)","v":271},null,{"$f":"VLOOKUP(A467,Min_Tests!A:AB,5,FALSE)","v":2107},2107,"2","002","Sulfur Dioxide",1.6986333333333334,"lb/MMBtu",15.949000000000002,"lb/MW","CEMS",""]
["3942_2",{"$f":"VLOOKUP(A468,Min_Tests!A:AB,2,FALSE)","v":272},null,{"$f":"VLOOKUP(A468,Min_Tests!A:AB,5,FALSE)","v":3942},3942,"2","Unit_2","Sulfur Dioxide",2.0144003566422413,"lb/MMBtu",15.99085715211063,"lb/MW","ERT",""]
["642_1",{"$f":"VLOOKUP(A469,Min_Tests!A:AB,2,FALSE)","v":273},null,{"$f":"VLOOKUP(A469,Min_Tests!A:AB,5,FALSE)","v":642},642,"1","Unit 1","Sulfur Dioxide",1.3666666666666669,"lb/MMBtu",16.207300000000004,"lb/MW","Part II","SO2 Unit 1/2 Test (8/13/08)"]
["642_1",{"$f":"VLOOKUP(A470,Min_Tests!A:AB,2,FALSE)","v":273},null,{"$f":"VLOOKUP(A470,Min_Tests!A:AB,5,FALSE)","v":642},642,"1","Unit 1","Sulfur Dioxide",1.4127142857142856,"lb/MMBtu",16.753378714285713,"lb/MW","CEMS",""]
["642_1",{"$f":"VLOOKUP(A471,Min_Tests!A:AB,2,FALSE)","v":273},null,{"$f":"VLOOKUP(A471,Min_Tests!A:AB,5,FALSE)","v":642},642,"1","Unit 1","Sulfur Dioxide",1.4833333333333332,"lb/MMBtu",17.59085,"lb/MW","Part II","Unit 1 SO2 Unit 1 Test (8/17/05)"]
["642_1",{"$f":"VLOOKUP(A472,Min_Tests!A:AB,2,FALSE)","v":273},null,{"$f":"VLOOKUP(A472,Min_Tests!A:AB,5,FALSE)","v":642},642,"1","Unit 1","Sulfur Dioxide",1.8513333333333335,"lb/MMBtu",21.954962000000002,"lb/MW","Part II","SO2 Unit 1/2 Test (8/14/07)"]
["642_1",{"$f":"VLOOKUP(A473,Min_Tests!A:AB,2,FALSE)","v":273},null,{"$f":"VLOOKUP(A473,Min_Tests!A:AB,5,FALSE)","v":642},642,"1","Unit 1","Sulfur Dioxide",2.4034611298670665,"lb/MMBtu",28.502645539093542,"lb/MW","Part II","SO2 Unit 1/2 Test (8/16/06)"]
["1385_3",{"$f":"VLOOKUP(A474,Min_Tests!A:AB,2,FALSE)","v":274},null,{"$f":"VLOOKUP(A474,Min_Tests!A:AB,5,FALSE)","v":1385},1385,"3","03","Sulfur Dioxide",1.4327666666666667,"lb/MMBtu",16.906646666666667,"lb/MW","CEMS",""]
["2837_3",{"$f":"VLOOKUP(A475,Min_Tests!A:AB,2,FALSE)","v":275},null,{"$f":"VLOOKUP(A475,Min_Tests!A:AB,5,FALSE)","v":2837},2837,"3","Unit 3","Sulfur Dioxide",2.1208759289031192,"lb/MMBtu",17.747607599501794,"lb/MW","ERT",""]
["642_2",{"$f":"VLOOKUP(A476,Min_Tests!A:AB,2,FALSE)","v":276},null,{"$f":"VLOOKUP(A476,Min_Tests!A:AB,5,FALSE)","v":642},642,"2","Unit 2","Sulfur Dioxide",1.3666666666666669,"lb/MMBtu",17.982600000000001,"lb/MW","Part II","SO2 Unit 1/2 Test (8/13/08)"]
["642_2",{"$f":"VLOOKUP(A477,Min_Tests!A:AB,2,FALSE)","v":276},null,{"$f":"VLOOKUP(A477,Min_Tests!A:AB,5,FALSE)","v":642},642,"2","Unit 2","Sulfur Dioxide",1.4127142857142856,"lb/MMBtu",18.588494571428569,"lb/MW","CEMS",""]
["3947_1",{"$f":"VLOOKUP(A478,Min_Tests!A:AB,2,FALSE)","v":277},null,{"$f":"VLOOKUP(A478,Min_Tests!A:AB,5,FALSE)","v":3947},3947,"1","K-1","Sulfur Dioxide",2.0177333333333336,"lb/MMBtu",18.316770807017548,"lb/MW","CEMS",""]
["3947_3",{"$f":"VLOOKUP(A479,Min_Tests!A:AB,2,FALSE)","v":278},null,{"$f":"VLOOKUP(A479,Min_Tests!A:AB,5,FALSE)","v":3947},3947,"3","K-3","Sulfur Dioxide",2.0177333333333336,"lb/MMBtu",18.316770807017548,"lb/MW","CEMS",""]
["2364_2",{"$f":"VLOOKUP(A480,Min_Tests!A:AB,2,FALSE)","v":279},null,{"$f":"VLOOKUP(A480,Min_Tests!A:AB,5,FALSE)","v":2364},2364,"2","mk2","Sulfur Dioxide",2.1748000000000003,"lb/MMBtu",19.469945400593474,"lb/MW","CEMS",""]
["1218_2",{"$f":"VLOOKUP(A481,Min_Tests!A:AB,2,FALSE)","v":280},null,{"$f":"VLOOKUP(A481,Min_Tests!A:AB,5,FALSE)","v":1218},1218,"2","U2","Sulfur Dioxide",2.0313666666666665,"lb/MMBtu",21.467852272727271,"lb/MW","CEMS",""]
["3942_1",{"$f":"VLOOKUP(A482,Min_Tests!A:AB,2,FALSE)","v":281},null,{"$f":"VLOOKUP(A482,Min_Tests!A:AB,5,FALSE)","v":3942},3942,"1","Unit_1","Sulfur Dioxide",2.3667717521383196,"lb/MMBtu",22.966451817045918,"lb/MW","ERT",""]
["1217_1",{"$f":"VLOOKUP(A483,Min_Tests!A:AB,2,FALSE)","v":282},null,{"$f":"VLOOKUP(A483,Min_Tests!A:AB,5,FALSE)","v":1217},1217,"1","1","Sulfur Dioxide",2.1,"lb/MMBtu",25.042500000000004,"lb/MW","Part II","2006 RATA"]
["7253_3",{"$f":"VLOOKUP(A484,Min_Tests!A:AB,2,FALSE)","v":283},null,{"$f":"VLOOKUP(A484,Min_Tests!A:AB,5,FALSE)","v":7253},7253,"3","UNIT3","Sulfur Dioxide",2.6829163240311966,"lb/MMBtu",27.835886063588212,"lb/MW","ERT",""]
["3131_3",{"$f":"VLOOKUP(A485,Min_Tests!A:AB,2,FALSE)","v":284},null,{"$f":"VLOOKUP(A485,Min_Tests!A:AB,5,FALSE)","v":3131},3131,"3","SHAW3-2","Sulfur Dioxide",3.1492999999999989,"lb/MMBtu",30.052362765957433,"lb/MW","CEMS",""]
["3131_4",{"$f":"VLOOKUP(A486,Min_Tests!A:AB,2,FALSE)","v":285},null,{"$f":"VLOOKUP(A486,Min_Tests!A:AB,5,FALSE)","v":3131},3131,"4","SHAW4-2","Sulfur Dioxide",3.1492999999999989,"lb/MMBtu",30.052362765957433,"lb/MW","CEMS",""]
["2732_7",{"$f":"VLOOKUP(A487,Min_Tests!A:AB,2,FALSE)","v":286},null,{"$f":"VLOOKUP(A487,Min_Tests!A:AB,5,FALSE)","v":2732},2732,"7","7","Sulfur Dioxide",2.8632800542083552,"lb/MMBtu",30.474508315644702,"lb/MW","ERT",""]
["3152_4",{"$f":"VLOOKUP(A488,Min_Tests!A:AB,2,FALSE)","v":287},null,{"$f":"VLOOKUP(A488,Min_Tests!A:AB,5,FALSE)","v":3152},3152,"4","Boiler 4","Sulfur Dioxide",3.0538666666666665,"lb/MMBtu",32.447333333333333,"lb/MW","CEMS",""]
["1010_6",{"$f":"VLOOKUP(A489,Min_Tests!A:AB,2,FALSE)","v":288},null,{"$f":"VLOOKUP(A489,Min_Tests!A:AB,5,FALSE)","v":1010},1010,"6","6","Sulfur Dioxide",3.6619959569548564,"lb/MMBtu",32.755167201989188,"lb/MW","ERT",""]
["1040_2",{"$f":"VLOOKUP(A490,Min_Tests!A:AB,2,FALSE)","v":289},null,{"$f":"VLOOKUP(A490,Min_Tests!A:AB,5,FALSE)","v":1040},1040,"2","002","Sulfur Dioxide",3.5480306058049607,"lb/MMBtu",37.537135394748134,"lb/MW","ERT",""]
["1010_4",{"$f":"VLOOKUP(A491,Min_Tests!A:AB,2,FALSE)","v":290},null,{"$f":"VLOOKUP(A491,Min_Tests!A:AB,5,FALSE)","v":1010},1010,"4","4","Sulfur Dioxide",3.6619959569548564,"lb/MMBtu",37.584081727326847,"lb/MW","ERT",""]
["2840_3",{"$f":"VLOOKUP(A492,Min_Tests!A:AB,2,FALSE)","v":291},null,{"$f":"VLOOKUP(A492,Min_Tests!A:AB,5,FALSE)","v":2840},2840,"3","CV-3","Sulfur Dioxide",4.1252499999999994,"lb/MMBtu",46.552821212121209,"lb/MW","CEMS",""]
["1218_1",{"$f":"VLOOKUP(A493,Min_Tests!A:AB,2,FALSE)","v":292},null,{"$f":"VLOOKUP(A493,Min_Tests!A:AB,5,FALSE)","v":1218},1218,"1","U1","Sulfur Dioxide",3.93,"lb/MMBtu",52.93469387755102,"lb/MW","Part II","TITLEV09U1"]

{"sheet":"Lognormal Template","index":2,"n_rows":165,"n_cols":13,"rows_kept":165,"cut":false,"hidden":false,"merged":[[116,0,116,2],[0,1,0,11],[37,0,37,3],[48,1,48,11],[86,0,86,1],[113,0,113,2],[127,0,127,3],[132,0,132,8],[133,0,133,4],[135,0,135,8],[137,0,137,2]]}
[null,"Emissions (lb/MW)"]
[{"$f":"'UPL Pooled Template '!A1","v":"SO2"},"52071\nSandow\n5A",null,null,null,null,null,null,null,null,null,null,"Outliers Removed"]
[1,0.22871142431791891]
[2,9.6752924775306018E-2]
[3,2.5374296569414579E-2]
[4,6.2900655215158488E-2]
[5,9.4350982822737725E-2]
[6,0.64997343722330436]
[7]
[8]
[9]
[10]
[11]
[12]
[13]
[14]
[15]
[16]
[17]
[18]
[19]
[20]
[21]
[22]
[23]
[24]
[25]
[26]
[27]
[28]
[29]
[30]
[31]
[32]
[33]
[34]
[35]
["Use for small sample sets that are Lognormal."]
[]
["Testing Normality","Raw Data","Log Data"]
["Sample Size",{"$f":"COUNT(B3:L37)","v":6},{"$f":"COUNT(B51:L85)","v":6}]
["Kurtosis",{"$f":"KURT(B3:L37)","v":4.1981507033588095},{"$f":"KURT(B51:L85)","v":0.44758380608146808}]
["SE Kurtosis",{"$f":"SQRT((B41^2-1)/((B41-3)*(B41+5)))","v":1.0298573010888745},{"$f":"SQRT((C41^2-1)/((C41-3)*(C41+5)))","v":1.0298573010888745}]
["Result Kurtosis",{"$f":"IF(ABS(B42/B43)>NORMSINV(1-0.05/2),\"non normal\",\"normal\")","v":"non normal"},{"$f":"IF(ABS(C42/C43)>NORMSINV(1-0.05/2),\"non normal\",\"normal\")","v":"normal"}]
["Skewness",{"$f":"SKEW(B3:L37)","v":2.0262280332936209},{"$f":"SKEW(B51:L85)","v":0.44452240658262282}]
["SE Skewness",{"$f":"SQRT((6*B41*(B41-1))/((B41-2)*(B41+1)*(B41+3)))","v":0.84515425472851657},{"$f":"SQRT((6*C41*(C41-1))/((C41-2)*(C41+1)*(C41+3)))","v":0.84515425472851657}]
["Result Skewness",{"$f":"IF(ABS(B45/B46)>NORMSINV(1-0.05/2),\"non normal\",\"normal\")","v":"non normal"},{"$f":"IF(ABS(C45/C46)>NORMSINV(1-0.05/2),\"non normal\",\"normal\")","v":"normal"}]
[]
[null,"1. Take LN( ) of Raw Data"]
["Runs"]
[1,{"$f":"IF(B3>0,LN(B3),\"\")","v":-1.4752942259088573},{"$f":"IF(C3>0,LN(C3),\"\")","v":""},"","","","","","","","",""]
[2,{"$f":"IF(B4>0,LN(B4),\"\")","v":-2.335594717293449},"","","","","","","","","",""]
[3,{"$f":"IF(B5>0,LN(B5),\"\")","v":-3.6740185634068121},"","","","","","","","","",""]
[4,{"$f":"IF(B6>0,LN(B6),\"\")","v":-2.7661986985548217},"","","","","","","","","",""]
[5,{"$f":"IF(B7>0,LN(B7),\"\")","v":-2.3607335904466575},"","","","","","","","","",""]
[6,{"$f":"IF(B8>0,LN(B8),\"\")","v":-0.43082378273778521},"","","","","","","","","",""]
[7,{"$f":"IF(B9>0,LN(B9),\"\")","v":""},"","","","","","","","","",""]
[8,{"$f":"IF(B10>0,LN(B10),\"\")","v":""},"","","","","","","","","",""]
[9,{"$f":"IF(B11>0,LN(B11),\"\")","v":""},"","","","","","","","","",""]
[10,{"$f":"IF(B12>0,LN(B12),\"\")","v":""},"","","","","","","","","",""]
[11,{"$f":"IF(B13>0,LN(B13),\"\")","v":""},"","","","","","","","","",""]
[12,{"$f":"IF(B14>0,LN(B14),\"\")","v":""},"","","","","","","","","",""]
[13,{"$f":"IF(B15>0,LN(B15),\"\")","v":""},"","","","","","","","","",""]
[14,{"$f":"IF(B16>0,LN(B16),\"\")","v":""},"","","","","","","","","",""]
[15,{"$f":"IF(B17>0,LN(B17),\"\")","v":""},"","","","","","","","","",""]
[16,{"$f":"IF(B18>0,LN(B18),\"\")","v":""},"","","","","","","","","",""]
[17,{"$f":"IF(B19>0,LN(B19),\"\")","v":""},"","","","","","","","","",""]
[18,{"$f":"IF(B20>0,LN(B20),\"\")","v":""},"","","","","","","","","",""]
[19,{"$f":"IF(B21>0,LN(B21),\"\")","v":""},"","","","","","","","","",""]
[20,{"$f":"IF(B22>0,LN(B22),\"\")","v":""},"","","","","","","","","",""]
[21,{"$f":"IF(B23>0,LN(B23),\"\")","v":""},"","","","","","","","","",""]
[22,{"$f":"IF(B24>0,LN(B24),\"\")","v":""},"","","","","","","","","",""]
[23,{"$f":"IF(B25>0,LN(B25),\"\")","v":""},"","","","","","","","","",""]
[24,{"$f":"IF(B26>0,LN(B26),\"\")","v":""},"","","","","","","","","",""]
[25,{"$f":"IF(B27>0,LN(B27),\"\")","v":""},"","","","","","","","","",""]
[26,{"$f":"IF(B28>0,LN(B28),\"\")","v":""},"","","","","","","","","",""]
[27,{"$f":"IF(B29>0,LN(B29),\"\")","v":""},"","","","","","","","","",""]
[28,{"$f":"IF(B30>0,LN(B30),\"\")","v":""},"","","","","","","","","",""]
[29,{"$f":"IF(B31>0,LN(B31),\"\")","v":""},"","","","","","","","","",""]
[30,{"$f":"IF(B32>0,LN(B32),\"\")","v":""},"","","","","","","","","",""]
[31,{"$f":"IF(B33>0,LN(B33),\"\")","v":""},"","","","","","","","","",""]
[32,{"$f":"IF(B34>0,LN(B34),\"\")","v":""},"","","","","","","","","",""]
[33,{"$f":"IF(B35>0,LN(B35),\"\")","v":""},"","","","","","","","","",""]
[34,{"$f":"IF(B36>0,LN(B36),\"\")","v":""},"","","","","","","","","",""]
[35,{"$f":"IF(B37>0,LN(B37),\"\")","v":""},"","","","","","","","","",""]
[]
["2. Calculate sample size, n=",null,{"$f":"COUNT(B51:L85)","v":6}]
[]
["Average of Raw Data",null,{"$f":"AVERAGE(B3:L37)","v":0.19301062015397333}]
[]
[]
["3. Calculate ",null,null,{"$f":"AVERAGE(B51:L85)","v":-2.1737772630580641}]
[]
[]
[]
[]
[]
[]
[]
[]
[]
[null,null,null,null,{"$f":"VAR(B51:L85)","v":1.2377180122199476}]
["4. Calculate"]
[]
[]
[]
[]
["5. m",null,{"$f":"'UPL Normal'!C78","v":3}]
[]
["6. Calculate"]
[]
[]
[]
["a- Numerator first term",null,null,null,null,{"$f":"EXP(4*E102)+2*EXP(3*E102)+3*EXP(2*E102)-3","v":255.92452465814}]
[]
[]
["b- denominator first term",null,null,null,null,{"$f":"C108*(EXP(E102)-1)^2","v":17.974246145902971}]
[]
[]
[]
[null,null,{"$f":"F114/F117+3*(1-1/C108)","v":16.238401020032494}]
[]
[]
["7. Calculate"]
[null,null,null,null,null,{"$f":"SQRT(EXP(E102)-1)*(EXP(E102)+2)/SQRT(C108)","v":4.9208241593683519}]
[]
[]
["8. Go to tab distribution for 99 percentile \"lognormal distribution 99%\""]
[]
["9. substitue the values of ",null,null,null,"in cell D7 and F7 respectively"]
[]
[]
["10. In column AE indentify the value that is the smallest value that is larger than 0.99, note what row number this is.",null,null,null,null,null,null,null,null,{"$f":"VLOOKUP(\"x\",'lognormal distribution 99 %'!AF:AL,2,FALSE)","v":93},"is the Row number in Column AE with the first value > 0.99."]
[]
[]
["11. In column B, go down to the row number from Step 10. above, and copy the z value.",null,null,null,null,null,null,null,null,{"$f":"INDIRECT(\"'lognormal distribution 99 %'!B\" & J133)","v":3.484},"z value from \"lognormal distribution 99%\""]
[]
["12. calculate the UPL using the formula "]
[]
[]
[]
[]
[]
[]
[]
["a- Calculate ",null,null,{"$f":"EXP(D92+E102/2)","v":0.21120664661123439}]
[]
[]
["b- Calculate",null,null,{"$f":"EXP(2*D92+E102)","v":4.4608247572762841E-2}]
[]
[]
[]
["c- Calculate ",null,null,{"$f":"EXP(E102)-1","v":2.4477367877220084}]
[]
[]
[]
["d-calculate",null,null,null,{"$f":"(E102)/C87+(E102^2)/(2*(C87-1))","v":0.35948092314736113}]
[]
[]
[]
["e- Calculate",null,null,null,null,null,null,{"$f":"SQRT(C108*D149*D153+C108^2*D149*E157)","v":0.68694255365057511}]
[]
[]
[]
["f- Calculate UPL",null,null,{"$f":"D146+(J136/C108)*H161","v":1.008975932250769},"lb/MW",{"$f":"D165*1000","v":1008.975932250769},"lb/GW"]

{"sheet":"QA_Calcs","index":3,"n_rows":105,"n_cols":97,"rows_kept":105,"cut":false,"hidden":false,"merged":[[8,0,8,3],[8,5,8,17],[8,19,8,25],[8,27,8,35],[8,37,8,44]]}
[null,null,null,null,null,null,null,"Anthracite",null,"Anthracite",null,null,"fPM","30B",null,"μg/dscm","No",null,"μg/dscm",{"$f":"1/453592370","v":2.2046226218487758E-9},"lbs/μg",2.8316846592000001E-2,null,null,null,"cm/cf",null,null,null,null,null,"lb/hr",null,null,"lb/MMBtu",null,null,null,null,null,null,null,"Round to",null,null,null,"From ",null,"original database export===>"]
[null,null,null,null,null,null,null,"Bituminous",null,"Bituminous",null,null,"Se","M5",null,"lb/dscf","Yes",null,"ppm",{"$f":"T1/1000","v":2.2046226218487757E-12},"lb/mg",null,null,null,null,null,null,null,null,null,null,null,null,null,null,null,null,null,null,null,null,null,"Same ",null,null,null,"Min ",null,"original database export===>"]
[null,null,null,null,null,null,null,"Lignite",null,"Lignite",null,null,"Pb","M5B",null,"ppm",null,null,null,null,"lb/scf",null,null,null,null,null,null,null,null,null,null,null,null,null,null,null,null,null,null,null,null,null,"Sig Figs ",null,null,null,"Test",null,"original database export===>"]
[null,null,null,null,null,null,null,"Oil",null,"Oil",null,null,"Hg","M29",null,"ppm @ 3% O2",null,null,null,null,null,null,null,null,null,null,null,null,null,null,null,null,null,null,null,null,null,null,null,null,null,null,"as Submitted",null,null,null,"Sheet",null,"original database export===>"]
[null,null,null,null,null,null,null,"Pet Coke",null,"Pet Coke",null,null,"HCl","OTM27",null,"ppm @ 7% O2",null,null,null,null,null,null,null,null,null,null,null,null,null,null,null,null,null,null,null,null,null,null,null,null,null,null,"prior to ",null,null,null,null,null,"original database export===>"]
[null,null,null,null,null,null,null,"Subbituminous",null,"Sub Bituminous",null,null,"SO2","26A",null,null,null,null,null,null,null,null,null,null,null,null,null,null,null,null,null,null,null,null,null,null,null,null,null,null,null,null,"Calc % Diff.",null,null,null,null,null,"original database export===>"]
[null,null,null,null,null,null,null,null,null,null,null,null,null,"M6C",null,null,null,null,null,null,null,null,null,null,null,null,null,null,null,null,null,null,null,null,null,null,null,null,null,null,null,null,null,null,null,null,null,null,"original database export===>"]
[null,null,null,null,null,null,null,null,null,null,null,null,null,null,null,null,null,null,null,null,null,null,null,null,null,null,null,null,null,null,null,null,null,null,null,null,null,null,null,null,null,null,null,null,null,null,null,null,"original database export===>"]
["RTI",null,null,null,null,"As Submitted",null,null,null,null,null,null,null,null,null,null,null,null,null,"RTI-QA",null,null,null,null,null,null,null,"As Submitted",null,null,null,null,null,null,null,null,null,"RTI-QA",null,null,null,null,null,null,null,"Final for UPL",null,"Final for UPL","original database export===>","Key","RTI Calculated QA\nlb/MMBtu","Run Grade","Submitted Value","Submitted Value UOM","Use ?","Comment","facility_id","report_id","sampling_port_id","pollutant_id","pollutant_name","run_id","start_datetime","end_datetime","unit_load","fuel_flow_rate","fuel_heating_value","fg_moisture_content","fg_oxygen_content","fg_CO2_content","fg_temperature","test_method","conc","conc_units","conc_ND","conc_MDL","conc2","conc2_units","emission_rate","emission_rate_units","emission_rate_ND","emission_rate_MDL","Calculated conc lb/dscf","19-1\nlb/MMBtu","%diff\n19-1","19-6\nlb/MMBtu","%diff\n19-6","emission_factor","emission_factor_units","emission_factor_ND","emission_factor_MDL","run_pollutant_comment","Fuel1","Fuel1%Btu","Fuel2","Fuel2%Btu","QA Comment"]
["Comments","Use Run in UPL Calc?","Grade","Key","Facility_Name","Facility_ID","Boiler_ID","Fuel1 Used","Fuel1 Fraction","Fuel2 Used","Fuel2 Fraction","\"Fuel Used/Fraction\" Data Source","Pollutant","Reference Method","Concentration","Concentration UOM","Non-Detect?","MDL","MDL UOM","HAP Conversion Value to lbs","HAP Conversion UOM","Volume Conversion Value to cubic feet","Reserve","Reserve","Reserve","Volume Conversion UOM","Submitted F Factor","Bws (percent)","%O2d","%CO2d","Emission Rate Value","Emission Rate UOM","Emission Rate MDL","Emission Factor Value","Emission Factor UOM","Emission Factor MDL","MDL UOM","Fd","Fw","Fc","Calculated conc lb/dscf","19-1\nlb/MMBtu","%diff\n19-1","19-6\nlb/MMBtu","%diff\n19-6","lb/MMBtu Value Used for UPL Calcs","Unit Heat Rate (MMBtu/MWh)","lb/MWh Value Used in UPL Calcs","original database export===>"]
["Scrubber inlet duct measurement; do not use","No",null,null,"Sandow",52071,"5A","Lignite",100,null,null,"Part II","SO2","26A",{"$f":"BU11","v":27.31},"ppm","No",null,null,{"$f":"$C$88","v":1.66E-7},"lb/scf",null,null,null,null,null,null,{"$f":"BP11","v":8.64},{"$f":"BQ11","v":4.4000000000000004},{"$f":"BR11","v":15},{"$f":"CA11","v":147.37},"lb/hr",null,{"$f":"CJ11","v":5.7000000000000002E-2},"lb/MMBtu",null,null,{"$f":"VLOOKUP(H11,$A$88:$D$104,2,FALSE)","v":9860},{"$f":"VLOOKUP(H11,$A$88:$D$104,3,FALSE)","v":11950},{"$f":"VLOOKUP(H11,$A$88:$D$104,4,FALSE)","v":1910},{"$f":"O11*T11","v":4.5334599999999996E-6},{"$f":"IF(AC11<>\"\",AO11*AL11*20.9/(20.9-AC11),\"no O2 data for run\")","v":5.6619893093333325E-2},{"$f":"(AP11-$AH11)/$AH11","v":-6.6685422222224093E-3},{"$f":"IF(AD11<>\"\",AO11*AN11*100/AD11,\"no CO2 data for run\")","v":5.772605733333333E-2},{"$f":"(AR11-$AH11)/$AH11","v":1.2737847953216287E-2},"Not used ",10.483442535859748,"Not used ","original database export===>",null,null,null,null,null,"No","Scrubber inlet duct measurement; do not use",52071,"3-Source Emissions Survey, Inlet Ducts and Stacks","SP03",6,"Sulfur Dioxide (SO2)","1",40114.504861111112,40114.629861111112,312,null,null,8.64,4.4000000000000004,15,266,"EPA Methods 1, 2, 3A, 4, 6C, 17, 26A, 30B",27.31,"parts per million by volume (dry) (ppmvd)",false,null,null,"",147.37,"pound per hour (lb/hr)",false,null,4.5334599999999996E-6,5.6619893093333325E-2,6.6685422222224093E-3,5.772605733333333E-2,-1.2737847953216287E-2,5.7000000000000002E-2,"pound per million British Thermal Unit (lb/MMBtu)",false,null,"","coal - lignite",100,null,null,"Scrubber inlet duct measurement; do not use"]
["Scrubber inlet duct measurement; do not use","No","Do Not Use",null,"Sandow",52071,"5A","Lignite",100,null,null,"Part II","SO2","26A",{"$f":"BU12","v":26.38},"ppm","No",null,null,{"$f":"$C$88","v":1.66E-7},"lb/scf",null,null,null,null,null,null,null,{"$f":"BQ12","v":4.4000000000000004},14.8,{"$f":"CA12","v":164.31},"lb/hr",null,{"$f":"CJ12","v":5.5E-2},"lb/MMBtu",null,null,9860,11950,{"$f":"VLOOKUP(H12,$A$88:$D$104,4,FALSE)","v":1910},{"$f":"O12*T12","v":4.3790799999999996E-6},5.4691789813333329E-2,-5.6038215757576622E-3,5.651380270270269E-2,2.7523685503685259E-2,"Not used ",10.483442535859748,"Not used ","original database export===>",null,null,null,null,null,"No","Scrubber inlet duct measurement; do not use",52071,"3-Source Emissions Survey, Inlet Ducts and Stacks","SP03",6,"Sulfur Dioxide (SO2)","2",40114.727777777778,40114.776388888888,313,null,null,null,4.4000000000000004,14.8,null,"EPA Methods 1, 2, 3A, 4, 6C, 17, 26A, 30B",26.38,"parts per million by volume (dry) (ppmvd)",false,null,null,"",164.31,"pound per hour (lb/hr)",false,null,4.3790799999999996E-6,5.4691789813333329E-2,5.6038215757576622E-3,5.651380270270269E-2,-2.7523685503685259E-2,5.5E-2,"pound per million British Thermal Unit (lb/MMBtu)",false,null,"","coal - lignite",100,null,null,"Scrubber inlet duct measurement; do not use"]
["Scrubber inlet duct measurement; do not use","No","Do Not Use",null,"Sandow",52071,"5A","Lignite",100,null,null,"Part II","SO2","26A",9.31,"ppm","No",null,null,1.66E-7,"lb/scf",null,null,null,null,null,null,null,4,14.9,54.31,"lb/hr",null,1.9E-2,"lb/MMBtu",null,null,9860,11950,1910,1.54546E-6,1.8844918582248522E-2,-8.1621798816566907E-3,1.9810930201342281E-2,4.2680536912751636E-2,"Not used ",10.483442535859748,"Not used ","original database export===>",null,null,null,null,null,"No","Scrubber inlet duct measurement; do not use",52071,"3-Source Emissions Survey, Inlet Ducts and Stacks","SP03",6,"Sulfur Dioxide (SO2)","3",40116.415277777778,40116.493055555555,311,null,null,null,4,14.9,null,"EPA Methods 1, 2, 3A, 4, 6C, 17, 26A, 30B",9.31,"parts per million by volume (dry) (ppmvd)",false,null,null,"",54.31,"pound per hour (lb/hr)",false,null,1.54546E-6,1.8844918582248522E-2,8.1621798816566907E-3,1.9810930201342281E-2,-4.2680536912751636E-2,1.9E-2,"pound per million British Thermal Unit (lb/MMBtu)",false,null,"","coal - lignite",100,null,null,"Scrubber inlet duct measurement; do not use"]
["Scrubber inlet duct measurement; do not use","No","Do Not Use",null,"Sandow",52071,"5A","Lignite",100,null,null,"Part II","SO2","26A",13.35,"ppm","No",null,null,1.66E-7,"lb/scf",null,null,null,null,null,null,null,4.0999999999999996,14.9,75.3,"lb/hr",null,2.7E-2,"lb/MMBtu",null,null,9860,11950,1910,2.2160999999999998E-6,2.7183368535714285E-2,6.7914272486772282E-3,2.8407724832214765E-2,5.2137956748695001E-2,"Not used ",10.483442535859748,"Not used ","original database export===>",null,null,null,null,null,"No","Scrubber inlet duct measurement; do not use",52071,"3-Source Emissions Survey, Inlet Ducts and Stacks","SP03",6,"Sulfur Dioxide (SO2)","5",40116.649305555555,40116.779861111114,314,null,null,null,4.0999999999999996,14.9,null,"EPA Methods 1, 2, 3A, 4, 6C, 17, 26A, 30B",13.35,"parts per million by volume (dry) (ppmvd)",false,null,null,"",75.3,"pound per hour (lb/hr)",false,null,2.2160999999999998E-6,2.7183368535714285E-2,-6.7914272486772282E-3,2.8407724832214765E-2,-5.2137956748695001E-2,2.7E-2,"pound per million British Thermal Unit (lb/MMBtu)",false,null,"","coal - lignite",100,null,null,"Scrubber inlet duct measurement; do not use"]
["Scrubber inlet duct measurement; do not use","No","Do Not Use",null,"Sandow",52071,"5A","Lignite",100,null,null,"Part II","SO2","26A",0,"ppm","Yes",0.01,null,1.66E-7,"lb/scf",null,null,null,null,null,null,null,4.0999999999999996,14.9,0,"lb/hr",null,0,"lb/MMBtu",null,null,9860,11950,1910,{"$f":"R15*T15","v":1.6600000000000001E-9},2.036207380952381E-5,null,2.1279194630872485E-5,null,"Not used ",10.483442535859748,"Not used ","original database export===>",null,null,null,null,null,"No","Scrubber inlet duct measurement; do not use",52071,"3-Source Emissions Survey, Inlet Ducts and Stacks","SP03",6,"Sulfur Dioxide (SO2)","7",40122.354166666664,40122.488888888889,297,null,null,null,4.0999999999999996,14.9,null,"EPA Methods 1, 2, 3A, 4, 6C, 17, 26A, 30B",null,"parts per million by volume (dry) (ppmvd)",true,0.01,null,"",null,"pound per hour (lb/hr)",true,0.06,1.6600000000000001E-9,2.036207380952381E-5,0.97963792619047629,2.1279194630872485E-5,0.97872080536912742,null,"pound per million British Thermal Unit (lb/MMBtu)",true,1E-3,"","coal - lignite",100,null,null,"Scrubber inlet duct measurement; do not use"]
["Scrubber inlet duct measurement; do not use","No","Do Not Use",null,"Sandow",52071,"5A","Lignite",100,null,null,"Part II","SO2","26A",1.36,"ppm","No",null,null,1.66E-7,"lb/scf",null,null,null,null,null,null,null,3.7,15.2,7.97,"lb/hr",null,3.0000000000000001E-3,"lb/MMBtu",null,null,9860,11950,1910,2.2576000000000003E-7,2.7048410604651164E-3,-9.8386313178294563E-2,2.8368526315789479E-3,-5.4382456140350706E-2,"Not used ",10.483442535859748,"Not used ","original database export===>",null,null,null,null,null,"No","Scrubber inlet duct measurement; do not use",52071,"3-Source Emissions Survey, Inlet Ducts and Stacks","SP03",6,"Sulfur Dioxide (SO2)","8",40122.550694444442,40122.634027777778,302,null,null,null,3.7,15.2,null,"EPA Methods 1, 2, 3A, 4, 6C, 17, 26A, 30B",1.36,"parts per million by volume (dry) (ppmvd)",false,null,null,"",7.97,"pound per hour (lb/hr)",false,null,2.2576000000000003E-7,2.7048410604651164E-3,9.8386313178294563E-2,2.8368526315789479E-3,5.4382456140350706E-2,3.0000000000000001E-3,"pound per million British Thermal Unit (lb/MMBtu)",false,null,"","coal - lignite",100,null,null,"Scrubber inlet duct measurement; do not use"]
[null,"Yes",null,null,"Sandow",52071,"5A","Lignite",100,null,null,"Part II","SO2","26A",3.01,"ppm","No",null,null,1.66E-7,"lb/scf",null,null,null,null,null,null,{"$f":"BP17","v":19.63},3.59,15.68,17.440000000000001,"lb/hr",null,6.0000000000000001E-3,"lb/MMBtu",null,null,9860,11950,1910,4.9966000000000002E-7,5.9484075586366267E-3,-8.5987402272289012E-3,6.0864196428571434E-3,1.4403273809523881E-2,{"$f":"AH17","v":6.0000000000000001E-3},10.483442535859748,{"$f":"AT17*AU17","v":6.2900655215158488E-2},"original database export===>",null,null,null,null,null,"Yes",null,52071,"2-Source Emissions Survey, Stacks","SP07",6,"Sulfur Dioxide (SO2)","1",40114.727777777778,40114.811805555553,313.33999999999997,328916,8722,19.63,3.59,15.68,null,"EPA Methods 1, 2, 3A, 4, 5B, 6C, 7E, 9, 10, 18, 25A, 26A, 29, 201A, CTM-027, and OTM-028",3.01,"parts per million by volume (dry) (ppmvd)",false,null,null,"",17.440000000000001,"pound per hour (lb/hr)",false,null,4.9966000000000002E-7,5.9484075586366267E-3,8.5987402272289012E-3,6.0864196428571434E-3,-1.4403273809523881E-2,6.0000000000000001E-3,"pound per million British Thermal Unit (lb/MMBtu)",false,null,"","coal - lignite",100]
[null,"Yes",null,null,"Sandow",52071,"5A","Lignite",100,null,null,"Part II","SO2","26A",4.5199999999999996,"ppm","No",null,null,1.66E-7,"lb/scf",null,null,null,null,null,null,17.100000000000001,4.08,15.27,28.17,"lb/hr",null,8.9999999999999993E-3,"lb/MMBtu",null,null,9860,11950,1910,7.5031999999999996E-7,9.192713655172411E-3,2.1412628352490193E-2,9.3851421087098891E-3,4.2793567634432206E-2,{"$f":"AH18","v":8.9999999999999993E-3},10.483442535859748,9.4350982822737725E-2,"original database export===>",null,null,null,null,null,"Yes",null,52071,"2-Source Emissions Survey, Stacks","SP07",6,"Sulfur Dioxide (SO2)","5",40116.385416666664,40116.500694444447,320.17,340004,8316,17.100000000000001,4.08,15.27,null,"EPA Methods 1, 2, 3A, 4, 5B, 6C, 7E, 9, 10, 18, 25A, 26A, 29, 201A, CTM-027, and OTM-028",4.5199999999999996,"parts per million by volume (dry) (ppmvd)",false,null,null,"",28.17,"pound per hour (lb/hr)",false,null,7.5031999999999996E-7,9.192713655172411E-3,-2.1412628352490193E-2,9.3851421087098891E-3,-4.2793567634432206E-2,8.9999999999999993E-3,"pound per million British Thermal Unit (lb/MMBtu)",false,null,"","coal - lignite",100]
[null,"Yes",null,null,"Sandow",52071,"5A","Lignite",100,null,null,"Part II","SO2","26A",28.26,"ppm","No",null,null,1.66E-7,"lb/scf",null,null,null,null,null,null,16.46,5.33,14.56,178.79,"lb/hr",null,6.2E-2,"lb/MMBtu",null,null,9860,11950,1910,4.6911600000000007E-6,6.2089024138728334E-2,1.4358732052957165E-3,6.1539255494505493E-2,-7.4313629918468776E-3,6.2E-2,10.483442535859748,0.64997343722330436,"original database export===>",null,null,null,null,null,"Yes",null,52071,"2-Source Emissions Survey, Stacks","SP07",6,"Sulfur Dioxide (SO2)","9",40122.354166666664,40122.480555555558,297.69,299810,8764,16.46,5.33,14.56,null,"EPA Methods 1, 2, 3A, 4, 5B, 6C, 7E, 9, 10, 18, 25A, 26A, 29, 201A, CTM-027, and OTM-028",28.26,"parts per million by volume (dry) (ppmvd)",false,null,null,"",178.79,"pound per hour (lb/hr)",false,null,4.6911600000000007E-6,6.2089024138728334E-2,-1.4358732052957165E-3,6.1539255494505493E-2,7.4313629918468776E-3,6.2E-2,"pound per million British Thermal Unit (lb/MMBtu)",false,null,"","coal - lignite",100]
[null,null,null,null,"Sandow",null,"5A",null,null,null,null,null,null,null,null,null,null,null,null,null,null,null,null,null,null,null,null,null,null,null,null,null,null,null,null,null,null,null,null,null,null,null,null,null,null,null,10.483442535859748,0,"original database export===>","Key","RTI Calculated QA\nlb/MMBtu","Run Grade","Submitted Value","Submitted Value UOM","Use ?","Comment","facility_id","configuration_id","submittal_id","Location","Method","Run","RunDate","Compound","Fwt","DF","lb/dscf","ppm","ppm converted to lb/dscf","Estimated O2%, assuming lb/MMBtu is correct","ppm@7%O2","ng/dscm","ng/dscm@7%O2","ppm @ 7% converted to lb/dscf","Equation 19-1","lb/mmBtuO2"]
[null,"Yes","A",null,"Sandow",52071,"5A","Lignite",null,null,null,"ERT","SO2","M6C",{"$f":"BS21","v":8.850903656413232},"ppm @ 7% O2",null,null,null,1.66E-7,"lb/scf",null,null,null,null,null,null,null,null,null,null,null,null,{"$f":"BX21","v":2.1816442789244734E-2},"lb/MMBtu",null,null,{"$f":"VLOOKUP(H21,$A$88:$D$104,2,FALSE)","v":9860},{"$f":"VLOOKUP(H21,$A$88:$D$104,3,FALSE)","v":11950},{"$f":"VLOOKUP(H21,$A$88:$D$104,4,FALSE)","v":1910},{"$f":"O21*T21","v":1.4692500069645966E-6},{"$f":"(AO21*AL21*20.9/(20.9-7))","v":2.1782318412605924E-2},-1.5641586013111779E-3,{"$f":"IF(AD21<>\"\",AO21*AN21*100/AD21,\"no CO2 data for run\")","v":"no CO2 data for run"},null,{"$f":"AH21","v":2.1816442789244734E-2},10.483442535859748,{"$f":"AT21*AU21","v":0.22871142431791891},"original database export===>",null,2.1782318412605924E-2,"A",2.1816442789244734E-2,"lb/mmBtuO2","Yes",null,52071,"5A",834,"Stack","Method 6C","1","2010-03-03","Sulfur Dioxide",64.06,1.0971299999999999E-5,1.8240889644432909E-6,10.971299999999999,1.8212357999999999E-6,3.6700000000000017,8.850903656413232,29223491.146290764,23575538.417495161,1.4692500069645966E-6,2.1782318412605924E-2,2.1816442789244734E-2]
[null,"Yes","A",null,"Sandow",52071,"5A","Lignite",null,null,null,"ERT","SO2","M6C",{"$f":"BS22","v":3.7442415402567093},"ppm @ 7% O2",null,null,null,1.66E-7,"lb/scf",null,null,null,null,null,null,null,null,null,null,null,null,{"$f":"BX22","v":9.2291176724012356E-3},"lb/MMBtu",null,null,{"$f":"VLOOKUP(H22,$A$88:$D$104,2,FALSE)","v":9860},{"$f":"VLOOKUP(H22,$A$88:$D$104,3,FALSE)","v":11950},{"$f":"VLOOKUP(H22,$A$88:$D$104,4,FALSE)","v":1910},{"$f":"O22*T22","v":6.2154409568261376E-7},{"$f":"(AO22*AL22*20.9/(20.9-7))","v":9.2146818686114351E-3},-1.5641586013112965E-3,{"$f":"IF(AD22<>\"\",AO22*AN22*100/AD22,\"no CO2 data for run\")","v":"no CO2 data for run"},null,{"$f":"AH22","v":9.2291176724012356E-3},10.483442535859748,{"$f":"AT22*AU22","v":9.6752924775306018E-2},"original database export===>",null,9.2146818686114351E-3,"A",9.2291176724012356E-3,"lb/mmBtuO2","Yes",null,52071,"5A",834,"Stack","Method 6C","2","2010-03-04","Sulfur Dioxide",64.06,4.617E-6,7.6762268362315079E-7,4.617,7.6642200000000006E-7,3.759999999999998,3.7442415402567093,12297982.793508925,9973276.5945025682,6.2154409568261376E-7,9.2146818686114351E-3,9.2291176724012356E-3]
[null,"Yes","A",null,"Sandow",52071,"5A","Lignite",null,null,null,"ERT","SO2","M6C",0.98195993031358875,"ppm @ 7% O2",null,null,null,1.66E-7,"lb/scf",null,null,null,null,null,null,null,null,null,null,null,null,2.4204164312075023E-3,"lb/MMBtu",null,null,{"$f":"VLOOKUP(H23,$A$88:$D$104,2,FALSE)","v":9860},{"$f":"VLOOKUP(H23,$A$88:$D$104,3,FALSE)","v":11950},1910,1.6300534843205574E-7,2.4166305160278749E-3,-1.5641586013109081E-3,{"$f":"IF(AD23<>\"\",AO23*AN23*100/AD23,\"no CO2 data for run\")","v":"no CO2 data for run"},null,2.4204164312075023E-3,10.483442535859748,2.5374296569414579E-2,"original database export===>",null,2.4166305160278749E-3,"A",2.4204164312075023E-3,"lb/mmBtuO2","Yes",null,52071,"5A",834,"Stack","Method 6C","3","2010-03-05","Sulfur Dioxide",64.06,1.2164999999999999E-6,2.0225535946016088E-7,1.2164999999999999,2.0193899999999999E-7,3.6799999999999997,0.98195993031358875,3240306.7074515065,2615578.5849927953,1.6300534843205574E-7,2.4166305160278749E-3,2.4204164312075023E-3]
[null,null,null,null,null,null,null,null,null,null,null,null,null,null,null,null,null,null,null,null,null,null,null,null,null,null,null,null,null,null,null,null,null,null,null,null,null,null,null,null,null,null,null,null,null,null,null,null,"original database export===>"]
[null,null,null,null,null,null,null,null,null,null,null,null,null,null,null,null,null,null,null,null,null,null,null,null,null,null,null,null,null,null,null,null,null,null,null,null,null,null,null,null,null,null,null,null,null,null,null,null,"original database export===>"]
[null,null,null,null,null,null,null,null,null,null,null,null,null,null,null,null,null,null,null,null,null,null,null,null,null,null,null,null,null,null,null,null,null,null,null,null,null,null,null,null,null,null,null,null,null,null,null,null,"original database export===>"]
[null,null,null,null,null,null,null,null,null,null,null,null,null,null,null,null,null,null,null,null,null,null,null,null,null,null,null,null,null,null,null,null,null,null,null,null,null,null,null,null,null,null,null,null,null,null,null,2.5374296569414579E-2]
[null,null,null,null,null,null,null,null,null,null,null,null,null,null,null,null,null,null,null,null,null,null,null,null,null,null,null,null,null,null,null,null,null,null,null,null,null,null,null,null,null,null,null,null,null,null,null,6.2900655215158488E-2]
[null,null,null,null,null,null,null,null,null,null,null,null,null,null,null,null,null,null,null,null,null,null,null,null,null,null,null,null,null,null,null,null,null,null,null,null,null,null,null,null,null,null,null,null,null,null,null,9.4350982822737725E-2]
[null,null,null,null,null,null,null,null,null,null,null,null,null,null,null,null,null,null,null,null,null,null,null,null,null,null,null,null,null,null,null,null,null,null,null,null,null,null,null,null,null,null,null,null,null,null,null,9.6752924775306018E-2]
[null,null,null,null,null,null,null,null,null,null,null,null,null,null,null,null,null,null,null,null,null,null,null,null,null,null,null,null,null,null,null,null,null,null,null,null,null,null,null,null,null,null,null,null,null,null,null,0.22871142431791891]
[null,null,null,null,null,null,null,null,null,null,null,null,null,null,null,null,null,null,null,null,null,null,null,null,null,null,null,null,null,null,null,null,null,null,null,null,null,null,null,null,null,null,null,null,null,null,null,0.64997343722330436]
[]
[]
[]
[]
[]
[]
[]
[]
[]
[]
[]
[]
[]
[]
[]
[]
[]
[]
[]
[]
[]
[]
[]
[]
[]
[]
[]
[]
[]
[]
[]
[]
[]
[]
[]
[]
[]
[]
[]
[]
[]
[]
[]
[]
[]
[]
[]
[]
[]
[]
[]
[]
[]
[]
["Conversions"]
[1,"ppm SO2=",1.66E-7,"lb/scf"]
[1,"ppm Hg=",{"$f":"C88*A94/A95","v":5.1979300655635339E-7},"lb/scf"]
[1000,"mg=",1,"g"]
[1000000,"ug=",1,"g"]
[454,"g=",1,"lb"]
[1,"m^3=",35.314500000000002,"ft^3"]
[200.59,"Hg molecular weight"]
[64.06,"SO2 molecular weight"]
[]
["Table 19-2","Fd","Fw","Fc"]
["Fuel Type","dscf/MMBtu","wscf/MMBtu","scf/MMBtu"]
["Coal"]
["Anthracite",10100,10540,1970]
["Bituminous",9780,10640,1800]
["Lignite",9860,11950,1910]
["Oil",9190,10320,1420]
["Subbituminous",9820,null,1840]
["Petroleum Coke",9830,null,1850]

{"sheet":"lognormal distribution 99 %","index":4,"n_rows":110,"n_cols":33,"rows_kept":110,"cut":false,"hidden":false,"merged":[]}
[]
[null,null,null,null,null,null,null,null,null,null,null,null,null,null,null,"distribution of Z"]
[null,null,null,null,null,null,null,null,null,null,null,null,null,"Normal "]
[null,null,null,null,null,null,null,null,null,null,null,null,null,"distribution"]
["∆z","z",null,null,null,null,null,null,null,null,null,null,null,null,null,null,null,null,null,null,null,"Absolute values"]
[null,null,null,null,null,null,null,null,null,null,null,null,null,null,null,null,null,null,null,null,null,null,null,null,null,null,null,null,null,"Cumulative","normalization"]
[0.10100000000000001,null,null,{"$f":"'Lognormal Template'!C121","v":16.238401020032494},null,{"$f":"'Lognormal Template'!F125","v":4.9208241593683519}]
[]
[null,-5,"=f(a)",null,null,null,{"$f":"(1-($F$7/6)*(3*B9-B9^3)+(($D$7-3)*(3-6*B9^2+B9^4))/24)","v":174.4497107272274},null,null,null,null,null,null,{"$f":"NORMDIST(B9,0,1,FALSE)","v":1.4867195147342977E-6},null,{"$f":"G9*N9","v":2.5935778927792214E-4},null,null,null,null,null,{"$f":"ABS(P9)","v":2.5935778927792214E-4},null,null,{"$f":"($A$7/2)*V9","v":1.3097568358535069E-5},null,null,null,null,{"$f":"Y9","v":1.3097568358535069E-5},{"$f":"AD9/SUM($Y$9:$Y$108)","v":6.0232804282576871E-6},{"$f":"IF(AE9>0.99,\"x\",\"\")","v":""},9]
[1,{"$f":"$B$9+A10*$A$7","v":-4.899},null,null,null,null,156.57495608088533,null,null,null,null,null,null,2.4509397556839956E-6,null,3.8375578460311745E-4,null,null,null,null,null,3.8375578460311745E-4,null,null,{"$f":"($A$7)*V10","v":3.8759334244914867E-5},null,null,null,null,{"$f":"Y10+AD9","v":5.1856902603449935E-5},2.3847836328938276E-5,{"$f":"IF(AE10>0.99,\"x\",\"\")","v":""},10]
[2,-4.798,null,null,null,null,140.00742978106712,null,null,null,null,null,null,3.9995026854766194E-6,null,5.5996009139605714E-4,null,null,null,null,null,5.5996009139605714E-4,null,null,5.6555969231001776E-5,null,null,null,null,1.0841287183445171E-4,4.9856668903440529E-5,"",11]
[3,-4.6970000000000001,null,null,null,null,124.68607045875618,null,null,null,null,null,null,6.4602468217096111E-6,null,8.0550279039264027E-4,null,null,null,null,null,8.0550279039264027E-4,null,null,8.1355781829656675E-5,null,null,null,null,1.897686536641084E-4,8.7270383801202052E-5,"",12]
[4,-4.5960000000000001,null,null,null,null,110.551194338255,null,null,null,null,null,null,1.0329088331249594E-5,null,1.141893051444976E-3,null,null,null,null,null,1.141893051444976E-3,null,null,1.1533119819594259E-4,null,null,null,null,3.0509985186005101E-4,1.4030863715060673E-4,"",13]
[5,-4.4950000000000001,null,null,null,null,97.544495237184847,null,null,null,null,null,null,1.6347247339999862E-5,null,1.5945839902976992E-3,null,null,null,null,null,1.5945839902976992E-3,null,null,1.6105298302006762E-4,null,null,null,null,4.6615283488011866E-4,2.14373322593164E-4,"",14]
[6,-4.3940000000000001,null,null,null,null,85.609044566485267,null,null,null,null,null,null,2.5609260510355175E-5,null,2.1923843243457273E-3,null,null,null,null,null,2.1923843243457273E-3,null,null,2.2143081675891847E-4,null,null,null,null,6.8758365163903708E-4,3.1620443110789623E-4,"",15]
[7,-4.2930000000000001,null,null,null,null,74.689291330415159,null,null,null,null,null,null,3.97117663248513E-5,null,2.9660436842821889E-3,null,null,null,null,null,2.9660436842821889E-3,null,null,2.9957041211250111E-4,null,null,null,null,9.8715406375153819E-4,4.5397020188064251E-4,"",16]
[8,-4.1920000000000002,null,null,null,null,64.731062126551763,null,null,null,null,null,null,6.0955252216615318E-5,null,3.9456982181733579E-3,null,null,null,null,null,3.9456982181733579E-3,null,null,3.9851552003550918E-4,null,null,null,null,1.3856695837870473E-3,6.3723862747527642E-4,"",17]
[9,-4.0910000000000002,null,null,null,null,55.681561145791107,null,null,null,null,null,null,9.2613185614433534E-5,null,5.1568467576965822E-3,null,null,null,null,null,5.1568467576965822E-3,null,null,5.208415225273548E-4,null,null,null,null,1.9065111063144022E-3,8.7676206136662186E-4,"",18]
[10,-3.99,null,null,null,null,47.489370172348131,null,null,null,null,null,null,1.3928497646575994E-4,null,6.6145558068292712E-3,null,null,null,null,null,6.6145558068292712E-3,null,null,6.6807013648975645E-4,null,null,null,null,2.5745812428041586E-3,1.1839926607931145E-3,"",19]
[11,-3.8890000000000002,null,null,null,null,40.104448583756358,null,null,null,null,null,null,2.0735069214939127E-4,null,8.3156851721115557E-3,null,null,null,null,null,8.3156851721115557E-3,null,null,8.3988420238326721E-4,null,null,null,null,3.4144654451874258E-3,1.5702367283738979E-3,"",20]
[12,-3.7879999999999998,null,null,null,null,33.478133350868099,null,null,null,null,null,null,3.0554590364653618E-4,null,1.0229106507090234E-2,null,null,null,null,null,1.0229106507090234E-2,null,null,1.0331397572161138E-3,null,null,null,null,4.4476052024035395E-3,2.0453547280627144E-3,"",21]
[13,-3.6869999999999998,null,null,null,null,27.563139037854512,null,null,null,null,null,null,4.4567390271459394E-4,null,1.2284171746065598E-2,null,null,null,null,null,1.2284171746065598E-2,null,null,1.2407013463526255E-3,null,null,null,null,5.6883065487561653E-3,2.6159256869024801E-3,"",22]
[14,-3.5859999999999999,null,null,null,null,22.313557802205324,null,null,null,null,null,null,6.4346911127639178E-4,null,1.4358085208399457E-2,null,null,null,null,null,1.4358085208399457E-2,null,null,1.4501666060483453E-3,null,null,null,null,7.1384731548045106E-3,3.2828250606501148E-3,"",23]
[15,-3.4849999999999999,null,null,null,null,17.684859394729131,null,null,null,null,null,null,9.196190652258089E-4,null,1.6263333865230666E-2,null,null,null,null,null,1.6263333865230666E-2,null,null,1.6425967203882975E-3,null,null,null,null,8.7810698751928078E-3,4.0382187647790002E-3,"",24]
[16,-3.3839999999999999,null,null,null,null,13.633891159553212,null,null,null,null,null,null,1.3009421669529307E-3,null,1.773690390910956E-2,null,null,null,null,null,1.773690390910956E-2,null,null,1.7914272948200657E-3,null,null,null,null,1.0572497170012874E-2,4.8620563404389748E-3,"",25]
[17,-3.2829999999999999,null,null,null,null,10.118878034123608,null,null,null,null,null,null,1.8217038523946315E-3,null,1.8433599096674393E-2,null,null,null,null,null,1.8433599096674393E-2,null,null,1.8617935087641138E-3,null,null,null,null,1.2434290678776987E-2,5.7182537731088629E-3,"",26]
[18,-3.1819999999999999,null,null,null,null,7.0994225492051086,null,null,null,null,null,null,2.5250345499379808E-3,null,1.7926287221351672E-2,null,null,null,null,null,1.7926287221351672E-2,null,null,1.810555009356519E-3,null,null,null,null,1.4244845688133506E-2,6.5508877593277205E-3,"",27]
[19,-3.081,null,null,null,null,4.5365048288812559,null,null,null,null,null,null,3.4643888734137819E-3,null,1.5716216853364117E-2,null,null,null,null,null,1.5716216853364117E-2,null,null,1.5873379021897759E-3,null,null,null,null,1.5832183590323283E-2,7.2808691617962827E-3,"",28]
[20,-2.98,null,null,null,null,2.392482590554291,null,null,null,null,null,null,4.7049575269339792E-3,null,1.1256528972486917E-2,null,null,null,null,null,1.1256528972486917E-2,null,null,1.1369094262211788E-3,null,null,null,null,1.6969093016544461E-2,7.8037085246614691E-3,"",29]
[21,-2.879,null,null,null,null,0.63109114494524299,null,null,null,null,null,null,6.3249127862128329E-3,null,3.9915964519298634E-3,null,null,null,null,null,3.9915964519298634E-3,null,null,4.0315124164491624E-4,null,null,null,null,1.7372244258189378E-2,7.9891088155364699E-3,"",30]
[22,-2.778,null,null,null,null,-0.78255660390611403,null,null,null,null,null,null,8.416337402369389E-3,null,-6.586260414926195E-3,null,null,null,null,null,6.586260414926195E-3,null,null,6.6521230190754572E-4,null,null,null,null,1.8037456560096924E-2,8.2950251603902802E-3,"",31]
[23,-2.677,null,null,null,null,-1.8819701586412965,null,null,null,null,null,null,1.1085658498589472E-2,null,-2.0862878483233666E-2,null,null,null,null,null,2.0862878483233666E-2,null,null,2.1071507268066005E-3,null,null,null,null,2.0144607286903524E-2,9.2640569214570128E-3,"",32]
[24,-2.5759999999999996,null,null,null,null,-2.6992814285830584,null,null,null,null,null,null,1.4453386482878732E-2,null,-3.9013757713367972E-2,null,null,null,null,null,3.9013757713367972E-2,null,null,3.9403895290501655E-3,null,null,null,null,2.4084996815953691E-2,1.1076154440655912E-2,"",33]
[25,-2.4749999999999996,null,null,null,null,-3.2652447297354068,null,null,null,null,null,null,1.8652948792269922E-2,null,-6.0906442737983783E-2,null,null,null,null,null,6.0906442737983783E-2,null,null,6.1515507165363628E-3,null,null,null,null,3.0236547532490055E-2,1.3905115818834378E-2,"",34]
[26,-2.3739999999999997,null,null,null,null,-3.6092367847836071,null,null,null,null,null,null,2.3828414277471986E-2,null,-8.6002389333314791E-2,null,null,null,null,null,8.6002389333314791E-2,null,null,8.686241322664795E-3,null,null,null,null,3.892278885515485E-2,1.7899725041074913E-2,"",35]
[27,-2.2729999999999997,null,null,null,null,-3.7592567230941896,null,null,null,null,null,null,3.0130930809477742E-2,null,-0.11326990421861505,null,null,null,null,null,0.11326990421861505,null,null,1.144026032608012E-2,null,null,null,null,5.0363049181234971E-2,2.3160846359930046E-2,"",36]
[28,-2.1719999999999997,null,null,null,null,-3.741926080714931,null,null,null,null,null,null,3.7713749861696219E-2,null,-0.14112206420904019,null,null,null,null,null,0.14112206420904019,null,null,1.425332848511306E-2,null,null,null,null,6.4616377666348035E-2,2.971563516895075E-2,"",37]
[29,-2.0709999999999997,null,null,null,null,-3.5824888003748723,null,null,null,null,null,null,4.6725789305731173E-2,null,-0.1673946168764579,null,null,null,null,null,0.1673946168764579,null,null,1.6906856304522249E-2,null,null,null,null,8.1523233970870287E-2,3.7490722413754708E-2,"",38]
[30,-1.9699999999999998,null,null,null,null,-3.3048112314843081,null,null,null,null,null,null,5.7303788919117152E-2,null,-0.18937820522650439,null,null,null,null,null,0.18937820522650439,null,null,1.9127198727876944E-2,null,null,null,null,0.10065043269874724,4.6286895763744569E-2,"",39]
[31,-1.8689999999999998,null,null,null,null,-2.9313821301347875,null,null,null,null,null,null,6.9563238531014968E-2,null,-0.20391643434412099,null,null,null,null,null,0.20391643434412099,null,null,2.0595559868756223E-2,null,null,null,null,0.12124599256750346,5.5758335749446143E-2,"",40]
[32,-1.7679999999999998,null,null,null,null,-2.4833126590991172,null,null,null,null,null,null,8.3588399272377337E-2,null,-0.20757613006692607,null,null,null,null,null,0.20757613006692607,null,null,2.0965189136759536E-2,null,null,null,null,0.142211181704263,6.5399760015796629E-2,"",41]
[33,-1.6669999999999998,null,null,null,null,-1.9803363878313658,null,null,null,null,null,null,9.9421883540771347E-2,null,-0.19688877372252184,null,null,null,null,null,0.19688877372252184,null,null,1.9885766145974707E-2,null,null,null,null,0.1620969478502377,7.4544781652572847E-2,"",42]
[34,-1.5659999999999998,null,null,null,null,-1.440809292466851,null,null,null,null,null,null,0.11705439552546529,null,-0.16865306079718057,null,null,null,null,null,0.16865306079718057,null,null,1.703395914051524E-2,null,null,null,null,0.17913090699075296,8.2378320665174892E-2,"",43]
[35,-1.4649999999999999,null,null,null,null,-0.88170975582215139,null,null,null,null,null,null,0.13641534591340351,null,-0.12027874133570132,null,null,null,null,null,0.12027874133570132,null,null,1.2148152874905834E-2,null,null,null,null,0.1912790598656588,8.7964986025330857E-2,"",44]
[36,-1.3639999999999999,null,null,null,null,-0.31863856739510199,null,null,null,null,null,null,0.15736512556566029,null,-5.0142598168192332E-2,null,null,null,null,null,5.0142598168192332E-2,null,null,5.0644024149874255E-3,null,null,null,null,0.19634346228064622,9.0293992075307805E-2,"",45]
[37,-1.2629999999999999,null,null,null,null,0.23418107663520837,null,null,null,null,null,null,0.17968983860954071,null,4.2079959865989079E-2,null,null,null,null,null,4.2079959865989079E-2,null,null,4.2500759464648976E-3,null,null,null,null,0.20059353822711112,9.224850749116123E-2,"",46]
[38,-1.1619999999999999,null,null,null,null,0.76390357340843185,null,null,null,null,null,null,0.20309924389892503,null,0.15514823817093948,null,null,null,null,null,0.15514823817093948,null,null,1.5669972055264887E-2,null,null,null,null,0.216263510282376,9.9454779175196059E-2,"",47]
[39,-1.0609999999999999,null,null,null,null,1.2590609133829633,null,null,null,null,null,null,0.22722852877998642,null,0.28609455899239666,null,null,null,null,null,0.28609455899239666,null,null,2.8895550458232066E-2,null,null,null,null,0.24515906074060806,0.11274320026027358,"",48]
[40,-0.96,null,null,null,null,1.7095626803359427,null,null,null,null,null,null,0.25164434109811712,null,0.4302017742590693,null,null,null,null,null,0.4302017742590693,null,null,4.3450379200165999E-2,null,null,null,null,0.28860943994077404,0.1327250634178106,"",49]
[41,-0.85899999999999999,null,null,null,null,2.1066960513632536,null,null,null,null,null,null,0.27585524287120494,null,0.58114315090461877,null,null,null,null,null,0.58114315090461877,null,null,5.8695458241366502E-2,null,null,null,null,0.34730489818214055,0.15971779941085884,"",50]
[42,-0.75800000000000001,null,null,null,null,2.443125796879523,null,null,null,null,null,null,0.29932643861165642,null,0.73129214386021268,null,null,null,null,null,0.73129214386021268,null,null,7.3860506529881492E-2,null,null,null,null,0.42116540471202202,0.19368460387595829,"",51]
[43,-0.65700000000000003,null,null,null,null,2.7128942806181171,null,null,null,null,null,null,0.32149829672959446,null,0.87219089042618314,null,null,null,null,null,0.87219089042618314,null,null,8.8091279933044497E-2,null,null,null,null,0.50925668464506657,0.23419582456946283,"",52]
[44,-0.55600000000000005,null,null,null,null,2.9114214596311512,null,null,null,null,null,null,0.34180785297801497,null,0.99514671823064227,null,null,null,null,null,0.99514671823064227,null,null,0.10050981854129487,null,null,null,null,0.6097665031863615,0.28041805500913092,"",53]
[45,-0.45500000000000007,null,null,null,null,3.0355048842894816,null,null,null,null,null,null,0.35971219226542389,null,1.0919081165601714,null,null,null,null,null,1.0919081165601714,null,null,0.11028271977257732,null,null,null,null,0.72004922295893881,0.33113462539819272,"",54]
[46,-0.35400000000000009,null,null,null,null,3.0833196982827085,null,null,null,null,null,null,0.37471238028421117,null,1.1553580633207094,null,null,null,null,null,1.1553580633207094,null,null,0.11669116439539166,null,null,null,null,0.83674038735433043,0.38479829696019979,"",55]
[47,-0.25300000000000011,null,null,null,null,3.0544186386191736,null,null,null,null,null,null,0.38637648574037453,null,1.1801555395695753,null,null,null,null,null,1.1801555395695753,null,null,0.11919570949652711,null,null,null,null,0.95593609685085756,0.43961375311888951,"",56]
[48,-0.15199999999999925,null,null,null,null,2.9497320356259635,null,null,null,null,null,null,0.39436021613719047,null,1.1632569631162497,null,null,null,null,null,1.1632569631162497,null,null,0.11748895327474122,null,null,null,null,1.0734250501255989,0.49364431004551756,"",57]
[49,-5.0999999999999268E-2,null,null,null,null,2.7715678129489087,null,null,null,null,null,null,0.39842379318515947,null,1.1042585611050009,null,null,null,null,null,1.1042585611050009,null,null,0.11153011467160509,null,null,null,null,1.1849551647972039,0.54493452960944511,"",58]
[50,5.0000000000000711E-2,null,null,null,null,2.523611487552583,null,null,null,null,null,null,0.39844391409476398,null,1.0055176387549609,null,null,null,null,null,1.0055176387549609,null,null,0.10155728151425106,null,null,null,null,1.286512446311455,0.59163846497720551,"",59]
[51,0.15100000000000069,null,null,null,null,2.2109261697203029,null,null,null,null,null,null,0.39441996623589087,null,0.87203342521112936,null,null,null,null,null,0.87203342521112936,null,null,8.8075375946324072E-2,null,null,null,null,1.374587822257779,0.63214237178088539,"",60]
[52,0.25200000000000067,null,null,null,null,1.8399525630541285,null,null,null,null,null,null,0.38647405812101859,null,0.71109393379369834,null,null,null,null,null,0.71109393379369834,null,null,7.1820487313163539E-2,null,null,null,null,1.4464083095709426,0.66517101677355728,"",61]
[53,0.35300000000000065,null,null,null,null,1.4185089644748632,null,null,null,null,null,null,0.37484486452585164,null,0.53172080061728622,null,null,null,null,null,0.53172080061728622,null,null,5.3703800862345913E-2,null,null,null,null,1.5001121104332884,0.68986820054098719,"",62]
[54,0.45400000000000063,null,null,null,null,0.95579126422205318,null,null,null,null,null,null,0.3598757186153565,null,0.34396606805819147,null,null,null,null,null,0.34396606805819147,null,null,3.4740572873877343E-2,null,null,null,null,1.5348526833071658,0.7058446174551487,"",63]
[55,0.5550000000000006,null,null,null,null,0.46237294585398991,null,null,null,null,null,null,0.3419977799876871,null,0.15813052100843161,null,null,null,null,null,0.15813052100843161,null,null,1.5971182621851595E-2,null,null,null,null,1.5508238659290174,0.71318940918052576,"",64]
[56,0.65600000000000058,null,null,null,null,-4.979491375229389E-2,null,null,null,null,null,null,0.3217094296581981,null,-1.6019493303129632E-2,null,null,null,null,null,1.6019493303129632E-2,null,null,1.6179688236160929E-3,null,null,null,null,1.5524418347526336,0.71393347706259691,"",65]
[57,0.75700000000000056,null,null,null,null,-0.56738364440102063,null,null,null,null,null,null,0.29955326428828344,null,-0.16996162278410837,null,null,null,null,null,0.16996162278410837,null,null,1.7166123901194947E-2,null,null,null,null,1.5696079586538285,0.72182779570959488,"",66]
[58,0.85800000000000054,null,null,null,null,-1.0756869825776703,null,null,null,null,null,null,0.27609216628203237,null,-0.29698874926125179,null,null,null,null,null,0.29698874926125179,null,null,2.9995863675386432E-2,null,null,null,null,1.5996038223292151,0.73562222637480346,"",67]
[59,0.95900000000000052,null,null,null,null,-1.5586210714489783,null,null,null,null,null,null,0.25188590971741259,null,-0.39259468648665424,null,null,null,null,null,0.39259468648665424,null,null,3.9652063335152081E-2,null,null,null,null,1.6392558856643671,0.75385732853183995,"",68]
[60,1.0600000000000005,null,null,null,null,-1.9987244608629382,null,null,null,null,null,null,0.22746963245738577,null,-0.45464911849607909,null,null,null,null,null,0.45464911849607909,null,null,4.5919560968103991E-2,null,null,null,null,1.6851754466324711,0.77497471347552127,"",69]
[61,1.1610000000000005,null,null,null,null,-2.3771581073487988,null,null,null,null,null,null,0.20333528072256271,null,-0.48336011107968385,null,null,null,null,null,0.48336011107968385,null,null,4.8819371219048072E-2,null,null,null,null,1.7339948178515192,0.79742565666849341,"",70]
[62,1.2620000000000005,null,null,null,null,-2.6737053741170671,null,null,null,null,null,null,0.17991684029544777,null,-0.48104462279210081,null,null,null,null,null,0.48104462279210081,null,null,4.8585506902002182E-2,null,null,null,null,1.7825803247535215,0.81976905086266127,"",71]
[63,1.3630000000000004,null,null,null,null,-2.8667720310595044,null,null,null,null,null,null,0.15757983926216645,null,-0.45174547585563118,null,null,null,null,null,0.45174547585563118,null,null,4.562629306141875E-2,null,null,null,null,1.8282066178149403,0.84075156841766263,"",72]
[64,1.4640000000000004,null,null,null,null,{"$f":"(1-($F$7/6)*(3*B73-B73^3)+(($D$7-3)*(3-6*B73^2+B73^4))/24)","v":-2.9333862547491316},null,null,null,null,null,null,{"$f":"NORMDIST(B73,0,1,FALSE)","v":0.1366152725480389},null,{"$f":"G73*N73","v":-0.40074536268122368},null,null,null,null,null,{"$f":"ABS(P73)","v":0.40074536268122368},null,null,4.0475281630803592E-2,null,null,null,null,1.8686818994457439,{"$f":"AD73/SUM($Y$9:$Y$108)","v":0.85936525036238554},"",73]
[65,{"$f":"$B$9+A74*$A$7","v":1.5650000000000004},null,null,null,null,-2.8491986284402224,null,null,null,null,null,null,0.11723778769442594,null,-0.33403374390032436,null,null,null,null,null,0.33403374390032436,null,null,{"$f":"($A$7)*V74","v":3.3737408133932764E-2},null,null,null,null,{"$f":"Y74+AD73","v":1.9024193075796767},0.87488033412072574,{"$f":"IF(AE74>0.99,\"x\",\"\")","v":""},74]
[66,1.6660000000000004,null,null,null,null,-2.5884821420683108,null,null,null,null,null,null,9.9587708244748885E-2,null,-0.25778100436104157,null,null,null,null,null,0.25778100436104157,null,null,2.6035881440465199E-2,null,null,null,null,1.9284551890201418,0.88685365701700203,"",75]
[67,1.7670000000000003,null,null,null,null,-2.1241321922501859,null,null,null,null,null,null,8.3736272412481758E-2,null,-0.17786691189038364,null,null,null,null,null,0.17786691189038364,null,null,1.796455810092875E-2,null,null,null,null,1.9464197471210705,0.89511515779711504,"",76]
[68,1.8680000000000003,null,null,null,null,-1.4276665822838928,null,null,null,null,null,null,6.9693338950675629E-2,null,-9.9498851027663981E-2,null,null,null,null,null,9.9498851027663981E-2,null,null,1.0049383953794063E-2,null,null,null,null,1.9564691310748645,0.89973664600225123,"",77]
[69,1.9690000000000003,null,null,null,null,-0.46922552214873336,null,null,null,null,null,null,5.7416759943091943E-2,null,-2.6941409164385796E-2,null,null,null,null,null,2.6941409164385796E-2,null,null,2.7210823256029657E-3,null,null,null,null,1.9591902134004675,0.90098801125317607,"",78]
[70,2.0700000000000003,null,null,null,null,0.78242837149473043,null,null,null,null,null,null,4.6822635277683121E-2,null,3.6635358269409321E-2,null,null,null,null,null,3.6635358269409321E-2,null,null,3.7001711852103418E-3,null,null,null,null,1.9628903845856778,0.90268963769794708,"",79]
[71,2.1710000000000003,null,null,null,null,2.3599100753046871,null,null,null,null,null,null,3.7795734251856623E-2,null,8.9194534064494901E-2,null,null,null,null,null,8.9194534064494901E-2,null,null,9.008647940513986E-3,null,null,null,null,1.9718990325261918,0.90683251455415392,"",80]
[72,2.2720000000000002,null,null,null,null,4.2972121592580663,null,null,null,null,null,null,3.0199481210634573E-2,null,0.12977357786162438,null,null,null,null,null,0.12977357786162438,null,null,1.3107131364024064E-2,null,null,null,null,1.9850061638902159,0.91286019279597674,"",81]
[73,2.3730000000000002,null,null,null,null,6.6297047866505361,null,null,null,null,null,null,2.3885038190605869E-2,null,0.15835075202159057,null,null,null,null,null,0.15835075202159057,null,null,1.599342595418065E-2,null,null,null,null,2.0009995898443966,0.92021521373525128,"",82]
[74,2.4740000000000002,null,null,null,null,9.3941357140965103,null,null,null,null,null,null,1.8699162668593644E-2,null,0.17566247184873576,null,null,null,null,null,0.17566247184873576,null,null,1.7741909656722312E-2,null,null,null,null,2.018741499501119,0.92837432344706383,"",83]
[75,2.5750000000000002,null,null,null,null,12.628630291529145,null,null,null,null,null,null,1.4490659157048438E-2,null,0.18299717717492608,null,null,null,null,null,0.18299717717492608,null,null,1.8482714894667535E-2,null,null,null,null,2.0372242143957866,0.9368741130140007,"",84]
[76,2.6760000000000002,null,null,null,null,16.372691462200343,null,null,null,null,null,null,1.1115369005911058E-2,null,0.18198850722228629,null,null,null,null,null,0.18198850722228629,null,null,1.8380839229450916E-2,null,null,null,null,2.0556050536252375,0.94532705222798508,"",85]
[77,2.7770000000000001,null,null,null,null,20.667199762680752,null,null,null,null,null,null,8.4397462735252959E-3,null,0.17442592218128775,null,null,null,null,null,0.17442592218128775,null,null,1.7617018140310064E-2,null,null,null,null,2.0732220717655476,0.95342872710870008,"",86]
[78,2.8780000000000001,null,null,null,null,25.554413322859766,null,null,null,null,null,null,6.3431452761899725E-3,null,0.16209535615470402,null,null,null,null,null,0.16209535615470402,null,null,1.6371630971625108E-2,null,null,null,null,2.0895937027371727,0.96095767612508642,"",87]
[79,2.9790000000000001,null,null,null,null,31.077967865945499,null,null,null,null,null,null,4.7189968525847836E-3,null,0.14665683254412787,null,null,null,null,null,0.14665683254412787,null,null,1.4812340086956916E-2,null,null,null,null,2.1044060428241296,0.96776954193866127,"",88]
[80,3.08,null,null,null,null,37.282876708464826,null,null,null,null,null,null,3.4750773778549375E-3,null,0.12956088143094088,null,null,null,null,null,0.12956088143094088,null,null,1.3085649024525031E-2,null,null,null,null,2.1174916918486546,0.97378734093026631,"",89]
[81,3.1810000000000009,null,null,null,null,44.215530760263476,null,null,null,null,null,null,2.5330807400485967E-3,null,0.11200150937984969,null,null,null,null,null,0.11200150937984969,null,null,1.1312152447364819E-2,null,null,null,null,2.1288038442960193,0.97898954828452522,"",90]
[82,3.282,null,null,null,null,51.923698524505539,null,null,null,null,null,null,1.8276934202903908E-3,null,9.4900602150380653E-2,null,null,null,null,null,9.4900602150380653E-2,null,null,9.5849608171884471E-3,null,null,null,null,2.1383888051132076,0.98339745861684003,"",91]
[83,3.3830000000000009,null,null,null,null,60.456526097674455,null,null,null,null,null,null,1.305351359820449E-3,null,7.8917008551619816E-2,null,null,null,null,null,7.8917008551619816E-2,null,null,7.9706178637136017E-3,null,null,null,null,2.1463594229769214,0.98706296852413089,"",92]
[84,3.484,null,null,null,null,69.864537169571776,null,null,null,null,null,null,9.2282906723667468E-4,null,6.4473025669117903E-2,null,null,null,null,null,6.4473025669117903E-2,null,null,6.5117755925809089E-3,null,null,null,null,2.1528711985695024,0.99005758931222854,"x",93]
[85,3.5850000000000009,null,null,null,null,80.19963302331837,null,null,null,null,null,null,6.4578041088110192E-4,null,5.1791351966312127E-2,null,null,null,null,null,5.1791351966312127E-2,null,null,5.2309265485975254E-3,null,null,null,null,2.1581021251180998,0.9924631761081385,"x",94]
[86,3.6859999999999999,null,null,null,null,91.515092535353261,null,null,null,null,null,null,4.4731991169886799E-4,null,4.0936523112027952E-2,null,null,null,null,null,4.0936523112027952E-2,null,null,4.1345888343148236E-3,null,null,null,null,2.1622367139524146,0.99436458156928209,"x",95]
[87,3.7870000000000008,null,null,null,null,103.86557217543486,null,null,null,null,null,null,3.0670535307791695E-4,null,3.1856126986706618E-2,null,null,null,null,null,3.1856126986706618E-2,null,null,3.2174688256573687E-3,null,null,null,null,2.1654541827780718,0.99584422393308636,"x",96]
[88,3.8879999999999999,null,null,null,null,117.30710600663964,null,null,null,null,null,null,2.0815854496572918E-4,null,2.4418476500482657E-2,null,null,null,null,null,2.4418476500482657E-2,null,null,2.4662661265487484E-3,null,null,null,null,2.1679204489046207,0.99697840488059308,"x",97]
[89,3.9890000000000008,null,null,null,null,131.89710568536361,null,null,null,null,null,null,1.3984176379239904E-4,null,1.8444723898153711E-2,null,null,null,null,null,1.8444723898153711E-2,null,null,1.8629171137135249E-3,null,null,null,null,2.1697833660183341,0.99783511903419275,"x",98]
[90,4.09,null,null,null,null,147.69436046132051,null,null,null,null,null,null,9.2992795718445907E-5,null,1.3734511491146092E-2,null,null,null,null,null,1.3734511491146092E-2,null,null,1.3871856606057554E-3,null,null,null,null,2.1711705516789399,0.99847305487168292,"x",99]
[91,4.1910000000000007,null,null,null,null,164.75903717754403,null,null,null,null,null,null,6.1211282356604617E-5,null,1.0085111945476965E-2,null,null,null,null,null,1.0085111945476965E-2,null,null,1.0185963064931736E-3,null,null,null,null,2.1721891479854332,0.99894148466179722,"x",100]
[92,4.2919999999999998,null,null,null,null,183.15268027038528,null,null,null,null,null,null,3.988259546153366E-5,null,7.304604254919393E-3,null,null,null,null,null,7.304604254919393E-3,null,null,7.3776502974685877E-4,null,null,null,null,2.1729269130151798,0.99928076639277819,"x",101]
[93,4.3930000000000007,null,null,null,null,202.93821176951553,null,null,null,null,null,null,2.5722022324537423E-5,null,5.219981213637182E-3,null,null,null,null,null,5.219981213637182E-3,null,null,5.2721810257735544E-4,null,null,null,null,2.1734541311177571,0.99952322227403401,"x",102]
[94,4.4939999999999998,null,null,null,null,224.17993129792336,null,null,null,null,null,null,1.6420885402344505E-5,null,3.6812329613486639E-3,null,null,null,null,null,3.6812329613486639E-3,null,null,3.7180452909621508E-4,null,null,null,null,2.1738259356468532,0.99969420690888666,"x",103]
[95,4.5950000000000006,null,null,null,null,246.94351607191743,null,null,null,null,null,null,1.0376664891989014E-5,null,2.5624501135277904E-3,null,null,null,null,null,2.5624501135277904E-3,null,null,2.5880746146630685E-4,null,null,null,null,2.1740847431083195,0.99981322670513162,"x",104]
[96,4.6960000000000015,null,null,null,null,271.29602090112434,null,null,null,null,null,null,6.4906587297709424E-6,null,1.7608898864140028E-3,null,null,null,null,null,1.7608898864140028E-3,null,null,1.778498785278143E-4,null,null,null,null,2.1742625929868473,{"$f":"AD105/SUM($Y$9:$Y$108)","v":0.99989501590929386},"x",105]
[97,{"$f":"$B$9+A106*$A$7","v":4.7970000000000006},null,null,null,null,297.30587818848886,null,null,null,null,null,null,4.0187363995916616E-6,null,1.1947939544886448E-3,null,null,null,null,null,1.1947939544886448E-3,null,null,1.2067418940335313E-4,null,null,null,null,2.1743832671762506,{"$f":"AD106/SUM($Y$9:$Y$108)","v":0.99995051128548362},"x",106]
[98,{"$f":"$B$9+A107*$A$7","v":4.8980000000000015},null,null,null,null,325.04289793027658,null,null,null,null,null,null,2.4629751376704828E-6,null,8.0057257627863564E-4,null,null,null,null,null,8.0057257627863564E-4,null,null,8.085783020414221E-5,null,null,null,null,2.1744641250064549,{"$f":"AD107/SUM($Y$9:$Y$108)","v":0.99998769600350224},"x",107]
[99,{"$f":"$B$9+A108*$A$7","v":4.9990000000000006},null,null,null,null,354.57826771606904,null,null,null,null,null,null,1.4941709802283004E-6,null,5.2980055784097163E-4,null,null,null,null,null,5.2980055784097163E-4,null,null,{"$f":"($A$7/2)*V108","v":2.6754928170969071E-5},null,null,null,null,2.1744908799346261,{"$f":"AD108/SUM($Y$9:$Y$108)","v":1},"x",108]
[]
[null,null,null,null,null,null,null,null,null,null,null,null,null,null,null,null,null,null,null,null,null,null,null,null,null,null,null,null,null,{"$f":"SUM($AD$9:$AD$108)","v":106.34373424362219}]

{"sheet":"Part II","index":5,"n_rows":36,"n_cols":48,"rows_kept":36,"cut":false,"hidden":false,"merged":[]}
["Key","RTI Calculated QA\nlb/MMBtu","Run Grade","Submitted Value","Submitted Value UOM","Use ?","Comment","facility_id","report_id","sampling_port_id","pollutant_id","pollutant_name","run_id","start_datetime","end_datetime","unit_load","fuel_flow_rate","fuel_heating_value","fg_moisture_content","fg_oxygen_content","fg_CO2_content","fg_temperature","test_method","conc","conc_units","conc_ND","conc_MDL","conc2","conc2_units","emission_rate","emission_rate_units","emission_rate_ND","emission_rate_MDL","Calculated conc lb/dscf","19-1\nlb/MMBtu","%diff\n19-1","19-6\nlb/MMBtu","%diff\n19-6","emission_factor","emission_factor_units","emission_factor_ND","emission_factor_MDL","run_pollutant_comment","Fuel1","Fuel1%Btu","Fuel2","Fuel2%Btu","QA Comment"]
[null,null,null,null,null,"No",{"$f":"AV2","v":"Scrubber inlet duct measurement; do not use"},52071,"3-Source Emissions Survey, Inlet Ducts and Stacks","SP03",6,"Sulfur Dioxide (SO2)","1","2009-10-28T12:07:00","2009-10-28T15:07:00",312,null,null,8.64,4.4000000000000004,15,266,"EPA Methods 1, 2, 3A, 4, 6C, 17, 26A, 30B",27.31,"parts per million by volume (dry) (ppmvd)",false,null,null,"",147.37,"pound per hour (lb/hr)",false,null,{"$f":"X2*$J$27","v":4.5334599999999996E-6},{"$f":"AH2*$I$34*20.9/(20.9-T2)","v":5.6619893093333325E-2},{"$f":"(AM2-AI2)/AM2","v":6.6685422222224093E-3},{"$f":"AH2*$K$34*100/U2","v":5.772605733333333E-2},{"$f":"(AM2-AK2)/AM2","v":-1.2737847953216287E-2},5.7000000000000002E-2,"pound per million British Thermal Unit (lb/MMBtu)",false,null,"",null,null,null,null,"Scrubber inlet duct measurement; do not use"]
[null,null,null,null,null,"No",{"$f":"AV3","v":"Scrubber inlet duct measurement; do not use"},52071,"3-Source Emissions Survey, Inlet Ducts and Stacks","SP03",6,"Sulfur Dioxide (SO2)","2","2009-10-28T17:28:00","2009-10-28T18:38:00",313,null,null,null,4.4000000000000004,14.8,null,"EPA Methods 1, 2, 3A, 4, 6C, 17, 26A, 30B",26.38,"parts per million by volume (dry) (ppmvd)",false,null,null,"",164.31,"pound per hour (lb/hr)",false,null,{"$f":"X3*$J$27","v":4.3790799999999996E-6},{"$f":"AH3*$I$34*20.9/(20.9-T3)","v":5.4691789813333329E-2},{"$f":"(AM3-AI3)/AM3","v":5.6038215757576622E-3},{"$f":"AH3*$K$34*100/U3","v":5.651380270270269E-2},{"$f":"(AM3-AK3)/AM3","v":-2.7523685503685259E-2},5.5E-2,"pound per million British Thermal Unit (lb/MMBtu)",false,null,"",null,null,null,null,"Scrubber inlet duct measurement; do not use"]
[null,null,null,null,null,"No","Scrubber inlet duct measurement; do not use",52071,"3-Source Emissions Survey, Inlet Ducts and Stacks","SP03",6,"Sulfur Dioxide (SO2)","3","2009-10-30T09:58:00","2009-10-30T11:50:00",311,null,null,null,4,14.9,null,"EPA Methods 1, 2, 3A, 4, 6C, 17, 26A, 30B",9.31,"parts per million by volume (dry) (ppmvd)",false,null,null,"",54.31,"pound per hour (lb/hr)",false,null,1.54546E-6,1.8844918582248522E-2,8.1621798816566907E-3,1.9810930201342281E-2,-4.2680536912751636E-2,1.9E-2,"pound per million British Thermal Unit (lb/MMBtu)",false,null,"",null,null,null,null,"Scrubber inlet duct measurement; do not use"]
[null,null,null,null,null,"No","Scrubber inlet duct measurement; do not use",52071,"3-Source Emissions Survey, Inlet Ducts and Stacks","SP03",6,"Sulfur Dioxide (SO2)","5","2009-10-30T15:35:00","2009-10-30T18:43:00",314,null,null,null,4.0999999999999996,14.9,null,"EPA Methods 1, 2, 3A, 4, 6C, 17, 26A, 30B",13.35,"parts per million by volume (dry) (ppmvd)",false,null,null,"",75.3,"pound per hour (lb/hr)",false,null,2.2160999999999998E-6,2.7183368535714285E-2,-6.7914272486772282E-3,2.8407724832214765E-2,-5.2137956748695001E-2,2.7E-2,"pound per million British Thermal Unit (lb/MMBtu)",false,null,"",null,null,null,null,"Scrubber inlet duct measurement; do not use"]
[null,null,null,null,null,"No","Scrubber inlet duct measurement; do not use",52071,"3-Source Emissions Survey, Inlet Ducts and Stacks","SP03",6,"Sulfur Dioxide (SO2)","7","2009-11-05T08:30:00","2009-11-05T11:44:00",297,null,null,null,4.0999999999999996,14.9,null,"EPA Methods 1, 2, 3A, 4, 6C, 17, 26A, 30B",null,"parts per million by volume (dry) (ppmvd)",true,0.01,null,"",null,"pound per hour (lb/hr)",true,0.06,{"$f":"AA6*$J$27","v":1.6600000000000001E-9},2.036207380952381E-5,{"$f":"(AP6-AI6)/AP6","v":0.97963792619047629},2.1279194630872485E-5,{"$f":"(AP6-AK6)/AP6","v":0.97872080536912742},null,"pound per million British Thermal Unit (lb/MMBtu)",true,1E-3,"",null,null,null,null,"Scrubber inlet duct measurement; do not use"]
[null,null,null,null,null,"No","Scrubber inlet duct measurement; do not use",52071,"3-Source Emissions Survey, Inlet Ducts and Stacks","SP03",6,"Sulfur Dioxide (SO2)","8","2009-11-05T13:13:00","2009-11-05T15:13:00",302,null,null,null,3.7,15.2,null,"EPA Methods 1, 2, 3A, 4, 6C, 17, 26A, 30B",1.36,"parts per million by volume (dry) (ppmvd)",false,null,null,"",7.97,"pound per hour (lb/hr)",false,null,2.2576000000000003E-7,2.7048410604651164E-3,9.8386313178294563E-2,2.8368526315789479E-3,5.4382456140350706E-2,3.0000000000000001E-3,"pound per million British Thermal Unit (lb/MMBtu)",false,null,"",null,null,null,null,"Scrubber inlet duct measurement; do not use"]
[null,null,null,null,null,null,"Scrubber inlet duct measurement; do not use",52071,"3-Source Emissions Survey, Inlet Ducts and Stacks","SP03",null,"Sulfur Dioxide (SO2)",null,null,null,null,null,null,null,null,null,null,null,null,null,null,null,null,null,null,null,null,null,null,null,null,null,null,null,null,null,null,null,"coal - lignite",100,null,null,"Scrubber inlet duct measurement; do not use"]
[null,null,null,null,null,null,"Scrubber inlet duct measurement; do not use",52071,"3-Source Emissions Survey, Inlet Ducts and Stacks","SP03",null,"Sulfur Dioxide (SO2)",null,null,null,null,null,null,null,null,null,null,null,null,null,null,null,null,null,null,null,null,null,null,null,null,null,null,null,null,null,null,null,"coal - lignite",100,null,null,"Scrubber inlet duct measurement; do not use"]
[null,null,null,null,null,null,"Scrubber inlet duct measurement; do not use",52071,"3-Source Emissions Survey, Inlet Ducts and Stacks","SP03",null,"Sulfur Dioxide (SO2)",null,null,null,null,null,null,null,null,null,null,null,null,null,null,null,null,null,null,null,null,null,null,null,null,null,null,null,null,null,null,null,"coal - lignite",100,null,null,"Scrubber inlet duct measurement; do not use"]
[null,null,null,null,null,null,"Scrubber inlet duct measurement; do not use",52071,"3-Source Emissions Survey, Inlet Ducts and Stacks","SP03",null,"Sulfur Dioxide (SO2)",null,null,null,null,null,null,null,null,null,null,null,null,null,null,null,null,null,null,null,null,null,null,null,null,null,null,null,null,null,null,null,"coal - lignite",100,null,null,"Scrubber inlet duct measurement; do not use"]
[null,null,null,null,null,null,"Scrubber inlet duct measurement; do not use",52071,"3-Source Emissions Survey, Inlet Ducts and Stacks","SP03",null,"Sulfur Dioxide (SO2)",null,null,null,null,null,null,null,null,null,null,null,null,null,null,null,null,null,null,null,null,null,null,null,null,null,null,null,null,null,null,null,"coal - lignite",100,null,null,"Scrubber inlet duct measurement; do not use"]
[null,null,null,null,null,null,"Scrubber inlet duct measurement; do not use",52071,"3-Source Emissions Survey, Inlet Ducts and Stacks","SP03",null,"Sulfur Dioxide (SO2)",null,null,null,null,null,null,null,null,null,null,null,null,null,null,null,null,null,null,null,null,null,null,null,null,null,null,null,null,null,null,null,"coal - lignite",100,null,null,"Scrubber inlet duct measurement; do not use"]
[]
[null,null,null,null,null,"Yes",null,52071,"2-Source Emissions Survey, Stacks","SP07",6,"Sulfur Dioxide (SO2)","1","2009-10-28T17:28:00","2009-10-28T19:29:00",313.33999999999997,328916,8722,19.63,3.59,15.68,null,"EPA Methods 1, 2, 3A, 4, 5B, 6C, 7E, 9, 10, 18, 25A, 26A, 29, 201A, CTM-027, and OTM-028",3.01,"parts per million by volume (dry) (ppmvd)",false,null,null,"",17.440000000000001,"pound per hour (lb/hr)",false,null,{"$f":"X15*$J$27","v":4.9966000000000002E-7},{"$f":"AH15*$I$34*20.9/(20.9-T15)","v":5.9484075586366267E-3},{"$f":"(AM15-AI15)/AM15","v":8.5987402272289012E-3},{"$f":"AH15*$K$34*100/U15","v":6.0864196428571434E-3},{"$f":"(AM15-AK15)/AM15","v":-1.4403273809523881E-2},6.0000000000000001E-3,"pound per million British Thermal Unit (lb/MMBtu)",false,null,""]
[null,null,null,null,null,"Yes",null,52071,"2-Source Emissions Survey, Stacks","SP07",6,"Sulfur Dioxide (SO2)","5","2009-10-30T09:15:00","2009-10-30T12:01:00",320.17,340004,8316,17.100000000000001,4.08,15.27,null,"EPA Methods 1, 2, 3A, 4, 5B, 6C, 7E, 9, 10, 18, 25A, 26A, 29, 201A, CTM-027, and OTM-028",4.5199999999999996,"parts per million by volume (dry) (ppmvd)",false,null,null,"",28.17,"pound per hour (lb/hr)",false,null,7.5031999999999996E-7,9.192713655172411E-3,-2.1412628352490193E-2,9.3851421087098891E-3,{"$f":"(AM16-AK16)/AM16","v":-4.2793567634432206E-2},8.9999999999999993E-3,"pound per million British Thermal Unit (lb/MMBtu)",false,null,""]
[null,null,null,null,null,"Yes",null,52071,"2-Source Emissions Survey, Stacks","SP07",6,"Sulfur Dioxide (SO2)","9","2009-11-05T08:30:00","2009-11-05T11:32:00",297.69,299810,8764,16.46,5.33,14.56,null,"EPA Methods 1, 2, 3A, 4, 5B, 6C, 7E, 9, 10, 18, 25A, 26A, 29, 201A, CTM-027, and OTM-028",28.26,"parts per million by volume (dry) (ppmvd)",false,null,null,"",178.79,"pound per hour (lb/hr)",false,null,4.6911600000000007E-6,6.2089024138728334E-2,-1.4358732052957165E-3,6.1539255494505493E-2,7.4313629918468776E-3,6.2E-2,"pound per million British Thermal Unit (lb/MMBtu)",false,null,""]
[null,{"$f":"AI18","v":5.9484075586366267E-3},null,{"$f":"AM18","v":6.0000000000000001E-3},{"$f":"AN18","v":"lb/MMBtu"},null,null,52071,"2-Source Emissions Survey, Stacks","SP07",null,"Sulfur Dioxide (SO2)",null,"2009-10-28T12:07:00","2009-10-28T15:26:00",312.23,330316,7912,19.63,3.59,15.68,null,"EPA Methods 1, 2, 3A, 4, 5B, 6C, 7E, 9, 10, 18, 25A, 26A, 29, 201A, CTM-027, and OTM-028",3.01,"ppmvd",false,null,null,null,17.440000000000001,"lb/hr",false,null,4.9966000000000002E-7,5.9484075586366267E-3,8.5987402272289012E-3,6.0864196428571434E-3,-1.4403273809523881E-2,6.0000000000000001E-3,"lb/MMBtu",false,null,null,"coal - lignite",100]
[null,{"$f":"AI19","v":9.192713655172411E-3},null,{"$f":"AM19","v":8.9999999999999993E-3},{"$f":"AN18","v":"lb/MMBtu"},null,null,52071,"2-Source Emissions Survey, Stacks","SP07",null,"Sulfur Dioxide (SO2)",null,"2009-10-30T15:35:00","2009-10-30T19:43:00",317.93,346472,8316,17.100000000000001,4.08,15.27,null,"EPA Methods 1, 2, 3A, 4, 5B, 6C, 7E, 9, 10, 18, 25A, 26A, 29, 201A, CTM-027, and OTM-028",4.5199999999999996,"ppmvd",false,null,null,null,28.17,"lb/hr",false,null,7.5031999999999996E-7,9.192713655172411E-3,-2.1412628352490193E-2,9.3851421087098891E-3,-4.2793567634432206E-2,8.9999999999999993E-3,"lb/MMBtu",false,null,null,"coal - lignite",100]
[null,6.2089024138728334E-2,null,6.2E-2,{"$f":"AN18","v":"lb/MMBtu"},null,null,52071,"2-Source Emissions Survey, Stacks","SP07",null,"Sulfur Dioxide (SO2)",null,"2009-11-05T13:10:00","2009-11-05T15:37:00",301.07,311878,8764,16.46,5.33,14.56,null,"EPA Methods 1, 2, 3A, 4, 5B, 6C, 7E, 9, 10, 18, 25A, 26A, 29, 201A, CTM-027, and OTM-028",28.26,"ppmvd",false,null,null,null,178.79,"lb/hr",false,null,4.6911600000000007E-6,6.2089024138728334E-2,-1.4358732052957165E-3,6.1539255494505493E-2,7.4313629918468776E-3,6.2E-2,"lb/MMBtu",false,null,null,"coal - lignite",100]
[null,null,null,{"$f":"D18*B$32","v":6.2900655215158488E-2},"lb/MWh"]
[null,null,null,{"$f":"D19*B$32","v":9.4350982822737725E-2},"lb/MWh"]
[null,null,null,0.64997343722330436,"lb/MWh"]
[null,null,"Average",{"$f":"AVERAGE(D21:D23)","v":0.26907502508706688},"lb/MWh",null,null,"Data from hard copy ICR.  Only summary spreadsheet tables provided."]
[]
["Subcategory_ID","1-SO2",null,null,null,null,null,"Conversions"]
["Subcategory Desc.","Coal",null,null,null,null,null,1,"ppm SO2",1.66E-7,"lb/scf"]
["ORIS Code",52071]
["Plant Name","Sandow",null,null,null,null,null,"Table 19-2","Fd","Fw","Fc"]
["Configuration ID","5A",null,null,null,null,null,"Fuel Type","dscf/MMBtu","wscf/MMBtu","scf/MMBtu"]
["Boiler ID","",null,null,null,null,null,"Coal"]
["Heat Rate",10.483442535859748,null,null,null,null,null,"Anthracite",10100,10540,1970]
[null,null,null,null,null,null,null,"Bituminous",9780,40640,1800]
[null,null,null,null,null,null,null,"Lignite",9860,11950,1910]
[null,null,null,null,null,null,null,"Petcoke",9830,null,1850]
[null,null,null,null,null,null,null,"Oil",9190,10320,1420]

{"sheet":"ERT","index":6,"n_rows":21,"n_cols":27,"rows_kept":21,"cut":false,"hidden":false,"merged":[]}
["Key","RTI Calculated QA\nlb/MMBtu","Run Grade","Submitted Value","Submitted Value UOM","Use ?","Comment","facility_id","configuration_id","submittal_id","Location","Method","Run","RunDate","Compound","Fwt","DF","lb/dscf","ppm","ppm converted to lb/dscf","Estimated O2%, assuming lb/MMBtu is correct","ppm@7%O2","ng/dscm","ng/dscm@7%O2","ppm @ 7% converted to lb/dscf","Equation 19-1","lb/mmBtuO2"]
[null,{"$f":"Z2","v":2.1782318412605924E-2},"A",{"$f":"AA2","v":2.1816442789244734E-2},{"$f":"AA1","v":"lb/mmBtuO2"},"Yes",null,52071,"5A",834,"Stack","Method 6C","1","2010-03-03","Sulfur Dioxide",64.06,1.0971299999999999E-5,1.8240889644432909E-6,10.971299999999999,{"$f":"S2*$J$12","v":1.8212357999999999E-6},{"$f":"20.9-(S2/V2*(20.9-7))","v":3.6700000000000017},8.850903656413232,29223491.146290764,23575538.417495161,{"$f":"V2*$J$12","v":1.4692500069645966E-6},{"$f":"Y2*$I$19*20.9/(20.9-7)","v":2.1782318412605924E-2},2.1816442789244734E-2]
[null,{"$f":"Z3","v":9.2146818686114351E-3},"A",{"$f":"AA3","v":9.2291176724012356E-3},{"$f":"AA1","v":"lb/mmBtuO2"},"Yes",null,52071,"5A",834,"Stack","Method 6C","2","2010-03-04","Sulfur Dioxide",64.06,4.617E-6,7.6762268362315079E-7,4.617,{"$f":"S3*$J$12","v":7.6642200000000006E-7},{"$f":"20.9-(S3/V3*(20.9-7))","v":3.759999999999998},3.7442415402567093,12297982.793508925,9973276.5945025682,{"$f":"V3*$J$12","v":6.2154409568261376E-7},{"$f":"Y3*$I$19*20.9/(20.9-7)","v":9.2146818686114351E-3},9.2291176724012356E-3]
[null,2.4166305160278749E-3,"A",{"$f":"AA4","v":2.4204164312075023E-3},{"$f":"AA1","v":"lb/mmBtuO2"},"Yes",null,52071,"5A",834,"Stack","Method 6C","3","2010-03-05","Sulfur Dioxide",64.06,1.2164999999999999E-6,2.0225535946016088E-7,1.2164999999999999,{"$f":"S4*$J$12","v":2.0193899999999999E-7},3.6799999999999997,0.98195993031358875,3240306.7074515065,2615578.5849927953,1.6300534843205574E-7,2.4166305160278749E-3,2.4204164312075023E-3]
[null,null,null,null,null,null,null,52071,"5A",834,"Stack","Method 6C","1","2010-03-03","Sulfur Dioxide",null,null,null,11,{"$f":"S5*$J$12","v":1.826E-6},3.67,8.8699999999999992,null,null,1.47242E-6,2.1829315041726617E-2,2.18E-2]
[null,null,"Run 1",{"$f":"D2*B$21","v":0.22871142431791891},"lb/MWh",null,null,52071,"5A",834,"Stack","Method 6C","2","2010-03-04","Sulfur Dioxide",null,null,null,4.62,7.6692000000000004E-7,3.76,3.75,null,null,6.2249999999999997E-7,9.2288535971223017E-3,9.2300000000000004E-3]
[null,null,"Run 2",{"$f":"D3*B$21","v":9.6752924775306018E-2},"lb/MWh",null,null,52071,"5A",834,"Stack","Method 6C","3","2010-03-05","Sulfur Dioxide",null,null,null,1.22,2.0251999999999999E-7,3.68,0.98499999999999999,null,null,1.6351000000000001E-7,2.4241122115107915E-3,2.4199999999999998E-3]
[null,null,"Run 3",2.5374296569414579E-2,"lb/MWh"]
[null,null,"Average",{"$f":"AVERAGE(D6:D8)","v":0.11694621522087983},"lb/MWh"]
[]
[null,null,null,null,null,null,null,"Conversions"]
[null,null,null,null,null,null,null,1,"ppm SO2",1.66E-7,"lb/scf",null,null,null,{"$f":"V2*J12","v":1.4692500069645966E-6}]
[null,null,null,null,null,null,null,null,null,null,null,null,null,null,null,null,null,null,null,null,"O2 values match ERT entries."]
[null,null,null,null,null,null,null,"Table 19-2","Fd","Fw","Fc"]
["Subcategory_ID","1-SO2",null,null,null,null,null,"Fuel Type","dscf/MMBtu","wscf/MMBtu","scf/MMBtu"]
["Subcategory Desc.","Coal",null,null,null,null,null,"Coal"]
["ORIS Code",52071,null,null,null,null,null,"Anthracite",10100,10540,1970]
["Plant Name","Sandow",null,null,null,null,null,"Bituminous",9780,40640,1800]
["Configuration ID","5A",null,null,null,null,null,"Lignite",9860,11950,1910]
["Boiler ID","",null,null,null,null,null,"Petcoke",9830,null,1850]
["Heat Rate",10.483442535859748,null,null,null,null,null,"Oil",9190,10320,1420]

{"sheet":"SO2_CEMS","index":7,"n_rows":1444,"n_cols":13,"rows_kept":1444,"cut":false,"hidden":false,"merged":[]}
["facility_id","boiler_id","configuration_id","submittal_id","HAPs_group","CEMS_type","sample_date","emission_value_lb/MMBtu","emission_value_ppmvd","emission_value_hourly","emission_cem_units","oxygen_content","standard_fuel_f_factor"]
[68029,{"$f":"IF(D2=2027,\"BLR1\",\"BLR2\")","v":"BLR2"},{"$f":"IF(D2=2027,\"Unit_1\",\"Unit_2\")","v":"Unit_2"},2028,"acid gas","SO2","2010-03-01",0,"0.32","ppm @ 7% O2","0.32","0.0DN","9780"]
[68029,"BLR2","Unit_2",2028,"acid gas","SO2","2010-03-01T01:00:00",0,"-0.01","ppm @ 7% O2","-0.01","0.0DN","9780"]
[68029,"BLR2","Unit_2",2028,"acid gas","SO2","2010-03-01T02:00:00",0,"-0.02","ppm @ 7% O2","-0.02","0.0DN","9780"]
[68029,"BLR2","Unit_2",2028,"acid gas","SO2","2010-03-01T03:00:00",0,"-0.02","ppm @ 7% O2","-0.02","0.0DN","9780"]
[68029,"BLR2","Unit_2",2028,"acid gas","SO2","2010-03-01T04:00:00",0,"-0.02","ppm @ 7% O2","-0.02","0.0DN","9780"]
[68029,"BLR2","Unit_2",2028,"acid gas","SO2","2010-03-01T05:00:00",0,"-0.02","ppm @ 7% O2","-0.02","0.0DN","9780"]
[68029,"BLR2","Unit_2",2028,"acid gas","SO2","2010-03-01T06:00:00",0,"-0.02","ppm @ 7% O2","-0.02","0.0DN","9780"]
[68029,"BLR2","Unit_2",2028,"acid gas","SO2","2010-03-01T07:00:00",0,"-0.02","ppm @ 7% O2","-0.02","0.0DN","9780"]
[68029,"BLR2","Unit_2",2028,"acid gas","SO2","2010-03-01T08:00:00",0,"-0.02","ppm @ 7% O2","-0.02","0.0DN","9780"]
[68029,"BLR2","Unit_2",2028,"acid gas","SO2","2010-03-01T09:00:00",0,"-0.02","ppm @ 7% O2","-0.02","0.0DN","9780"]
[68029,"BLR2","Unit_2",2028,"acid gas","SO2","2010-03-01T10:00:00",0,"-0.01","ppm @ 7% O2","-0.01","0.0DN","9780"]
[68029,"BLR2","Unit_2",2028,"acid gas","SO2","2010-03-01T11:00:00",0,"-0.02","ppm @ 7% O2","-0.02","0.0DN","9780"]
[68029,"BLR2","Unit_2",2028,"acid gas","SO2","2010-03-01T12:00:00",0,"-0.02","ppm @ 7% O2","-0.02","0.0DN","9780"]
[68029,"BLR2","Unit_2",2028,"acid gas","SO2","2010-03-01T13:00:00",0,"-0.02","ppm @ 7% O2","-0.02","0.0DN","9780"]
[68029,"BLR2","Unit_2",2028,"acid gas","SO2","2010-03-01T14:00:00",0,"-0.02","ppm @ 7% O2","-0.02","0.0DN","9780"]
[68029,"BLR2","Unit_2",2028,"acid gas","SO2","2010-03-01T15:00:00",0,"-0.02","ppm @ 7% O2","-0.02","0.0DN","9780"]
[68029,"BLR2","Unit_2",2028,"acid gas","SO2","2010-03-01T16:00:00",0,"-0.02","ppm @ 7% O2","-0.02","0.0DN","9780"]
[68029,"BLR2","Unit_2",2028,"acid gas","SO2","2010-03-01T17:00:00",0,"-0.02","ppm @ 7% O2","-0.02","0.0DN","9780"]
[68029,"BLR2","Unit_2",2028,"acid gas","SO2","2010-03-01T18:00:00",0,"-0.02","ppm @ 7% O2","-0.02","0.0DN","9780"]
[68029,"BLR2","Unit_2",2028,"acid gas","SO2","2010-03-01T19:00:00",0,"-0.02","ppm @ 7% O2","-0.02","0.0DN","9780"]
[68029,"BLR2","Unit_2",2028,"acid gas","SO2","2010-03-01T20:00:00",0,"-0.02","ppm @ 7% O2","-0.02","0.0DN","9780"]
[68029,"BLR2","Unit_2",2028,"acid gas","SO2","2010-03-01T21:00:00",0,"-0.02","ppm @ 7% O2","-0.02","0.0DN","9780"]
[68029,"BLR2","Unit_2",2028,"acid gas","SO2","2010-03-01T22:00:00",0,"-0.02","ppm @ 7% O2","-0.02","0.0DN","9780"]
[68029,"BLR2","Unit_2",2028,"acid gas","SO2","2010-03-01T23:00:00",0,"-0.02","ppm @ 7% O2","-0.02","0.0DN","9780"]
[68029,"BLR2","Unit_2",2028,"acid gas","SO2","2010-03-02",0,"-0.02","ppm @ 7% O2","-0.02","0.0DN","9780"]
[68029,"BLR2","Unit_2",2028,"acid gas","SO2","2010-03-02T01:00:00",0,"-0.02","ppm @ 7% O2","-0.02","0.0DN","9780"]
[68029,"BLR2","Unit_2",2028,"acid gas","SO2","2010-03-02T02:00:00",0,"-0.02","ppm @ 7% O2","-0.02","0.0DN","9780"]
[68029,"BLR2","Unit_2",2028,"acid gas","SO2","2010-03-02T03:00:00",0,"-0.02","ppm @ 7% O2","-0.02","0.0DN","9780"]
[68029,"BLR2","Unit_2",2028,"acid gas","SO2","2010-03-02T04:00:00",0,"-0.02","ppm @ 7% O2","-0.02","0.0DN","9780"]
[68029,"BLR2","Unit_2",2028,"acid gas","SO2","2010-03-02T05:00:00",0,"-0.02","ppm @ 7% O2","-0.02","0.0DN","9780"]
[68029,"BLR2","Unit_2",2028,"acid gas","SO2","2010-03-02T06:00:00",0,"-0.02","ppm @ 7% O2","-0.02","0.0DN","9780"]
[68029,"BLR2","Unit_2",2028,"acid gas","SO2","2010-03-02T07:00:00",0,"-0.02","ppm @ 7% O2","-0.02","0.0DN","9780"]
[68029,"BLR2","Unit_2",2028,"acid gas","SO2","2010-03-02T08:00:00",0,"-0.02","ppm @ 7% O2","-0.02","0.0DN","9780"]
[68029,"BLR2","Unit_2",2028,"acid gas","SO2","2010-03-02T09:00:00",0,"-0.02","ppm @ 7% O2","-0.02","0.0DN","9780"]
[68029,"BLR2","Unit_2",2028,"acid gas","SO2","2010-03-02T10:00:00",0,"-0.02","ppm @ 7% O2","-0.02","0.0DN","9780"]
[68029,"BLR2","Unit_2",2028,"acid gas","SO2","2010-03-02T11:00:00",0,"-0.02","ppm @ 7% O2","-0.02","0.0DN","9780"]
[68029,"BLR2","Unit_2",2028,"acid gas","SO2","2010-03-02T12:00:00",0,"-0.02","ppm @ 7% O2","-0.02","0.0DN","9780"]
[68029,"BLR2","Unit_2",2028,"acid gas","SO2","2010-03-02T13:00:00",0,"-0.02","ppm @ 7% O2","-0.02","0.0DN","9780"]
[68029,"BLR2","Unit_2",2028,"acid gas","SO2","2010-03-02T14:00:00",0,"-0.02","ppm @ 7% O2","-0.02","0.0DN","9780"]
[68029,"BLR2","Unit_2",2028,"acid gas","SO2","2010-03-02T15:00:00",0,"-0.02","ppm @ 7% O2","-0.02","0.0DN","9780"]
[68029,"BLR2","Unit_2",2028,"acid gas","SO2","2010-03-02T16:00:00",0,"-0.02","ppm @ 7% O2","-0.02","0.0DN","9780"]
[68029,"BLR2","Unit_2",2028,"acid gas","SO2","2010-03-02T17:00:00",0,"-0.02","ppm @ 7% O2","-0.02","0.0DN","9780"]
[68029,"BLR2","Unit_2",2028,"acid gas","SO2","2010-03-02T18:00:00",0,"-0.02","ppm @ 7% O2","-0.02","0.0DN","9780"]
[68029,"BLR2","Unit_2",2028,"acid gas","SO2","2010-03-02T19:00:00",0,"-0.02","ppm @ 7% O2","-0.02","0.0DN","9780"]
[68029,"BLR2","Unit_2",2028,"acid gas","SO2","2010-03-02T20:00:00",0,"-0.02","ppm @ 7% O2","-0.02","0.0DN","9780"]
[68029,"BLR2","Unit_2",2028,"acid gas","SO2","2010-03-02T21:00:00",0,"-0.02","ppm @ 7% O2","-0.02","0.0DN","9780"]
[68029,"BLR2","Unit_2",2028,"acid gas","SO2","2010-03-02T22:00:00",0,"-0.02","ppm @ 7% O2","-0.02","0.0DN","9780"]
[68029,"BLR2","Unit_2",2028,"acid gas","SO2","2010-03-02T23:00:00",0,"-0.02","ppm @ 7% O2","-0.02","0.0DN","9780"]
[68029,"BLR2","Unit_2",2028,"acid gas","SO2","2010-03-03",0,"-0.02","ppm @ 7% O2","-0.02","0.0DN","9780"]
[68029,"BLR2","Unit_2",2028,"acid gas","SO2","2010-03-03T01:00:00",0,"-0.02","ppm @ 7% O2","-0.02","0.0DN","9780"]
[68029,"BLR2","Unit_2",2028,"acid gas","SO2","2010-03-03T02:00:00",0,"-0.02","ppm @ 7% O2","-0.02","0.0DN","9780"]
[68029,"BLR2","Unit_2",2028,"acid gas","SO2","2010-03-03T03:00:00",0,"-0.02","ppm @ 7% O2","-0.02","0.0DN","9780"]
[68029,"BLR2","Unit_2",2028,"acid gas","SO2","2010-03-03T04:00:00",0,"-0.02","ppm @ 7% O2","-0.02","0.0DN","9780"]
[68029,"BLR2","Unit_2",2028,"acid gas","SO2","2010-03-03T05:00:00",0,"-0.02","ppm @ 7% O2","-0.02","0.0DN","9780"]
[68029,"BLR2","Unit_2",2028,"acid gas","SO2","2010-03-03T06:00:00",0,"-0.02","ppm @ 7% O2","-0.02","0.0DN","9780"]
[68029,"BLR2","Unit_2",2028,"acid gas","SO2","2010-03-03T07:00:00",0,"-0.02","ppm @ 7% O2","-0.02","0.0DN","9780"]
[68029,"BLR2","Unit_2",2028,"acid gas","SO2","2010-03-03T08:00:00",0,"-0.02","ppm @ 7% O2","-0.02","0.0DN","9780"]
[68029,"BLR2","Unit_2",2028,"acid gas","SO2","2010-03-03T09:00:00",0,"0.16","ppm @ 7% O2","0.16","0.0DN","9780"]
[68029,"BLR2","Unit_2",2028,"acid gas","SO2","2010-03-03T10:00:00",0,"0.26","ppm @ 7% O2","0.26","0.0DN","9780"]
[68029,"BLR2","Unit_2",2028,"acid gas","SO2","2010-03-03T11:00:00",0,"0.26","ppm @ 7% O2","0.26","0.0DN","9780"]
[68029,"BLR2","Unit_2",2028,"acid gas","SO2","2010-03-03T12:00:00",0,"0.09","ppm @ 7% O2","0.09","0.0DN","9780"]
[68029,"BLR2","Unit_2",2028,"acid gas","SO2","2010-03-03T13:00:00",0,"-0.01","ppm @ 7% O2","-0.01","0.0DN","9780"]
[68029,"BLR2","Unit_2",2028,"acid gas","SO2","2010-03-03T14:00:00",0,"-0.02","ppm @ 7% O2","-0.02","0.0DN","9780"]
[68029,"BLR2","Unit_2",2028,"acid gas","SO2","2010-03-03T15:00:00",0,"-0.02","ppm @ 7% O2","-0.02","0.0DN","9780"]
[68029,{"$f":"IF(D66=2027,\"BLR1\",\"BLR2\")","v":"BLR2"},{"$f":"IF(D66=2027,\"Unit_1\",\"Unit_2\")","v":"Unit_2"},2028,"acid gas","SO2","2010-03-03T16:00:00",0,"-0.02","ppm @ 7% O2","-0.02","0.0DN","9780"]
[68029,"BLR2","Unit_2",2028,"acid gas","SO2","2010-03-03T17:00:00",0,"-0.01","ppm @ 7% O2","-0.01","0.0DN","9780"]
[68029,"BLR2","Unit_2",2028,"acid gas","SO2","2010-03-03T18:00:00",0,"-0.02","ppm @ 7% O2","-0.02","0.0DN","9780"]
[68029,"BLR2","Unit_2",2028,"acid gas","SO2","2010-03-03T19:00:00",0,"-0.02","ppm @ 7% O2","-0.02","0.0DN","9780"]
[68029,"BLR2","Unit_2",2028,"acid gas","SO2","2010-03-03T20:00:00",0,"-0.02","ppm @ 7% O2","-0.02","0.0DN","9780"]
[68029,"BLR2","Unit_2",2028,"acid gas","SO2","2010-03-03T21:00:00",0,"-0.02","ppm @ 7% O2","-0.02","0.0DN","9780"]
[68029,"BLR2","Unit_2",2028,"acid gas","SO2","2010-03-03T22:00:00",0,"-0.02","ppm @ 7% O2","-0.02","0.0DN","9780"]
[68029,"BLR2","Unit_2",2028,"acid gas","SO2","2010-03-03T23:00:00",0,"-0.02","ppm @ 7% O2","-0.02","0.0DN","9780"]
[68029,"BLR2","Unit_2",2028,"acid gas","SO2","2010-03-04",0,"-0.02","ppm @ 7% O2","-0.02","0.0DN","9780"]
[68029,"BLR2","Unit_2",2028,"acid gas","SO2","2010-03-04T01:00:00",0,"-0.02","ppm @ 7% O2","-0.02","0.0DN","9780"]
[68029,"BLR2","Unit_2",2028,"acid gas","SO2","2010-03-04T02:00:00",0,"-0.02","ppm @ 7% O2","-0.02","0.0DN","9780"]
[68029,"BLR2","Unit_2",2028,"acid gas","SO2","2010-03-04T03:00:00",0,"-0.02","ppm @ 7% O2","-0.02","0.0DN","9780"]
[68029,"BLR2","Unit_2",2028,"acid gas","SO2","2010-03-04T04:00:00",0,"-0.02","ppm @ 7% O2","-0.02","0.0DN","9780"]
[68029,"BLR2","Unit_2",2028,"acid gas","SO2","2010-03-04T05:00:00",0,"-0.02","ppm @ 7% O2","-0.02","0.0DN","9780"]
[68029,"BLR2","Unit_2",2028,"acid gas","SO2","2010-03-04T06:00:00",0,"-0.02","ppm @ 7% O2","-0.02","0.0DN","9780"]
[68029,"BLR2","Unit_2",2028,"acid gas","SO2","2010-03-04T07:00:00",0,"-0.02","ppm @ 7% O2","-0.02","0.0DN","9780"]
[68029,"BLR2","Unit_2",2028,"acid gas","SO2","2010-03-04T08:00:00",0,"-0.02","ppm @ 7% O2","-0.02","0.0DN","9780"]
[68029,"BLR2","Unit_2",2028,"acid gas","SO2","2010-03-04T09:00:00",0,"-0.02","ppm @ 7% O2","-0.02","0.0DN","9780"]
[68029,"BLR2","Unit_2",2028,"acid gas","SO2","2010-03-04T10:00:00",0,"-0.02","ppm @ 7% O2","-0.02","0.0DN","9780"]
[68029,"BLR2","Unit_2",2028,"acid gas","SO2","2010-03-04T11:00:00",0,"-0.02","ppm @ 7% O2","-0.02","0.0DN","9780"]
[68029,"BLR2","Unit_2",2028,"acid gas","SO2","2010-03-04T12:00:00",0,"-0.02","ppm @ 7% O2","-0.02","0.0DN","9780"]
[68029,"BLR2","Unit_2",2028,"acid gas","SO2","2010-03-04T13:00:00",0,"-0.02","ppm @ 7% O2","-0.02","0.0DN","9780"]
[68029,"BLR2","Unit_2",2028,"acid gas","SO2","2010-03-04T14:00:00",0,"-0.02","ppm @ 7% O2","-0.02","0.0DN","9780"]
[68029,"BLR2","Unit_2",2028,"acid gas","SO2","2010-03-04T15:00:00",0,"-0.02","ppm @ 7% O2","-0.02","0.0DN","9780"]
[68029,"BLR2","Unit_2",2028,"acid gas","SO2","2010-03-04T16:00:00",0,"-0.02","ppm @ 7% O2","-0.02","0.0DN","9780"]
[68029,"BLR2","Unit_2",2028,"acid gas","SO2","2010-03-04T17:00:00",0,"-0.02","ppm @ 7% O2","-0.02","0.0DN","9780"]
[68029,"BLR2","Unit_2",2028,"acid gas","SO2","2010-03-04T18:00:00",0,"-0.02","ppm @ 7% O2","-0.02","0.0DN","9780"]
[68029,"BLR2","Unit_2",2028,"acid gas","SO2","2010-03-04T19:00:00",0,"-0.02","ppm @ 7% O2","-0.02","0.0DN","9780"]
[68029,"BLR2","Unit_2",2028,"acid gas","SO2","2010-03-04T20:00:00",0,"-0.02","ppm @ 7% O2","-0.02","0.0DN","9780"]
[68029,"BLR2","Unit_2",2028,"acid gas","SO2","2010-03-04T21:00:00",0,"-0.02","ppm @ 7% O2","-0.02","0.0DN","9780"]
[68029,"BLR2","Unit_2",2028,"acid gas","SO2","2010-03-04T22:00:00",0,"-0.02","ppm @ 7% O2","-0.02","0.0DN","9780"]
[68029,"BLR2","Unit_2",2028,"acid gas","SO2","2010-03-04T23:00:00",0,"-0.02","ppm @ 7% O2","-0.02","0.0DN","9780"]
[68029,"BLR2","Unit_2",2028,"acid gas","SO2","2010-03-05",0,"-0.02","ppm @ 7% O2","-0.02","0.0DN","9780"]
[68029,"BLR2","Unit_2",2028,"acid gas","SO2","2010-03-05T01:00:00",0,"-0.02","ppm @ 7% O2","-0.02","0.0DN","9780"]
[68029,"BLR2","Unit_2",2028,"acid gas","SO2","2010-03-05T02:00:00",0,"-0.02","ppm @ 7% O2","-0.02","0.0DN","9780"]
[68029,"BLR2","Unit_2",2028,"acid gas","SO2","2010-03-05T03:00:00",0,"-0.02","ppm @ 7% O2","-0.02","0.0DN","9780"]
[68029,"BLR2","Unit_2",2028,"acid gas","SO2","2010-03-05T04:00:00",0,"-0.02","ppm @ 7% O2","-0.02","0.0DN","9780"]
[68029,"BLR2","Unit_2",2028,"acid gas","SO2","2010-03-05T05:00:00",0,"-0.02","ppm @ 7% O2","-0.02","0.0DN","9780"]
[68029,"BLR2","Unit_2",2028,"acid gas","SO2","2010-03-05T06:00:00",0,"-0.02","ppm @ 7% O2","-0.02","0.0DN","9780"]
[68029,"BLR2","Unit_2",2028,"acid gas","SO2","2010-03-05T07:00:00",0,"-0.02","ppm @ 7% O2","-0.02","0.0DN","9780"]
[68029,"BLR2","Unit_2",2028,"acid gas","SO2","2010-03-05T08:00:00",0,"-0.02","ppm @ 7% O2","-0.02","0.0DN","9780"]
[68029,"BLR2","Unit_2",2028,"acid gas","SO2","2010-03-05T09:00:00",0,"-0.02","ppm @ 7% O2","-0.02","0.0DN","9780"]
[68029,"BLR2","Unit_2",2028,"acid gas","SO2","2010-03-05T10:00:00",0,"-0.02","ppm @ 7% O2","-0.02","0.0DN","9780"]
[68029,"BLR2","Unit_2",2028,"acid gas","SO2","2010-03-05T11:00:00",0,"-0.02","ppm @ 7% O2","-0.02","0.0DN","9780"]
[68029,"BLR2","Unit_2",2028,"acid gas","SO2","2010-03-05T12:00:00",0,"-0.02","ppm @ 7% O2","-0.02","0.0DN","9780"]
[68029,"BLR2","Unit_2",2028,"acid gas","SO2","2010-03-05T13:00:00",0,"-0.02","ppm @ 7% O2","-0.02","0.0DN","9780"]
[68029,"BLR2","Unit_2",2028,"acid gas","SO2","2010-03-05T14:00:00",0,"-0.02","ppm @ 7% O2","-0.02","0.0DN","9780"]
[68029,"BLR2","Unit_2",2028,"acid gas","SO2","2010-03-05T15:00:00",0,"-0.02","ppm @ 7% O2","-0.02","0.0DN","9780"]
[68029,"BLR2","Unit_2",2028,"acid gas","SO2","2010-03-05T16:00:00",0,"-0.02","ppm @ 7% O2","-0.02","0.0DN","9780"]
[68029,"BLR2","Unit_2",2028,"acid gas","SO2","2010-03-05T17:00:00",0,"-0.02","ppm @ 7% O2","-0.02","0.0DN","9780"]
[68029,"BLR2","Unit_2",2028,"acid gas","SO2","2010-03-05T18:00:00",0,"-0.02","ppm @ 7% O2","-0.02","0.0DN","9780"]
[68029,"BLR2","Unit_2",2028,"acid gas","SO2","2010-03-05T19:00:00",0,"-0.02","ppm @ 7% O2","-0.02","0.0DN","9780"]
[68029,"BLR2","Unit_2",2028,"acid gas","SO2","2010-03-05T20:00:00",0,"-0.02","ppm @ 7% O2","-0.02","0.0DN","9780"]
[68029,"BLR2","Unit_2",2028,"acid gas","SO2","2010-03-05T21:00:00",0,"-0.02","ppm @ 7% O2","-0.02","0.0DN","9780"]
[68029,"BLR2","Unit_2",2028,"acid gas","SO2","2010-03-05T22:00:00",0,"-0.02","ppm @ 7% O2","-0.02","0.0DN","9780"]
[68029,"BLR2","Unit_2",2028,"acid gas","SO2","2010-03-05T23:00:00",0,"-0.02","ppm @ 7% O2","-0.02","0.0DN","9780"]
[68029,"BLR2","Unit_2",2028,"acid gas","SO2","2010-03-06",0,"-0.02","ppm @ 7% O2","-0.02","0.0DN","9780"]
[68029,"BLR2","Unit_2",2028,"acid gas","SO2","2010-03-06T01:00:00",0,"-0.02","ppm @ 7% O2","-0.02","0.0DN","9780"]
[68029,"BLR2","Unit_2",2028,"acid gas","SO2","2010-03-06T02:00:00",0,"-0.02","ppm @ 7% O2","-0.02","0.0DN","9780"]
[68029,"BLR2","Unit_2",2028,"acid gas","SO2","2010-03-06T03:00:00",0,"-0.02","ppm @ 7% O2","-0.02","0.0DN","9780"]
[68029,"BLR2","Unit_2",2028,"acid gas","SO2","2010-03-06T04:00:00",0,"-0.02","ppm @ 7% O2","-0.02","0.0DN","9780"]
[68029,"BLR2","Unit_2",2028,"acid gas","SO2","2010-03-06T05:00:00",0,"-0.02","ppm @ 7% O2","-0.02","0.0DN","9780"]
[68029,"BLR2","Unit_2",2028,"acid gas","SO2","2010-03-06T06:00:00",0,"-0.02","ppm @ 7% O2","-0.02","0.0DN","9780"]
[68029,"BLR2","Unit_2",2028,"acid gas","SO2","2010-03-06T07:00:00",0,"-0.02","ppm @ 7% O2","-0.02","0.0DN","9780"]
[68029,{"$f":"IF(D130=2027,\"BLR1\",\"BLR2\")","v":"BLR2"},{"$f":"IF(D130=2027,\"Unit_1\",\"Unit_2\")","v":"Unit_2"},2028,"acid gas","SO2","2010-03-06T08:00:00",0,"-0.02","ppm @ 7% O2","-0.02","0.0DN","9780"]
[68029,"BLR2","Unit_2",2028,"acid gas","SO2","2010-03-06T09:00:00",0,"-0.02","ppm @ 7% O2","-0.02","0.0DN","9780"]
[68029,"BLR2","Unit_2",2028,"acid gas","SO2","2010-03-06T10:00:00",0,"-0.02","ppm @ 7% O2","-0.02","0.0DN","9780"]
[68029,"BLR2","Unit_2",2028,"acid gas","SO2","2010-03-06T11:00:00",0,"-0.02","ppm @ 7% O2","-0.02","0.0DN","9780"]
[68029,"BLR2","Unit_2",2028,"acid gas","SO2","2010-03-06T12:00:00",0,"-0.02","ppm @ 7% O2","-0.02","0.0DN","9780"]
[68029,"BLR2","Unit_2",2028,"acid gas","SO2","2010-03-06T13:00:00",0,"-0.02","ppm @ 7% O2","-0.02","0.0DN","9780"]
[68029,"BLR2","Unit_2",2028,"acid gas","SO2","2010-03-06T14:00:00",0,"-0.02","ppm @ 7% O2","-0.02","0.0DN","9780"]
[68029,"BLR2","Unit_2",2028,"acid gas","SO2","2010-03-06T15:00:00",0,"-0.02","ppm @ 7% O2","-0.02","0.0DN","9780"]
[68029,"BLR2","Unit_2",2028,"acid gas","SO2","2010-03-06T16:00:00",0,"-0.02","ppm @ 7% O2","-0.02","0.0DN","9780"]
[68029,"BLR2","Unit_2",2028,"acid gas","SO2","2010-03-06T17:00:00",0,"-0.02","ppm @ 7% O2","-0.02","0.0DN","9780"]
[68029,"BLR2","Unit_2",2028,"acid gas","SO2","2010-03-06T18:00:00",0,"-0.02","ppm @ 7% O2","-0.02","0.0DN","9780"]
[68029,"BLR2","Unit_2",2028,"acid gas","SO2","2010-03-06T19:00:00",0,"-0.02","ppm @ 7% O2","-0.02","0.0DN","9780"]
[68029,"BLR2","Unit_2",2028,"acid gas","SO2","2010-03-06T20:00:00",0,"-0.02","ppm @ 7% O2","-0.02","0.0DN","9780"]
[68029,"BLR2","Unit_2",2028,"acid gas","SO2","2010-03-06T21:00:00",0,"-0.02","ppm @ 7% O2","-0.02","0.0DN","9780"]
[68029,"BLR2","Unit_2",2028,"acid gas","SO2","2010-03-06T22:00:00",0,"-0.02","ppm @ 7% O2","-0.02","0.0DN","9780"]
[68029,"BLR2","Unit_2",2028,"acid gas","SO2","2010-03-06T23:00:00",0,"-0.02","ppm @ 7% O2","-0.02","0.0DN","9780"]
[68029,"BLR2","Unit_2",2028,"acid gas","SO2","2010-03-07",0,"0.04","ppm @ 7% O2","0.04","19.9","9780"]
[68029,"BLR2","Unit_2",2028,"acid gas","SO2","2010-03-07T01:00:00",0,"0.37","ppm @ 7% O2","0.37","19.5","9780"]
[68029,"BLR2","Unit_2",2028,"acid gas","SO2","2010-03-07T02:00:00",8.9999999999999993E-3,"2.6","ppm @ 7% O2","2.6","19.5","9780"]
[68029,"BLR2","Unit_2",2028,"acid gas","SO2","2010-03-07T03:00:00",0.05,"8.02","ppm @ 7% O2","8.02","18.3","9780"]
[68029,"BLR2","Unit_2",2028,"acid gas","SO2","2010-03-07T04:00:00",0.03,"13.83","ppm @ 7% O2","13.83","18.3","9780"]
[68029,"BLR2","Unit_2",2028,"acid gas","SO2","2010-03-07T05:00:00",4.1000000000000002E-2,"16.57","ppm @ 7% O2","16.57","18.8","9780"]
[68029,"BLR2","Unit_2",2028,"acid gas","SO2","2010-03-07T06:00:00",0.05,"17.77","ppm @ 7% O2","17.77","18","9780"]
[68029,"BLR2","Unit_2",2028,"acid gas","SO2","2010-03-07T07:00:00",0.05,"18.3","ppm @ 7% O2","18.3","17.7","9780"]
[68029,"BLR2","Unit_2",2028,"acid gas","SO2","2010-03-07T08:00:00",4.5999999999999999E-2,"19.97","ppm @ 7% O2","19.97","17.5","9780"]
[68029,"BLR2","Unit_2",2028,"acid gas","SO2","2010-03-07T09:00:00",2.4E-2,"18.5","ppm @ 7% O2","18.5","13.9","9780"]
[68029,"BLR2","Unit_2",2028,"acid gas","SO2","2010-03-07T10:00:00",3.3000000000000002E-2,"16.31","ppm @ 7% O2","16.31","0","9780"]
[68029,"BLR2","Unit_2",2028,"acid gas","SO2","2010-03-07T11:00:00",0.05,"15.85","ppm @ 7% O2","15.85","0","9780"]
[68029,"BLR2","Unit_2",2028,"acid gas","SO2","2010-03-07T12:00:00",0.05,"17.29","ppm @ 7% O2","17.29","0","9780"]
[68029,"BLR2","Unit_2",2028,"acid gas","SO2","2010-03-07T13:00:00",2.8000000000000001E-2,"18.66","ppm @ 7% O2","18.66","12.3","9780"]
[68029,"BLR2","Unit_2",2028,"acid gas","SO2","2010-03-07T14:00:00",7.0000000000000001E-3,"14.17","ppm @ 7% O2","14.17","13.2","9780"]
[68029,"BLR2","Unit_2",2028,"acid gas","SO2","2010-03-07T15:00:00",5.0000000000000001E-3,"8.34","ppm @ 7% O2","8.34","12.7","9780"]
[68029,"BLR2","Unit_2",2028,"acid gas","SO2","2010-03-07T16:00:00",8.0000000000000002E-3,"3.36","ppm @ 7% O2","3.36","12.4","9780"]
[68029,"BLR2","Unit_2",2028,"acid gas","SO2","2010-03-07T17:00:00",1.4999999999999999E-2,"3.13","ppm @ 7% O2","3.13","11.6","9780"]
[68029,"BLR2","Unit_2",2028,"acid gas","SO2","2010-03-07T18:00:00",0.01,"4.26","ppm @ 7% O2","4.26","10.9","9780"]
[68029,"BLR2","Unit_2",2028,"acid gas","SO2","2010-03-07T19:00:00",1.6E-2,"5.14","ppm @ 7% O2","5.14","11.1","9780"]
[68029,"BLR2","Unit_2",2028,"acid gas","SO2","2010-03-07T20:00:00",2.1999999999999999E-2,"6.54","ppm @ 7% O2","6.54","11","9780"]
[68029,"BLR2","Unit_2",2028,"acid gas","SO2","2010-03-07T21:00:00",6.0000000000000001E-3,"6.36","ppm @ 7% O2","6.36","10.7","9780"]
[68029,"BLR2","Unit_2",2028,"acid gas","SO2","2010-03-07T22:00:00",2E-3,"5.02","ppm @ 7% O2","5.02","10.7","9780"]
[68029,"BLR2","Unit_2",2028,"acid gas","SO2","2010-03-07T23:00:00",6.0000000000000001E-3,"2.72","ppm @ 7% O2","2.72","9.9","9780"]
[68029,"BLR2","Unit_2",2028,"acid gas","SO2","2010-03-08",1.4E-2,"2.31","ppm @ 7% O2","2.31","9.2","9780"]
[68029,"BLR2","Unit_2",2028,"acid gas","SO2","2010-03-08T01:00:00",6.0000000000000001E-3,"3.31","ppm @ 7% O2","3.31","8.7","9780"]
[68029,"BLR2","Unit_2",2028,"acid gas","SO2","2010-03-08T02:00:00",1.0999999999999999E-2,"3.95","ppm @ 7% O2","3.95","8.8","9780"]
[68029,"BLR2","Unit_2",2028,"acid gas","SO2","2010-03-08T03:00:00",1.4999999999999999E-2,"4.21","ppm @ 7% O2","4.21","8.8","9780"]
[68029,"BLR2","Unit_2",2028,"acid gas","SO2","2010-03-08T04:00:00",0.01,"4.8","ppm @ 7% O2","4.8","8.6","9780"]
[68029,"BLR2","Unit_2",2028,"acid gas","SO2","2010-03-08T05:00:00",3.0000000000000001E-3,"4.39","ppm @ 7% O2","4.39","8.5","9780"]
[68029,"BLR2","Unit_2",2028,"acid gas","SO2","2010-03-08T06:00:00",5.0000000000000001E-3,"3.09","ppm @ 7% O2","3.09","8.5","9780"]
[68029,"BLR2","Unit_2",2028,"acid gas","SO2","2010-03-08T07:00:00",2.9000000000000001E-2,"3.86","ppm @ 7% O2","3.86","8.6","9780"]
[68029,"BLR2","Unit_2",2028,"acid gas","SO2","2010-03-08T08:00:00",8.0000000000000002E-3,"5.59","ppm @ 7% O2","5.59","8.5","9780"]
[68029,"BLR2","Unit_2",2028,"acid gas","SO2","2010-03-08T09:00:00",1E-3,"5.58","ppm @ 7% O2","5.58","8.4","9780"]
[68029,"BLR2","Unit_2",2028,"acid gas","SO2","2010-03-08T10:00:00",2E-3,"3.05","ppm @ 7% O2","3.05","8.3","9780"]
[68029,"BLR2","Unit_2",2028,"acid gas","SO2","2010-03-08T11:00:00",1E-3,"0.79","ppm @ 7% O2","0.79","8.5","9780"]
[68029,"BLR2","Unit_2",2028,"acid gas","SO2","2010-03-08T12:00:00",1E-3,"0.64","ppm @ 7% O2","0.64","8.9","9780"]
[68029,"BLR2","Unit_2",2028,"acid gas","SO2","2010-03-08T13:00:00",2E-3,"0.53","ppm @ 7% O2","0.53","8.7","9780"]
[68029,"BLR2","Unit_2",2028,"acid gas","SO2","2010-03-08T14:00:00",2E-3,"0.59","ppm @ 7% O2","0.59","8.7","9780"]
[68029,"BLR2","Unit_2",2028,"acid gas","SO2","2010-03-08T15:00:00",1.2E-2,"1.61","ppm @ 7% O2","1.61","8.8","9780"]
[68029,"BLR2","Unit_2",2028,"acid gas","SO2","2010-03-08T16:00:00",3.2000000000000001E-2,"3.58","ppm @ 7% O2","3.58","8.8","9780"]
[68029,"BLR2","Unit_2",2028,"acid gas","SO2","2010-03-08T17:00:00",5.0000000000000001E-3,"6.8","ppm @ 7% O2","6.8","8.7","9780"]
[68029,"BLR2","Unit_2",2028,"acid gas","SO2","2010-03-08T18:00:00",1E-3,"5.78","ppm @ 7% O2","5.78","8.6","9780"]
[68029,"BLR2","Unit_2",2028,"acid gas","SO2","2010-03-08T19:00:00",1E-3,"3.74","ppm @ 7% O2","3.74","8.9","9780"]
[68029,"BLR2","Unit_2",2028,"acid gas","SO2","2010-03-08T20:00:00",1E-3,"0.48","ppm @ 7% O2","0.48","8.9","9780"]
[68029,"BLR2","Unit_2",2028,"acid gas","SO2","2010-03-08T21:00:00",1.2E-2,"1.38","ppm @ 7% O2","1.38","9.1","9780"]
[68029,"BLR2","Unit_2",2028,"acid gas","SO2","2010-03-08T22:00:00",1E-3,"1.97","ppm @ 7% O2","1.97","12","9780"]
[68029,"BLR2","Unit_2",2028,"acid gas","SO2","2010-03-08T23:00:00",0,"1.84","ppm @ 7% O2","1.84","17.4","9780"]
[68029,{"$f":"IF(D194=2027,\"BLR1\",\"BLR2\")","v":"BLR2"},{"$f":"IF(D194=2027,\"Unit_1\",\"Unit_2\")","v":"Unit_2"},2028,"acid gas","SO2","2010-03-09",0,"0.76","ppm @ 7% O2","0.76","0.0DN","9780"]
[68029,"BLR2","Unit_2",2028,"acid gas","SO2","2010-03-09T01:00:00",0,"0.02","ppm @ 7% O2","0.02","0.0DN","9780"]
[68029,"BLR2","Unit_2",2028,"acid gas","SO2","2010-03-09T02:00:00",0,"-0.02","ppm @ 7% O2","-0.02","0.0DN","9780"]
[68029,"BLR2","Unit_2",2028,"acid gas","SO2","2010-03-09T03:00:00",0,"-0.02","ppm @ 7% O2","-0.02","0.0DN","9780"]
[68029,"BLR2","Unit_2",2028,"acid gas","SO2","2010-03-09T04:00:00",0,"-0.02","ppm @ 7% O2","-0.02","0.0DN","9780"]
[68029,"BLR2","Unit_2",2028,"acid gas","SO2","2010-03-09T05:00:00",0,"-0.02","ppm @ 7% O2","-0.02","0.0DN","9780"]
[68029,"BLR2","Unit_2",2028,"acid gas","SO2","2010-03-09T06:00:00",0,"-0.02","ppm @ 7% O2","-0.02","0.0DN","9780"]
[68029,"BLR2","Unit_2",2028,"acid gas","SO2","2010-03-09T07:00:00",0,"-0.02","ppm @ 7% O2","-0.02","0.0DN","9780"]
[68029,"BLR2","Unit_2",2028,"acid gas","SO2","2010-03-09T08:00:00",0,"-0.02","ppm @ 7% O2","-0.02","0.0DN","9780"]
[68029,"BLR2","Unit_2",2028,"acid gas","SO2","2010-03-09T09:00:00",0,"-0.02","ppm @ 7% O2","-0.02","0.0DN","9780"]
[68029,"BLR2","Unit_2",2028,"acid gas","SO2","2010-03-09T10:00:00",0,"-0.02","ppm @ 7% O2","-0.02","0.0DN","9780"]
[68029,"BLR2","Unit_2",2028,"acid gas","SO2","2010-03-09T11:00:00",0,"-0.02","ppm @ 7% O2","-0.02","0.0DN","9780"]
[68029,"BLR2","Unit_2",2028,"acid gas","SO2","2010-03-09T12:00:00",0,"-0.01","ppm @ 7% O2","-0.01","0.0DN","9780"]
[68029,"BLR2","Unit_2",2028,"acid gas","SO2","2010-03-09T13:00:00",0,"-0.01","ppm @ 7% O2","-0.01","0.0DN","9780"]
[68029,"BLR2","Unit_2",2028,"acid gas","SO2","2010-03-09T14:00:00",0,"-0.01","ppm @ 7% O2","-0.01","0.0DN","9780"]
[68029,"BLR2","Unit_2",2028,"acid gas","SO2","2010-03-09T15:00:00",0,"-0.01","ppm @ 7% O2","-0.01","0.0DN","9780"]
[68029,"BLR2","Unit_2",2028,"acid gas","SO2","2010-03-09T16:00:00",0,"-0.01","ppm @ 7% O2","-0.01","0.0DN","9780"]
[68029,"BLR2","Unit_2",2028,"acid gas","SO2","2010-03-09T17:00:00",0,"-0.01","ppm @ 7% O2","-0.01","0.0DN","9780"]
[68029,"BLR2","Unit_2",2028,"acid gas","SO2","2010-03-09T18:00:00",0,"-0.01","ppm @ 7% O2","-0.01","0.0DN","9780"]
[68029,"BLR2","Unit_2",2028,"acid gas","SO2","2010-03-09T19:00:00",0,"-0.01","ppm @ 7% O2","-0.01","0.0DN","9780"]
[68029,"BLR2","Unit_2",2028,"acid gas","SO2","2010-03-09T20:00:00",0,"-0.01","ppm @ 7% O2","-0.01","0.0DN","9780"]
[68029,"BLR2","Unit_2",2028,"acid gas","SO2","2010-03-09T21:00:00",0,"-0.01","ppm @ 7% O2","-0.01","0.0DN","9780"]
[68029,"BLR2","Unit_2",2028,"acid gas","SO2","2010-03-09T22:00:00",0,"-0.02","ppm @ 7% O2","-0.02","0.0DN","9780"]
[68029,"BLR2","Unit_2",2028,"acid gas","SO2","2010-03-09T23:00:00",0,"-0.02","ppm @ 7% O2","-0.02","0.0DN","9780"]
[68029,"BLR2","Unit_2",2028,"acid gas","SO2","2010-03-10",0,"-0.02","ppm @ 7% O2","-0.02","0.0DN","9780"]
[68029,"BLR2","Unit_2",2028,"acid gas","SO2","2010-03-10T01:00:00",0,"-0.02","ppm @ 7% O2","-0.02","0.0DN","9780"]
[68029,"BLR2","Unit_2",2028,"acid gas","SO2","2010-03-10T02:00:00",0,"-0.02","ppm @ 7% O2","-0.02","0.0DN","9780"]
[68029,"BLR2","Unit_2",2028,"acid gas","SO2","2010-03-10T03:00:00",0,"-0.02","ppm @ 7% O2","-0.02","0.0DN","9780"]
[68029,"BLR2","Unit_2",2028,"acid gas","SO2","2010-03-10T04:00:00",0,"-0.02","ppm @ 7% O2","-0.02","0.0DN","9780"]
[68029,"BLR2","Unit_2",2028,"acid gas","SO2","2010-03-10T05:00:00",0,"-0.02","ppm @ 7% O2","-0.02","0.0DN","9780"]
[68029,"BLR2","Unit_2",2028,"acid gas","SO2","2010-03-10T06:00:00",0,"-0.02","ppm @ 7% O2","-0.02","0.0DN","9780"]
[68029,"BLR2","Unit_2",2028,"acid gas","SO2","2010-03-10T07:00:00",0,"-0.02","ppm @ 7% O2","-0.02","0.0DN","9780"]
[68029,"BLR2","Unit_2",2028,"acid gas","SO2","2010-03-10T08:00:00",0,"-0.02","ppm @ 7% O2","-0.02","0.0DN","9780"]
[68029,"BLR2","Unit_2",2028,"acid gas","SO2","2010-03-10T09:00:00",0,"-0.02","ppm @ 7% O2","-0.02","0.0DN","9780"]
[68029,"BLR2","Unit_2",2028,"acid gas","SO2","2010-03-10T10:00:00",0,"0","ppm @ 7% O2","0","0.0DN","9780"]
[68029,"BLR2","Unit_2",2028,"acid gas","SO2","2010-03-10T11:00:00",1E-3,"0.17","ppm @ 7% O2","0.17","19.5","9780"]
[68029,"BLR2","Unit_2",2028,"acid gas","SO2","2010-03-10T12:00:00",1.7000000000000001E-2,"0.82","ppm @ 7% O2","0.82","18.7","9780"]
[68029,"BLR2","Unit_2",2028,"acid gas","SO2","2010-03-10T13:00:00",0.05,"5.99","ppm @ 7% O2","5.99","17.6","9780"]
[68029,"BLR2","Unit_2",2028,"acid gas","SO2","2010-03-10T14:00:00",0.05,"12.52","ppm @ 7% O2","12.52","17.2","9780"]
[68029,"BLR2","Unit_2",2028,"acid gas","SO2","2010-03-10T15:00:00",0.05,"18.53","ppm @ 7% O2","18.53","17.2","9780"]
[68029,"BLR2","Unit_2",2028,"acid gas","SO2","2010-03-10T16:00:00",4.5999999999999999E-2,"19.97","ppm @ 7% O2","19.97","15.3","9780"]
[68029,"BLR2","Unit_2",2028,"acid gas","SO2","2010-03-10T17:00:00",4.0000000000000001E-3,"16.37","ppm @ 7% O2","16.37","11.9","9780"]
[68029,"BLR2","Unit_2",2028,"acid gas","SO2","2010-03-10T18:00:00",5.0000000000000001E-3,"10.18","ppm @ 7% O2","10.18","12.5","9780"]
[68029,"BLR2","Unit_2",2028,"acid gas","SO2","2010-03-10T19:00:00",3.0000000000000001E-3,"4.2","ppm @ 7% O2","4.2","11.2","9780"]
[68029,"BLR2","Unit_2",2028,"acid gas","SO2","2010-03-10T20:00:00",2.3E-2,"2.65","ppm @ 7% O2","2.65","11.7","9780"]
[68029,"BLR2","Unit_2",2028,"acid gas","SO2","2010-03-10T21:00:00",7.0000000000000001E-3,"4.72","ppm @ 7% O2","4.72","10.3","9780"]
[]
[68029,{"$f":"IF(D241=2027,\"BLR1\",\"BLR2\")","v":"BLR2"},{"$f":"IF(D241=2027,\"Unit_1\",\"Unit_2\")","v":"Unit_2"},2028,"acid gas","SO2","2010-03-10T22:00:00",1E-3,"4.41","ppm @ 7% O2","4.41","9.4","9780"]
[68029,"BLR2","Unit_2",2028,"acid gas","SO2","2010-03-10T23:00:00",1E-3,"3.03","ppm @ 7% O2","3.03","8.3","9780"]
[68029,"BLR2","Unit_2",2028,"acid gas","SO2","2010-03-11",5.0000000000000001E-3,"0.64","ppm @ 7% O2","0.64","7.4","9780"]
[68029,"BLR2","Unit_2",2028,"acid gas","SO2","2010-03-11T01:00:00",3.6999999999999998E-2,"3.18","ppm @ 7% O2","3.18","7.2","9780"]
[68029,"BLR2","Unit_2",2028,"acid gas","SO2","2010-03-11T02:00:00",1E-3,"5.85","ppm @ 7% O2","5.85","6.9","9780"]
[68029,"BLR2","Unit_2",2028,"acid gas","SO2","2010-03-11T03:00:00",5.0000000000000001E-3,"5.78","ppm @ 7% O2","5.78","6.4","9780"]
[68029,"BLR2","Unit_2",2028,"acid gas","SO2","2010-03-11T04:00:00",7.0000000000000001E-3,"3.95","ppm @ 7% O2","3.95","6","9780"]
[68029,"BLR2","Unit_2",2028,"acid gas","SO2","2010-03-11T05:00:00",1.6E-2,"2.76","ppm @ 7% O2","2.76","5.9","9780"]
[68029,"BLR2","Unit_2",2028,"acid gas","SO2","2010-03-11T06:00:00",5.0000000000000001E-3,"4.32","ppm @ 7% O2","4.32","5.9","9780"]
[68029,"BLR2","Unit_2",2028,"acid gas","SO2","2010-03-11T07:00:00",1.2999999999999999E-2,"3.92","ppm @ 7% O2","3.92","6.4","9780"]
[68029,"BLR2","Unit_2",2028,"acid gas","SO2","2010-03-11T08:00:00",1.4E-2,"4.25","ppm @ 7% O2","4.25","6.7","9780"]
[68029,"BLR2","Unit_2",2028,"acid gas","SO2","2010-03-11T09:00:00",7.0000000000000001E-3,"4.36","ppm @ 7% O2","4.36","6","9780"]
[68029,"BLR2","Unit_2",2028,"acid gas","SO2","2010-03-11T10:00:00",0.01,"4.96","ppm @ 7% O2","4.96","5.6","9780"]
[68029,"BLR2","Unit_2",2028,"acid gas","SO2","2010-03-11T11:00:00",8.9999999999999993E-3,"4.45","ppm @ 7% O2","4.45","5.7","9780"]
[68029,"BLR2","Unit_2",2028,"acid gas","SO2","2010-03-11T12:00:00",8.0000000000000002E-3,"3.91","ppm @ 7% O2","3.91","5.7","9780"]
[68029,"BLR2","Unit_2",2028,"acid gas","SO2","2010-03-11T13:00:00",0.01,"3.37","ppm @ 7% O2","3.37","5.8","9780"]
[68029,"BLR2","Unit_2",2028,"acid gas","SO2","2010-03-11T14:00:00",1.4E-2,"3.55","ppm @ 7% O2","3.55","5.5","9780"]
[68029,"BLR2","Unit_2",2028,"acid gas","SO2","2010-03-11T15:00:00",1.2999999999999999E-2,"4.29","ppm @ 7% O2","4.29","5.5","9780"]
[68029,"BLR2","Unit_2",2028,"acid gas","SO2","2010-03-11T16:00:00",0.01,"5.22","ppm @ 7% O2","5.22","5.7","9780"]
[68029,"BLR2","Unit_2",2028,"acid gas","SO2","2010-03-11T17:00:00",4.0000000000000001E-3,"4.75","ppm @ 7% O2","4.75","6.4","9780"]
[68029,"BLR2","Unit_2",2028,"acid gas","SO2","2010-03-11T18:00:00",1.6E-2,"3.55","ppm @ 7% O2","3.55","6.9","9780"]
[68029,"BLR2","Unit_2",2028,"acid gas","SO2","2010-03-11T19:00:00",3.0000000000000001E-3,"3.48","ppm @ 7% O2","3.48","7","9780"]
[68029,"BLR2","Unit_2",2028,"acid gas","SO2","2010-03-11T20:00:00",5.0000000000000001E-3,"3.2","ppm @ 7% O2","3.2","7.1","9780"]
[68029,"BLR2","Unit_2",2028,"acid gas","SO2","2010-03-11T21:00:00",1.4999999999999999E-2,"3.79","ppm @ 7% O2","3.79","7.1","9780"]
[68029,"BLR2","Unit_2",2028,"acid gas","SO2","2010-03-11T22:00:00",1.2E-2,"4.4","ppm @ 7% O2","4.4","7.1","9780"]
[68029,"BLR2","Unit_2",2028,"acid gas","SO2","2010-03-11T23:00:00",0.02,"5.08","ppm @ 7% O2","5.08","7.2","9780"]
[68029,"BLR2","Unit_2",2028,"acid gas","SO2","2010-03-12",1E-3,"5.27","ppm @ 7% O2","5.27","7.2","9780"]
[68029,"BLR2","Unit_2",2028,"acid gas","SO2","2010-03-12T01:00:00",1E-3,"3.27","ppm @ 7% O2","3.27","7.5","9780"]
[68029,"BLR2","Unit_2",2028,"acid gas","SO2","2010-03-12T02:00:00",1E-3,"1.94","ppm @ 7% O2","1.94","8.6","9780"]
[68029,"BLR2","Unit_2",2028,"acid gas","SO2","2010-03-12T03:00:00",1E-3,"0.45","ppm @ 7% O2","0.45","8.6","9780"]
[68029,"BLR2","Unit_2",2028,"acid gas","SO2","2010-03-12T04:00:00",1.2999999999999999E-2,"1.32","ppm @ 7% O2","1.32","8.5","9780"]
[68029,"BLR2","Unit_2",2028,"acid gas","SO2","2010-03-12T05:00:00",1.9E-2,"3.08","ppm @ 7% O2","3.08","7.3","9780"]
[68029,"BLR2","Unit_2",2028,"acid gas","SO2","2010-03-12T06:00:00",1.4E-2,"5.77","ppm @ 7% O2","5.77","7.2","9780"]
[68029,"BLR2","Unit_2",2028,"acid gas","SO2","2010-03-12T07:00:00",1.0999999999999999E-2,"5.94","ppm @ 7% O2","5.94","7.2","9780"]
[68029,"BLR2","Unit_2",2028,"acid gas","SO2","2010-03-12T08:00:00",4.0000000000000001E-3,"5.27","ppm @ 7% O2","5.27","7.1","9780"]
[68029,"BLR2","Unit_2",2028,"acid gas","SO2","2010-03-12T09:00:00",6.0000000000000001E-3,"3.08","ppm @ 7% O2","3.08","7.1","9780"]
[68029,"BLR2","Unit_2",2028,"acid gas","SO2","2010-03-12T10:00:00",6.0000000000000001E-3,"2.63","ppm @ 7% O2","2.63","7.1","9780"]
[68029,"BLR2","Unit_2",2028,"acid gas","SO2","2010-03-12T11:00:00",6.0000000000000001E-3,"1.96","ppm @ 7% O2","1.96","5.9","9780"]
[68029,"BLR2","Unit_2",2028,"acid gas","SO2","2010-03-12T12:00:00",1E-3,"1.97","ppm @ 7% O2","1.97","5.8","9780"]
[68029,"BLR2","Unit_2",2028,"acid gas","SO2","2010-03-12T13:00:00",1.0999999999999999E-2,"2.12","ppm @ 7% O2","2.12","5.8","9780"]
[68029,"BLR2","Unit_2",2028,"acid gas","SO2","2010-03-12T14:00:00",1.2E-2,"2.65","ppm @ 7% O2","2.65","5.8","9780"]
[68029,"BLR2","Unit_2",2028,"acid gas","SO2","2010-03-12T15:00:00",2.1999999999999999E-2,"5.06","ppm @ 7% O2","5.06","5.8","9780"]
[68029,"BLR2","Unit_2",2028,"acid gas","SO2","2010-03-12T16:00:00",1.0999999999999999E-2,"5.88","ppm @ 7% O2","5.88","5.9","9780"]
[68029,"BLR2","Unit_2",2028,"acid gas","SO2","2010-03-12T17:00:00",0.01,"6.57","ppm @ 7% O2","6.57","6","9780"]
[68029,"BLR2","Unit_2",2028,"acid gas","SO2","2010-03-12T18:00:00",8.0000000000000002E-3,"4.69","ppm @ 7% O2","4.69","5.9","9780"]
[68029,"BLR2","Unit_2",2028,"acid gas","SO2","2010-03-12T19:00:00",5.0000000000000001E-3,"3.7","ppm @ 7% O2","3.7","6","9780"]
[68029,"BLR2","Unit_2",2028,"acid gas","SO2","2010-03-12T20:00:00",2.3E-2,"4.02","ppm @ 7% O2","4.02","6.1","9780"]
[68029,"BLR2","Unit_2",2028,"acid gas","SO2","2010-03-12T21:00:00",1.4999999999999999E-2,"5.07","ppm @ 7% O2","5.07","6.1","9780"]
[68029,"BLR2","Unit_2",2028,"acid gas","SO2","2010-03-12T22:00:00",5.0000000000000001E-3,"5.96","ppm @ 7% O2","5.96","6","9780"]
[68029,"BLR2","Unit_2",2028,"acid gas","SO2","2010-03-12T23:00:00",1.2999999999999999E-2,"4.78","ppm @ 7% O2","4.78","6","9780"]
[68029,"BLR2","Unit_2",2028,"acid gas","SO2","2010-03-13",2.1000000000000001E-2,"5.19","ppm @ 7% O2","5.19","6.1","9780"]
[68029,"BLR2","Unit_2",2028,"acid gas","SO2","2010-03-13T01:00:00",1.2E-2,"5.84","ppm @ 7% O2","5.84","6","9780"]
[68029,"BLR2","Unit_2",2028,"acid gas","SO2","2010-03-13T02:00:00",6.0000000000000001E-3,"6.02","ppm @ 7% O2","6.02","6.1","9780"]
[68029,"BLR2","Unit_2",2028,"acid gas","SO2","2010-03-13T03:00:00",5.0000000000000001E-3,"4.09","ppm @ 7% O2","4.09","6.1","9780"]
[68029,"BLR2","Unit_2",2028,"acid gas","SO2","2010-03-13T04:00:00",1.2E-2,"2.77","ppm @ 7% O2","2.77","6.1","9780"]
[68029,"BLR2","Unit_2",2028,"acid gas","SO2","2010-03-13T05:00:00",1.7999999999999999E-2,"4.21","ppm @ 7% O2","4.21","6.1","9780"]
[68029,"BLR2","Unit_2",2028,"acid gas","SO2","2010-03-13T06:00:00",8.9999999999999993E-3,"4.82","ppm @ 7% O2","4.82","6.2","9780"]
[68029,"BLR2","Unit_2",2028,"acid gas","SO2","2010-03-13T07:00:00",1.9E-2,"6.21","ppm @ 7% O2","6.21","6.4","9780"]
[68029,"BLR2","Unit_2",2028,"acid gas","SO2","2010-03-13T08:00:00",1.2E-2,"5.65","ppm @ 7% O2","5.65","5.9","9780"]
[68029,"BLR2","Unit_2",2028,"acid gas","SO2","2010-03-13T09:00:00",2.9000000000000001E-2,"7.07","ppm @ 7% O2","7.07","5.8","9780"]
[68029,"BLR2","Unit_2",2028,"acid gas","SO2","2010-03-13T10:00:00",1E-3,"6.89","ppm @ 7% O2","6.89","5.8","9780"]
[68029,"BLR2","Unit_2",2028,"acid gas","SO2","2010-03-13T11:00:00",8.0000000000000002E-3,"5.52","ppm @ 7% O2","5.52","5.8","9780"]
[68029,"BLR2","Unit_2",2028,"acid gas","SO2","2010-03-13T12:00:00",1.7999999999999999E-2,"4.28","ppm @ 7% O2","4.28","5.8","9780"]
[68029,"BLR2","Unit_2",2028,"acid gas","SO2","2010-03-13T13:00:00",0.01,"4.57","ppm @ 7% O2","4.57","5.8","9780"]
[68029,{"$f":"IF(D305=2027,\"BLR1\",\"BLR2\")","v":"BLR2"},{"$f":"IF(D305=2027,\"Unit_1\",\"Unit_2\")","v":"Unit_2"},2028,"acid gas","SO2","2010-03-13T14:00:00",8.0000000000000002E-3,"5.14","ppm @ 7% O2","5.14","5.7","9780"]
[68029,"BLR2","Unit_2",2028,"acid gas","SO2","2010-03-13T15:00:00",1.4999999999999999E-2,"5.41","ppm @ 7% O2","5.41","5.7","9780"]
[68029,"BLR2","Unit_2",2028,"acid gas","SO2","2010-03-13T16:00:00",0.01,"4.4","ppm @ 7% O2","4.4","5.8","9780"]
[68029,"BLR2","Unit_2",2028,"acid gas","SO2","2010-03-13T17:00:00",1.2E-2,"4.64","ppm @ 7% O2","4.64","5.9","9780"]
[68029,"BLR2","Unit_2",2028,"acid gas","SO2","2010-03-13T18:00:00",1.2E-2,"4.96","ppm @ 7% O2","4.96","5.8","9780"]
[68029,"BLR2","Unit_2",2028,"acid gas","SO2","2010-03-13T19:00:00",8.0000000000000002E-3,"4.51","ppm @ 7% O2","4.51","5.9","9780"]
[68029,"BLR2","Unit_2",2028,"acid gas","SO2","2010-03-13T20:00:00",7.0000000000000001E-3,"3.88","ppm @ 7% O2","3.88","6","9780"]
[68029,"BLR2","Unit_2",2028,"acid gas","SO2","2010-03-13T21:00:00",1.4999999999999999E-2,"3.53","ppm @ 7% O2","3.53","6","9780"]
[68029,"BLR2","Unit_2",2028,"acid gas","SO2","2010-03-13T22:00:00",1.2E-2,"3.99","ppm @ 7% O2","3.99","5.9","9780"]
[68029,"BLR2","Unit_2",2028,"acid gas","SO2","2010-03-13T23:00:00",2.1000000000000001E-2,"5.68","ppm @ 7% O2","5.68","5.9","9780"]
[68029,"BLR2","Unit_2",2028,"acid gas","SO2","2010-03-14",1.0999999999999999E-2,"6.19","ppm @ 7% O2","6.19","5.9","9780"]
[68029,"BLR2","Unit_2",2028,"acid gas","SO2","2010-03-14T01:00:00",1.4999999999999999E-2,"6.49","ppm @ 7% O2","6.49","6.1","9780"]
[68029,"BLR2","Unit_2",2028,"acid gas","SO2","2010-03-14T02:00:00",1.4E-2,"6.11","ppm @ 7% O2","6.11","6.1","9780"]
[68029,"BLR2","Unit_2",2028,"acid gas","SO2","2010-03-14T03:00:00",1.4E-2,"6.28","ppm @ 7% O2","6.28","6","9780"]
[68029,"BLR2","Unit_2",2028,"acid gas","SO2","2010-03-14T04:00:00",3.0000000000000001E-3,"5.16","ppm @ 7% O2","5.16","6.1","9780"]
[68029,"BLR2","Unit_2",2028,"acid gas","SO2","2010-03-14T05:00:00",2E-3,"3.4","ppm @ 7% O2","3.4","6.2","9780"]
[68029,"BLR2","Unit_2",2028,"acid gas","SO2","2010-03-14T06:00:00",1E-3,"1.15","ppm @ 7% O2","1.15","6.2","9780"]
[68029,"BLR2","Unit_2",2028,"acid gas","SO2","2010-03-14T07:00:00",3.0000000000000001E-3,"0.68","ppm @ 7% O2","0.68","6.2","9780"]
[68029,"BLR2","Unit_2",2028,"acid gas","SO2","2010-03-14T08:00:00",3.0000000000000001E-3,"0.81","ppm @ 7% O2","0.81","6.1","9780"]
[68029,"BLR2","Unit_2",2028,"acid gas","SO2","2010-03-14T09:00:00",3.0000000000000001E-3,"0.93","ppm @ 7% O2","0.93","6","9780"]
[68029,"BLR2","Unit_2",2028,"acid gas","SO2","2010-03-14T10:00:00",1.0999999999999999E-2,"1.83","ppm @ 7% O2","1.83","6","9780"]
[68029,"BLR2","Unit_2",2028,"acid gas","SO2","2010-03-14T11:00:00",0.01,"2.57","ppm @ 7% O2","2.57","6","9780"]
[68029,"BLR2","Unit_2",2028,"acid gas","SO2","2010-03-14T12:00:00",2.3E-2,"4.66","ppm @ 7% O2","4.66","6","9780"]
[68029,"BLR2","Unit_2",2028,"acid gas","SO2","2010-03-14T13:00:00",2E-3,"5.26","ppm @ 7% O2","5.26","6","9780"]
[68029,"BLR2","Unit_2",2028,"acid gas","SO2","2010-03-14T14:00:00",8.0000000000000002E-3,"4.63","ppm @ 7% O2","4.63","5.9","9780"]
[68029,"BLR2","Unit_2",2028,"acid gas","SO2","2010-03-14T15:00:00",1.0999999999999999E-2,"3.73","ppm @ 7% O2","3.73","6","9780"]
[68029,"BLR2","Unit_2",2028,"acid gas","SO2","2010-03-14T16:00:00",1.2999999999999999E-2,"3.62","ppm @ 7% O2","3.62","6","9780"]
[68029,"BLR2","Unit_2",2028,"acid gas","SO2","2010-03-14T17:00:00",1.6E-2,"5.03","ppm @ 7% O2","5.03","6","9780"]
[68029,"BLR2","Unit_2",2028,"acid gas","SO2","2010-03-14T18:00:00",0.01,"5.49","ppm @ 7% O2","5.49","6.1","9780"]
[68029,"BLR2","Unit_2",2028,"acid gas","SO2","2010-03-14T19:00:00",3.0000000000000001E-3,"4.97","ppm @ 7% O2","4.97","6","9780"]
[68029,"BLR2","Unit_2",2028,"acid gas","SO2","2010-03-14T20:00:00",1E-3,"3.18","ppm @ 7% O2","3.18","6.1","9780"]
[68029,"BLR2","Unit_2",2028,"acid gas","SO2","2010-03-14T21:00:00",3.0000000000000001E-3,"1.55","ppm @ 7% O2","1.55","6.1","9780"]
[68029,"BLR2","Unit_2",2028,"acid gas","SO2","2010-03-14T22:00:00",2.1000000000000001E-2,"1.58","ppm @ 7% O2","1.58","6.2","9780"]
[68029,"BLR2","Unit_2",2028,"acid gas","SO2","2010-03-14T23:00:00",0.01,"4.23","ppm @ 7% O2","4.23","6.1","9780"]
[68029,"BLR2","Unit_2",2028,"acid gas","SO2","2010-03-15",1.7000000000000001E-2,"5.86","ppm @ 7% O2","5.86","6.1","9780"]
[68029,"BLR2","Unit_2",2028,"acid gas","SO2","2010-03-15T01:00:00",1.6E-2,"6.58","ppm @ 7% O2","6.58","6.1","9780"]
[68029,"BLR2","Unit_2",2028,"acid gas","SO2","2010-03-15T02:00:00",1.4E-2,"6.44","ppm @ 7% O2","6.44","6.1","9780"]
[68029,"BLR2","Unit_2",2028,"acid gas","SO2","2010-03-15T03:00:00",1.2999999999999999E-2,"5.75","ppm @ 7% O2","5.75","6.2","9780"]
[68029,"BLR2","Unit_2",2028,"acid gas","SO2","2010-03-15T04:00:00",1.9E-2,"6.23","ppm @ 7% O2","6.23","6.2","9780"]
[68029,"BLR2","Unit_2",2028,"acid gas","SO2","2010-03-15T05:00:00",7.0000000000000001E-3,"5.6","ppm @ 7% O2","5.6","6.1","9780"]
[68029,"BLR2","Unit_2",2028,"acid gas","SO2","2010-03-15T06:00:00",2E-3,"4.79","ppm @ 7% O2","4.79","6","9780"]
[68029,"BLR2","Unit_2",2028,"acid gas","SO2","2010-03-15T07:00:00",1.4E-2,"3.47","ppm @ 7% O2","3.47","6","9780"]
[68029,"BLR2","Unit_2",2028,"acid gas","SO2","2010-03-15T08:00:00",1.4E-2,"3.67","ppm @ 7% O2","3.67","5.9","9780"]
[68029,"BLR2","Unit_2",2028,"acid gas","SO2","2010-03-15T09:00:00",1.2E-2,"4.86","ppm @ 7% O2","4.86","5.9","9780"]
[68029,"BLR2","Unit_2",2028,"acid gas","SO2","2010-03-15T10:00:00",4.0000000000000001E-3,"4.96","ppm @ 7% O2","4.96","5.9","9780"]
[68029,"BLR2","Unit_2",2028,"acid gas","SO2","2010-03-15T11:00:00",7.0000000000000001E-3,"3.16","ppm @ 7% O2","3.16","5.9","9780"]
[68029,"BLR2","Unit_2",2028,"acid gas","SO2","2010-03-15T12:00:00",1.0999999999999999E-2,"2.91","ppm @ 7% O2","2.91","5.9","9780"]
[68029,"BLR2","Unit_2",2028,"acid gas","SO2","2010-03-15T13:00:00",8.0000000000000002E-3,"3.03","ppm @ 7% O2","3.03","6","9780"]
[68029,"BLR2","Unit_2",2028,"acid gas","SO2","2010-03-15T14:00:00",2.1000000000000001E-2,"4.98","ppm @ 7% O2","4.98","6","9780"]
[68029,"BLR2","Unit_2",2028,"acid gas","SO2","2010-03-15T15:00:00",1.2999999999999999E-2,"5.39","ppm @ 7% O2","5.39","6","9780"]
[68029,"BLR2","Unit_2",2028,"acid gas","SO2","2010-03-15T16:00:00",2E-3,"5.18","ppm @ 7% O2","5.18","6","9780"]
[68029,"BLR2","Unit_2",2028,"acid gas","SO2","2010-03-15T17:00:00",5.0000000000000001E-3,"3.14","ppm @ 7% O2","3.14","6","9780"]
[68029,"BLR2","Unit_2",2028,"acid gas","SO2","2010-03-15T18:00:00",1.7999999999999999E-2,"3.02","ppm @ 7% O2","3.02","6","9780"]
[68029,"BLR2","Unit_2",2028,"acid gas","SO2","2010-03-15T19:00:00",8.0000000000000002E-3,"3.78","ppm @ 7% O2","3.78","5.8","9780"]
[68029,"BLR2","Unit_2",2028,"acid gas","SO2","2010-03-15T20:00:00",1.4E-2,"5.02","ppm @ 7% O2","5.02","5.7","9780"]
[68029,"BLR2","Unit_2",2028,"acid gas","SO2","2010-03-15T21:00:00",1.4E-2,"5.51","ppm @ 7% O2","5.51","5.6","9780"]
[68029,"BLR2","Unit_2",2028,"acid gas","SO2","2010-03-15T22:00:00",1E-3,"4.58","ppm @ 7% O2","4.58","5.7","9780"]
[68029,"BLR2","Unit_2",2028,"acid gas","SO2","2010-03-15T23:00:00",2E-3,"3.14","ppm @ 7% O2","3.14","6","9780"]
[68029,"BLR2","Unit_2",2028,"acid gas","SO2","2010-03-16",7.0000000000000001E-3,"1.51","ppm @ 7% O2","1.51","6.1","9780"]
[68029,"BLR2","Unit_2",2028,"acid gas","SO2","2010-03-16T01:00:00",0.02,"2.48","ppm @ 7% O2","2.48","6.2","9780"]
[68029,"BLR2","Unit_2",2028,"acid gas","SO2","2010-03-16T02:00:00",0.01,"4.62","ppm @ 7% O2","4.62","6.2","9780"]
[68029,"BLR2","Unit_2",2028,"acid gas","SO2","2010-03-16T03:00:00",2E-3,"4.78","ppm @ 7% O2","4.78","6.2","9780"]
[68029,"BLR2","Unit_2",2028,"acid gas","SO2","2010-03-16T04:00:00",1E-3,"3.12","ppm @ 7% O2","3.12","6.2","9780"]
[68029,"BLR2","Unit_2",2028,"acid gas","SO2","2010-03-16T05:00:00",1E-3,"0.97","ppm @ 7% O2","0.97","6.2","9780"]
[68029,{"$f":"IF(D369=2027,\"BLR1\",\"BLR2\")","v":"BLR2"},{"$f":"IF(D369=2027,\"Unit_1\",\"Unit_2\")","v":"Unit_2"},2028,"acid gas","SO2","2010-03-16T06:00:00",7.0000000000000001E-3,"0.63","ppm @ 7% O2","0.63","6.2","9780"]
[68029,"BLR2","Unit_2",2028,"acid gas","SO2","2010-03-16T07:00:00",2.1000000000000001E-2,"2.69","ppm @ 7% O2","2.69","6","9780"]
[68029,"BLR2","Unit_2",2028,"acid gas","SO2","2010-03-16T08:00:00",1.6E-2,"5.06","ppm @ 7% O2","5.06","5.9","9780"]
[68029,"BLR2","Unit_2",2028,"acid gas","SO2","2010-03-16T09:00:00",1.6E-2,"7.08","ppm @ 7% O2","7.08","5.9","9780"]
[68029,"BLR2","Unit_2",2028,"acid gas","SO2","2010-03-16T10:00:00",6.0000000000000001E-3,"6.53","ppm @ 7% O2","6.53","5.9","9780"]
[68029,"BLR2","Unit_2",2028,"acid gas","SO2","2010-03-16T11:00:00",8.0000000000000002E-3,"4.51","ppm @ 7% O2","4.51","5.9","9780"]
[68029,"BLR2","Unit_2",2028,"acid gas","SO2","2010-03-16T12:00:00",1.9E-2,"4.28","ppm @ 7% O2","4.28","5.9","9780"]
[68029,"BLR2","Unit_2",2028,"acid gas","SO2","2010-03-16T13:00:00",1.7000000000000001E-2,"4.82","ppm @ 7% O2","4.82","5.9","9780"]
[68029,"BLR2","Unit_2",2028,"acid gas","SO2","2010-03-16T14:00:00",0.01,"6.35","ppm @ 7% O2","6.35","5.9","9780"]
[68029,"BLR2","Unit_2",2028,"acid gas","SO2","2010-03-16T15:00:00",1.4E-2,"5.94","ppm @ 7% O2","5.94","5.9","9780"]
[68029,"BLR2","Unit_2",2028,"acid gas","SO2","2010-03-16T16:00:00",1.2E-2,"5.01","ppm @ 7% O2","5.01","6","9780"]
[68029,"BLR2","Unit_2",2028,"acid gas","SO2","2010-03-16T17:00:00",1.7000000000000001E-2,"5.3","ppm @ 7% O2","5.3","6","9780"]
[68029,"BLR2","Unit_2",2028,"acid gas","SO2","2010-03-16T18:00:00",7.0000000000000001E-3,"5.44","ppm @ 7% O2","5.44","6.1","9780"]
[68029,"BLR2","Unit_2",2028,"acid gas","SO2","2010-03-16T19:00:00",7.0000000000000001E-3,"5.12","ppm @ 7% O2","5.12","5.9","9780"]
[68029,"BLR2","Unit_2",2028,"acid gas","SO2","2010-03-16T20:00:00",0.02,"4.49","ppm @ 7% O2","4.49","5.9","9780"]
[68029,"BLR2","Unit_2",2028,"acid gas","SO2","2010-03-16T21:00:00",0.01,"4.99","ppm @ 7% O2","4.99","6","9780"]
[68029,"BLR2","Unit_2",2028,"acid gas","SO2","2010-03-16T22:00:00",1.9E-2,"5.72","ppm @ 7% O2","5.72","6","9780"]
[68029,"BLR2","Unit_2",2028,"acid gas","SO2","2010-03-16T23:00:00",4.0000000000000001E-3,"5.51","ppm @ 7% O2","5.51","6","9780"]
[68029,"BLR2","Unit_2",2028,"acid gas","SO2","2010-03-17",1.2999999999999999E-2,"4.73","ppm @ 7% O2","4.73","6","9780"]
[68029,"BLR2","Unit_2",2028,"acid gas","SO2","2010-03-17T01:00:00",1.0999999999999999E-2,"4.14","ppm @ 7% O2","4.14","6","9780"]
[68029,"BLR2","Unit_2",2028,"acid gas","SO2","2010-03-17T02:00:00",1.4999999999999999E-2,"4.19","ppm @ 7% O2","4.19","6","9780"]
[68029,"BLR2","Unit_2",2028,"acid gas","SO2","2010-03-17T03:00:00",8.0000000000000002E-3,"4.46","ppm @ 7% O2","4.46","6","9780"]
[68029,"BLR2","Unit_2",2028,"acid gas","SO2","2010-03-17T04:00:00",1.7000000000000001E-2,"5.1","ppm @ 7% O2","5.1","6","9780"]
[68029,"BLR2","Unit_2",2028,"acid gas","SO2","2010-03-17T05:00:00",1.2999999999999999E-2,"6.03","ppm @ 7% O2","6.03","6.1","9780"]
[68029,"BLR2","Unit_2",2028,"acid gas","SO2","2010-03-17T06:00:00",1.9E-2,"5.57","ppm @ 7% O2","5.57","6.1","9780"]
[68029,"BLR2","Unit_2",2028,"acid gas","SO2","2010-03-17T07:00:00",2.1000000000000001E-2,"7.01","ppm @ 7% O2","7.01","6","9780"]
[68029,"BLR2","Unit_2",2028,"acid gas","SO2","2010-03-17T08:00:00",1.0999999999999999E-2,"6.54","ppm @ 7% O2","6.54","5.9","9780"]
[68029,"BLR2","Unit_2",2028,"acid gas","SO2","2010-03-17T09:00:00",8.0000000000000002E-3,"6.78","ppm @ 7% O2","6.78","5.9","9780"]
[68029,"BLR2","Unit_2",2028,"acid gas","SO2","2010-03-17T10:00:00",1.4E-2,"4.96","ppm @ 7% O2","4.96","5.8","9780"]
[68029,"BLR2","Unit_2",2028,"acid gas","SO2","2010-03-17T11:00:00",1.0999999999999999E-2,"4.66","ppm @ 7% O2","4.66","5.8","9780"]
[68029,"BLR2","Unit_2",2028,"acid gas","SO2","2010-03-17T12:00:00",2E-3,"3.91","ppm @ 7% O2","3.91","5.7","9780"]
[68029,"BLR2","Unit_2",2028,"acid gas","SO2","2010-03-17T13:00:00",8.0000000000000002E-3,"3.02","ppm @ 7% O2","3.02","5.8","9780"]
[68029,"BLR2","Unit_2",2028,"acid gas","SO2","2010-03-17T14:00:00",2.5000000000000001E-2,"3.37","ppm @ 7% O2","3.37","5.8","9780"]
[68029,"BLR2","Unit_2",2028,"acid gas","SO2","2010-03-17T15:00:00",1.4999999999999999E-2,"5.73","ppm @ 7% O2","5.73","5.8","9780"]
[68029,"BLR2","Unit_2",2028,"acid gas","SO2","2010-03-17T16:00:00",1.4E-2,"7.34","ppm @ 7% O2","7.34","5.8","9780"]
[68029,"BLR2","Unit_2",2028,"acid gas","SO2","2010-03-17T17:00:00",6.0000000000000001E-3,"6.4","ppm @ 7% O2","6.4","5.8","9780"]
[68029,"BLR2","Unit_2",2028,"acid gas","SO2","2010-03-17T18:00:00",8.0000000000000002E-3,"4.56","ppm @ 7% O2","4.56","5.8","9780"]
[68029,"BLR2","Unit_2",2028,"acid gas","SO2","2010-03-17T19:00:00",1.2E-2,"3.32","ppm @ 7% O2","3.32","5.9","9780"]
[68029,"BLR2","Unit_2",2028,"acid gas","SO2","2010-03-17T20:00:00",2.4E-2,"5.3","ppm @ 7% O2","5.3","5.9","9780"]
[68029,"BLR2","Unit_2",2028,"acid gas","SO2","2010-03-17T21:00:00",1.4999999999999999E-2,"6.04","ppm @ 7% O2","6.04","5.8","9780"]
[68029,"BLR2","Unit_2",2028,"acid gas","SO2","2010-03-17T22:00:00",1.7000000000000001E-2,"7.52","ppm @ 7% O2","7.52","5.9","9780"]
[68029,"BLR2","Unit_2",2028,"acid gas","SO2","2010-03-17T23:00:00",4.0000000000000001E-3,"5.66","ppm @ 7% O2","5.66","5.9","9780"]
[68029,"BLR2","Unit_2",2028,"acid gas","SO2","2010-03-18",1.7999999999999999E-2,"5.96","ppm @ 7% O2","5.96","5.9","9780"]
[68029,"BLR2","Unit_2",2028,"acid gas","SO2","2010-03-18T01:00:00",2E-3,"4.31","ppm @ 7% O2","4.31","5.9","9780"]
[68029,"BLR2","Unit_2",2028,"acid gas","SO2","2010-03-18T02:00:00",2.1999999999999999E-2,"4.21","ppm @ 7% O2","4.21","5.9","9780"]
[68029,"BLR2","Unit_2",2028,"acid gas","SO2","2010-03-18T03:00:00",2.8000000000000001E-2,"6.33","ppm @ 7% O2","6.33","5.9","9780"]
[68029,"BLR2","Unit_2",2028,"acid gas","SO2","2010-03-18T04:00:00",8.0000000000000002E-3,"7.52","ppm @ 7% O2","7.52","5.9","9780"]
[68029,"BLR2","Unit_2",2028,"acid gas","SO2","2010-03-18T05:00:00",1E-3,"6.8","ppm @ 7% O2","6.8","5.8","9780"]
[68029,"BLR2","Unit_2",2028,"acid gas","SO2","2010-03-18T06:00:00",1.2999999999999999E-2,"3.46","ppm @ 7% O2","3.46","5.8","9780"]
[68029,"BLR2","Unit_2",2028,"acid gas","SO2","2010-03-18T07:00:00",1.7000000000000001E-2,"3.83","ppm @ 7% O2","3.83","5.7","9780"]
[68029,"BLR2","Unit_2",2028,"acid gas","SO2","2010-03-18T08:00:00",1.4E-2,"5.2","ppm @ 7% O2","5.2","5.7","9780"]
[68029,"BLR2","Unit_2",2028,"acid gas","SO2","2010-03-18T09:00:00",2.3E-2,"6.42","ppm @ 7% O2","6.42","5.6","9780"]
[68029,"BLR2","Unit_2",2028,"acid gas","SO2","2010-03-18T10:00:00",3.0000000000000001E-3,"6.02","ppm @ 7% O2","6.02","5.6","9780"]
[68029,"BLR2","Unit_2",2028,"acid gas","SO2","2010-03-18T11:00:00",1.2999999999999999E-2,"5.58","ppm @ 7% O2","5.58","5.5","9780"]
[68029,"BLR2","Unit_2",2028,"acid gas","SO2","2010-03-18T12:00:00",8.0000000000000002E-3,"4.63","ppm @ 7% O2","4.63","5.6","9780"]
[68029,"BLR2","Unit_2",2028,"acid gas","SO2","2010-03-18T13:00:00",1.4999999999999999E-2,"4.33","ppm @ 7% O2","4.33","5.7","9780"]
[68029,"BLR2","Unit_2",2028,"acid gas","SO2","2010-03-18T14:00:00",1.0999999999999999E-2,"4.72","ppm @ 7% O2","4.72","0","9780"]
[68029,"BLR2","Unit_2",2028,"acid gas","SO2","2010-03-18T15:00:00",1.0999999999999999E-2,"4.81","ppm @ 7% O2","4.81","5.8","9780"]
[68029,"BLR2","Unit_2",2028,"acid gas","SO2","2010-03-18T16:00:00",1.4999999999999999E-2,"4.95","ppm @ 7% O2","4.95","5.7","9780"]
[68029,"BLR2","Unit_2",2028,"acid gas","SO2","2010-03-18T17:00:00",1.2E-2,"4.9","ppm @ 7% O2","4.9","5.8","9780"]
[68029,"BLR2","Unit_2",2028,"acid gas","SO2","2010-03-18T18:00:00",4.0000000000000001E-3,"4.58","ppm @ 7% O2","4.58","5.7","9780"]
[68029,"BLR2","Unit_2",2028,"acid gas","SO2","2010-03-18T19:00:00",1.7000000000000001E-2,"4.24","ppm @ 7% O2","4.24","5.8","9780"]
[68029,"BLR2","Unit_2",2028,"acid gas","SO2","2010-03-18T20:00:00",0.01,"4.91","ppm @ 7% O2","4.91","5.8","9780"]
[68029,"BLR2","Unit_2",2028,"acid gas","SO2","2010-03-18T21:00:00",0.01,"4.85","ppm @ 7% O2","4.85","5.8","9780"]
[68029,{"$f":"IF(D433=2027,\"BLR1\",\"BLR2\")","v":"BLR2"},{"$f":"IF(D433=2027,\"Unit_1\",\"Unit_2\")","v":"Unit_2"},2028,"acid gas","SO2","2010-03-18T22:00:00",1.2999999999999999E-2,"5.18","ppm @ 7% O2","5.18","5.8","9780"]
[68029,"BLR2","Unit_2",2028,"acid gas","SO2","2010-03-18T23:00:00",2.1000000000000001E-2,"5.15","ppm @ 7% O2","5.15","5.8","9780"]
[68029,"BLR2","Unit_2",2028,"acid gas","SO2","2010-03-19",6.0000000000000001E-3,"5.9","ppm @ 7% O2","5.9","5.8","9780"]
[68029,"BLR2","Unit_2",2028,"acid gas","SO2","2010-03-19T01:00:00",1.2E-2,"5.41","ppm @ 7% O2","5.41","5.8","9780"]
[68029,"BLR2","Unit_2",2028,"acid gas","SO2","2010-03-19T02:00:00",1.2E-2,"4.63","ppm @ 7% O2","4.63","5.8","9780"]
[68029,"BLR2","Unit_2",2028,"acid gas","SO2","2010-03-19T03:00:00",1.2999999999999999E-2,"4.53","ppm @ 7% O2","4.53","5.8","9780"]
[68029,"BLR2","Unit_2",2028,"acid gas","SO2","2010-03-19T04:00:00",6.0000000000000001E-3,"4.72","ppm @ 7% O2","4.72","5.8","9780"]
[68029,"BLR2","Unit_2",2028,"acid gas","SO2","2010-03-19T05:00:00",2E-3,"3.56","ppm @ 7% O2","3.56","5.8","9780"]
[68029,"BLR2","Unit_2",2028,"acid gas","SO2","2010-03-19T06:00:00",1E-3,"1.94","ppm @ 7% O2","1.94","5.8","9780"]
[68029,"BLR2","Unit_2",2028,"acid gas","SO2","2010-03-19T07:00:00",4.0000000000000001E-3,"0.88","ppm @ 7% O2","0.88","5.7","9780"]
[68029,"BLR2","Unit_2",2028,"acid gas","SO2","2010-03-19T08:00:00",1.2E-2,"1.5","ppm @ 7% O2","1.5","5.6","9780"]
[68029,"BLR2","Unit_2",2028,"acid gas","SO2","2010-03-19T09:00:00",0.03,"4.06","ppm @ 7% O2","4.06","5.6","9780"]
[68029,"BLR2","Unit_2",2028,"acid gas","SO2","2010-03-19T10:00:00",2E-3,"6.17","ppm @ 7% O2","6.17","5.5","9780"]
[68029,"BLR2","Unit_2",2028,"acid gas","SO2","2010-03-19T11:00:00",5.0000000000000001E-3,"5.54","ppm @ 7% O2","5.54","5.5","9780"]
[68029,"BLR2","Unit_2",2028,"acid gas","SO2","2010-03-19T12:00:00",8.0000000000000002E-3,"3.59","ppm @ 7% O2","3.59","5.6","9780"]
[68029,"BLR2","Unit_2",2028,"acid gas","SO2","2010-03-19T13:00:00",2.1000000000000001E-2,"3.35","ppm @ 7% O2","3.35","5.6","9780"]
[68029,"BLR2","Unit_2",2028,"acid gas","SO2","2010-03-19T14:00:00",1.4E-2,"5.47","ppm @ 7% O2","5.47","5.7","9780"]
[68029,"BLR2","Unit_2",2028,"acid gas","SO2","2010-03-19T15:00:00",5.0000000000000001E-3,"5.77","ppm @ 7% O2","5.77","5.7","9780"]
[68029,"BLR2","Unit_2",2028,"acid gas","SO2","2010-03-19T16:00:00",0.01,"4.66","ppm @ 7% O2","4.66","5.7","9780"]
[68029,"BLR2","Unit_2",2028,"acid gas","SO2","2010-03-19T17:00:00",8.9999999999999993E-3,"3.39","ppm @ 7% O2","3.39","5.7","9780"]
[68029,"BLR2","Unit_2",2028,"acid gas","SO2","2010-03-19T18:00:00",1.7999999999999999E-2,"4.01","ppm @ 7% O2","4.01","5.7","9780"]
[68029,"BLR2","Unit_2",2028,"acid gas","SO2","2010-03-19T19:00:00",1.6E-2,"5.51","ppm @ 7% O2","5.51","5.8","9780"]
[68029,"BLR2","Unit_2",2028,"acid gas","SO2","2010-03-19T20:00:00",7.0000000000000001E-3,"5.88","ppm @ 7% O2","5.88","5.7","9780"]
[68029,"BLR2","Unit_2",2028,"acid gas","SO2","2010-03-19T21:00:00",1E-3,"4.6","ppm @ 7% O2","4.6","5.7","9780"]
[68029,"BLR2","Unit_2",2028,"acid gas","SO2","2010-03-19T22:00:00",2E-3,"2.16","ppm @ 7% O2","2.16","5.7","9780"]
[68029,"BLR2","Unit_2",2028,"acid gas","SO2","2010-03-19T23:00:00",6.0000000000000001E-3,"0.92","ppm @ 7% O2","0.92","5.7","9780"]
[68029,"BLR2","Unit_2",2028,"acid gas","SO2","2010-03-20",1.6E-2,"1.85","ppm @ 7% O2","1.85","5.6","9780"]
[68029,"BLR2","Unit_2",2028,"acid gas","SO2","2010-03-20T01:00:00",2.1000000000000001E-2,"4.5","ppm @ 7% O2","4.5","5.5","9780"]
[68029,"BLR2","Unit_2",2028,"acid gas","SO2","2010-03-20T02:00:00",1.7000000000000001E-2,"6.55","ppm @ 7% O2","6.55","5.5","9780"]
[68029,"BLR2","Unit_2",2028,"acid gas","SO2","2010-03-20T03:00:00",1.6E-2,"7.74","ppm @ 7% O2","7.74","5.6","9780"]
[68029,"BLR2","Unit_2",2028,"acid gas","SO2","2010-03-20T04:00:00",8.0000000000000002E-3,"6.51","ppm @ 7% O2","6.51","5.6","9780"]
[68029,"BLR2","Unit_2",2028,"acid gas","SO2","2010-03-20T05:00:00",2E-3,"4.61","ppm @ 7% O2","4.61","5.5","9780"]
[68029,"BLR2","Unit_2",2028,"acid gas","SO2","2010-03-20T06:00:00",1E-3,"2.33","ppm @ 7% O2","2.33","5.4","9780"]
[68029,"BLR2","Unit_2",2028,"acid gas","SO2","2010-03-20T07:00:00",5.0000000000000001E-3,"1.18","ppm @ 7% O2","1.18","5.4","9780"]
[68029,"BLR2","Unit_2",2028,"acid gas","SO2","2010-03-20T08:00:00",1.2999999999999999E-2,"1.78","ppm @ 7% O2","1.78","5.4","9780"]
[68029,"BLR2","Unit_2",2028,"acid gas","SO2","2010-03-20T09:00:00",8.0000000000000002E-3,"3.17","ppm @ 7% O2","3.17","5.4","9780"]
[68029,"BLR2","Unit_2",2028,"acid gas","SO2","2010-03-20T10:00:00",1.7999999999999999E-2,"4.31","ppm @ 7% O2","4.31","5.3","9780"]
[68029,"BLR2","Unit_2",2028,"acid gas","SO2","2010-03-20T11:00:00",2.1000000000000001E-2,"5.97","ppm @ 7% O2","5.97","5.4","9780"]
[68029,"BLR2","Unit_2",2028,"acid gas","SO2","2010-03-20T12:00:00",8.9999999999999993E-3,"6.36","ppm @ 7% O2","6.36","5.5","9780"]
[68029,"BLR2","Unit_2",2028,"acid gas","SO2","2010-03-20T13:00:00",0.01,"6.21","ppm @ 7% O2","6.21","5.5","9780"]
[68029,"BLR2","Unit_2",2028,"acid gas","SO2","2010-03-20T14:00:00",0.01,"4.52","ppm @ 7% O2","4.52","5.6","9780"]
[68029,"BLR2","Unit_2",2028,"acid gas","SO2","2010-03-20T15:00:00",0.01,"4.11","ppm @ 7% O2","4.11","5.6","9780"]
[68029,"BLR2","Unit_2",2028,"acid gas","SO2","2010-03-20T16:00:00",8.0000000000000002E-3,"3.93","ppm @ 7% O2","3.93","5.6","9780"]
[68029,"BLR2","Unit_2",2028,"acid gas","SO2","2010-03-20T17:00:00",4.0000000000000001E-3,"3.55","ppm @ 7% O2","3.55","5.6","9780"]
[68029,"BLR2","Unit_2",2028,"acid gas","SO2","2010-03-20T18:00:00",5.0000000000000001E-3,"2.42","ppm @ 7% O2","2.42","5.6","9780"]
[68029,"BLR2","Unit_2",2028,"acid gas","SO2","2010-03-20T19:00:00",6.0000000000000001E-3,"2.1","ppm @ 7% O2","2.1","5.6","9780"]
[68029,"BLR2","Unit_2",2028,"acid gas","SO2","2010-03-20T20:00:00",6.0000000000000001E-3,"1.8","ppm @ 7% O2","1.8","5.6","9780"]
[68029,"BLR2","Unit_2",2028,"acid gas","SO2","2010-03-20T21:00:00",0.03,"4.01","ppm @ 7% O2","4.01","5.6","9780"]
[68029,"BLR2","Unit_2",2028,"acid gas","SO2","2010-03-20T22:00:00",1.7000000000000001E-2,"6.71","ppm @ 7% O2","6.71","5.6","9780"]
[68029,"BLR2","Unit_2",2028,"acid gas","SO2","2010-03-20T23:00:00",1E-3,"7.07","ppm @ 7% O2","7.07","5.6","9780"]
[68029,"BLR2","Unit_2",2028,"acid gas","SO2","2010-03-21",2E-3,"4.59","ppm @ 7% O2","4.59","5.6","9780"]
[68029,"BLR2","Unit_2",2028,"acid gas","SO2","2010-03-21T01:00:00",1.2E-2,"1.87","ppm @ 7% O2","1.87","5.6","9780"]
[68029,"BLR2","Unit_2",2028,"acid gas","SO2","2010-03-21T02:00:00",2.8000000000000001E-2,"3.89","ppm @ 7% O2","3.89","5.6","9780"]
[68029,"BLR2","Unit_2",2028,"acid gas","SO2","2010-03-21T03:00:00",0.01,"6.49","ppm @ 7% O2","6.49","5.7","9780"]
[68029,"BLR2","Unit_2",2028,"acid gas","SO2","2010-03-21T04:00:00",4.0000000000000001E-3,"6.53","ppm @ 7% O2","6.53","5.7","9780"]
[68029,"BLR2","Unit_2",2028,"acid gas","SO2","2010-03-21T05:00:00",2E-3,"4.01","ppm @ 7% O2","4.01","5.6","9780"]
[68029,"BLR2","Unit_2",2028,"acid gas","SO2","2010-03-21T06:00:00",1.0999999999999999E-2,"2","ppm @ 7% O2","2","5.7","9780"]
[68029,"BLR2","Unit_2",2028,"acid gas","SO2","2010-03-21T07:00:00",2.8000000000000001E-2,"3.81","ppm @ 7% O2","3.81","5.7","9780"]
[68029,"BLR2","Unit_2",2028,"acid gas","SO2","2010-03-21T08:00:00",5.0000000000000001E-3,"6.07","ppm @ 7% O2","6.07","5.7","9780"]
[68029,"BLR2","Unit_2",2028,"acid gas","SO2","2010-03-21T09:00:00",0.02,"6.49","ppm @ 7% O2","6.49","5.7","9780"]
[68029,"BLR2","Unit_2",2028,"acid gas","SO2","2010-03-21T10:00:00",1.2E-2,"6.09","ppm @ 7% O2","6.09","5.7","9780"]
[68029,"BLR2","Unit_2",2028,"acid gas","SO2","2010-03-21T11:00:00",3.0000000000000001E-3,"4.68","ppm @ 7% O2","4.68","5.7","9780"]
[68029,"BLR2","Unit_2",2028,"acid gas","SO2","2010-03-21T12:00:00",1.0999999999999999E-2,"4.43","ppm @ 7% O2","4.43","5.7","9780"]
[68029,"BLR2","Unit_2",2028,"acid gas","SO2","2010-03-21T13:00:00",8.0000000000000002E-3,"3.36","ppm @ 7% O2","3.36","5.7","9780"]
[68029,{"$f":"IF(D497=2027,\"BLR1\",\"BLR2\")","v":"BLR2"},{"$f":"IF(D497=2027,\"Unit_1\",\"Unit_2\")","v":"Unit_2"},2028,"acid gas","SO2","2010-03-21T14:00:00",2.4E-2,"4.79","ppm @ 7% O2","4.79","5.8","9780"]
[68029,"BLR2","Unit_2",2028,"acid gas","SO2","2010-03-21T15:00:00",6.0000000000000001E-3,"5.79","ppm @ 7% O2","5.79","5.8","9780"]
[68029,"BLR2","Unit_2",2028,"acid gas","SO2","2010-03-21T16:00:00",3.0000000000000001E-3,"4.9","ppm @ 7% O2","4.9","5.8","9780"]
[68029,"BLR2","Unit_2",2028,"acid gas","SO2","2010-03-21T17:00:00",8.9999999999999993E-3,"3.11","ppm @ 7% O2","3.11","5.9","9780"]
[68029,"BLR2","Unit_2",2028,"acid gas","SO2","2010-03-21T18:00:00",2.5000000000000001E-2,"3.18","ppm @ 7% O2","3.18","5.7","9780"]
[68029,"BLR2","Unit_2",2028,"acid gas","SO2","2010-03-21T19:00:00",1.2999999999999999E-2,"5.88","ppm @ 7% O2","5.88","5.8","9780"]
[68029,"BLR2","Unit_2",2028,"acid gas","SO2","2010-03-21T20:00:00",0.01,"6.51","ppm @ 7% O2","6.51","5.9","9780"]
[68029,"BLR2","Unit_2",2028,"acid gas","SO2","2010-03-21T21:00:00",8.9999999999999993E-3,"5.7","ppm @ 7% O2","5.7","5.9","9780"]
[68029,"BLR2","Unit_2",2028,"acid gas","SO2","2010-03-21T22:00:00",0.01,"3.96","ppm @ 7% O2","3.96","5.8","9780"]
[68029,"BLR2","Unit_2",2028,"acid gas","SO2","2010-03-21T23:00:00",7.0000000000000001E-3,"3.67","ppm @ 7% O2","3.67","5.8","9780"]
[68029,"BLR2","Unit_2",2028,"acid gas","SO2","2010-03-22",8.9999999999999993E-3,"3.54","ppm @ 7% O2","3.54","5.8","9780"]
[68029,"BLR2","Unit_2",2028,"acid gas","SO2","2010-03-22T01:00:00",2.1000000000000001E-2,"4.28","ppm @ 7% O2","4.28","5.8","9780"]
[68029,"BLR2","Unit_2",2028,"acid gas","SO2","2010-03-22T02:00:00",1.0999999999999999E-2,"5.17","ppm @ 7% O2","5.17","5.9","9780"]
[68029,"BLR2","Unit_2",2028,"acid gas","SO2","2010-03-22T03:00:00",1.6E-2,"6.12","ppm @ 7% O2","6.12","5.9","9780"]
[68029,"BLR2","Unit_2",2028,"acid gas","SO2","2010-03-22T04:00:00",0.02,"6.17","ppm @ 7% O2","6.17","5.8","9780"]
[68029,"BLR2","Unit_2",2028,"acid gas","SO2","2010-03-22T05:00:00",4.0000000000000001E-3,"5.96","ppm @ 7% O2","5.96","5.8","9780"]
[68029,"BLR2","Unit_2",2028,"acid gas","SO2","2010-03-22T06:00:00",2.4E-2,"5.8","ppm @ 7% O2","5.8","5.7","9780"]
[68029,"BLR2","Unit_2",2028,"acid gas","SO2","2010-03-22T07:00:00",8.0000000000000002E-3,"6.18","ppm @ 7% O2","6.18","5.7","9780"]
[68029,"BLR2","Unit_2",2028,"acid gas","SO2","2010-03-22T08:00:00",1.6E-2,"5.77","ppm @ 7% O2","5.77","5.7","9780"]
[68029,"BLR2","Unit_2",2028,"acid gas","SO2","2010-03-22T09:00:00",1.9E-2,"6.18","ppm @ 7% O2","6.18","5.7","9780"]
[68029,"BLR2","Unit_2",2028,"acid gas","SO2","2010-03-22T10:00:00",1.2999999999999999E-2,"6.14","ppm @ 7% O2","6.14","5.8","9780"]
[68029,"BLR2","Unit_2",2028,"acid gas","SO2","2010-03-22T11:00:00",7.0000000000000001E-3,"5.76","ppm @ 7% O2","5.76","5.8","9780"]
[68029,"BLR2","Unit_2",2028,"acid gas","SO2","2010-03-22T12:00:00",0.01,"5.19","ppm @ 7% O2","5.19","5.8","9780"]
[68029,"BLR2","Unit_2",2028,"acid gas","SO2","2010-03-22T13:00:00",3.0000000000000001E-3,"3.35","ppm @ 7% O2","3.35","5.8","9780"]
[68029,"BLR2","Unit_2",2028,"acid gas","SO2","2010-03-22T14:00:00",1.6E-2,"3.35","ppm @ 7% O2","3.35","6","9780"]
[68029,"BLR2","Unit_2",2028,"acid gas","SO2","2010-03-22T15:00:00",1.6E-2,"4.31","ppm @ 7% O2","4.31","5.9","9780"]
[68029,"BLR2","Unit_2",2028,"acid gas","SO2","2010-03-22T16:00:00",4.0000000000000001E-3,"4.83","ppm @ 7% O2","4.83","6","9780"]
[68029,"BLR2","Unit_2",2028,"acid gas","SO2","2010-03-22T17:00:00",3.1E-2,"5.99","ppm @ 7% O2","5.99","5.9","9780"]
[68029,"BLR2","Unit_2",2028,"acid gas","SO2","2010-03-22T18:00:00",7.0000000000000001E-3,"6.38","ppm @ 7% O2","6.38","5.8","9780"]
[68029,"BLR2","Unit_2",2028,"acid gas","SO2","2010-03-22T19:00:00",1E-3,"5.54","ppm @ 7% O2","5.54","5.8","9780"]
[68029,"BLR2","Unit_2",2028,"acid gas","SO2","2010-03-22T20:00:00",1E-3,"3.36","ppm @ 7% O2","3.36","5.8","9780"]
[68029,"BLR2","Unit_2",2028,"acid gas","SO2","2010-03-22T21:00:00",7.0000000000000001E-3,"0.67","ppm @ 7% O2","0.67","5.7","9780"]
[68029,"BLR2","Unit_2",2028,"acid gas","SO2","2010-03-22T22:00:00",2.5000000000000001E-2,"2.62","ppm @ 7% O2","2.62","5.7","9780"]
[68029,"BLR2","Unit_2",2028,"acid gas","SO2","2010-03-22T23:00:00",1.7000000000000001E-2,"6.18","ppm @ 7% O2","6.18","5.7","9780"]
[68029,"BLR2","Unit_2",2028,"acid gas","SO2","2010-03-23",1E-3,"6.53","ppm @ 7% O2","6.53","5.8","9780"]
[68029,"BLR2","Unit_2",2028,"acid gas","SO2","2010-03-23T01:00:00",1E-3,"4.38","ppm @ 7% O2","4.38","5.7","9780"]
[68029,"BLR2","Unit_2",2028,"acid gas","SO2","2010-03-23T02:00:00",3.0000000000000001E-3,"0.85","ppm @ 7% O2","0.85","5.7","9780"]
[68029,"BLR2","Unit_2",2028,"acid gas","SO2","2010-03-23T03:00:00",1.9E-2,"1.73","ppm @ 7% O2","1.73","5.7","9780"]
[68029,"BLR2","Unit_2",2028,"acid gas","SO2","2010-03-23T04:00:00",1.2E-2,"3.93","ppm @ 7% O2","3.93","5.7","9780"]
[68029,"BLR2","Unit_2",2028,"acid gas","SO2","2010-03-23T05:00:00",0.01,"5.32","ppm @ 7% O2","5.32","5.8","9780"]
[68029,"BLR2","Unit_2",2028,"acid gas","SO2","2010-03-23T06:00:00",2.8000000000000001E-2,"6.19","ppm @ 7% O2","6.19","5.7","9780"]
[68029,"BLR2","Unit_2",2028,"acid gas","SO2","2010-03-23T07:00:00",0.01,"6.92","ppm @ 7% O2","6.92","5.7","9780"]
[68029,"BLR2","Unit_2",2028,"acid gas","SO2","2010-03-23T08:00:00",1E-3,"5.92","ppm @ 7% O2","5.92","5.7","9780"]
[68029,"BLR2","Unit_2",2028,"acid gas","SO2","2010-03-23T09:00:00",1E-3,"3.63","ppm @ 7% O2","3.63","5.7","9780"]
[68029,"BLR2","Unit_2",2028,"acid gas","SO2","2010-03-23T10:00:00",1.6E-2,"1.51","ppm @ 7% O2","1.51","5.6","9780"]
[68029,"BLR2","Unit_2",2028,"acid gas","SO2","2010-03-23T11:00:00",1.4E-2,"3.51","ppm @ 7% O2","3.51","5.6","9780"]
[68029,"BLR2","Unit_2",2028,"acid gas","SO2","2010-03-23T12:00:00",1.6E-2,"4.98","ppm @ 7% O2","4.98","5.6","9780"]
[68029,"BLR2","Unit_2",2028,"acid gas","SO2","2010-03-23T13:00:00",1.7999999999999999E-2,"6.97","ppm @ 7% O2","6.97","5.7","9780"]
[68029,"BLR2","Unit_2",2028,"acid gas","SO2","2010-03-23T14:00:00",1E-3,"5.43","ppm @ 7% O2","5.43","5.8","9780"]
[68029,"BLR2","Unit_2",2028,"acid gas","SO2","2010-03-23T15:00:00",3.0000000000000001E-3,"4.1","ppm @ 7% O2","4.1","5.8","9780"]
[68029,"BLR2","Unit_2",2028,"acid gas","SO2","2010-03-23T16:00:00",2.1000000000000001E-2,"2.88","ppm @ 7% O2","2.88","5.8","9780"]
[68029,"BLR2","Unit_2",2028,"acid gas","SO2","2010-03-23T17:00:00",1.4E-2,"4.29","ppm @ 7% O2","4.29","5.8","9780"]
[68029,"BLR2","Unit_2",2028,"acid gas","SO2","2010-03-23T18:00:00",4.0000000000000001E-3,"5.55","ppm @ 7% O2","5.55","5.8","9780"]
[68029,"BLR2","Unit_2",2028,"acid gas","SO2","2010-03-23T19:00:00",4.0000000000000001E-3,"4.16","ppm @ 7% O2","4.16","5.8","9780"]
[68029,"BLR2","Unit_2",2028,"acid gas","SO2","2010-03-23T20:00:00",2.1999999999999999E-2,"3.77","ppm @ 7% O2","3.77","5.8","9780"]
[68029,"BLR2","Unit_2",2028,"acid gas","SO2","2010-03-23T21:00:00",5.0000000000000001E-3,"4.15","ppm @ 7% O2","4.15","5.8","9780"]
[68029,"BLR2","Unit_2",2028,"acid gas","SO2","2010-03-23T22:00:00",6.0000000000000001E-3,"4.61","ppm @ 7% O2","4.61","5.7","9780"]
[68029,"BLR2","Unit_2",2028,"acid gas","SO2","2010-03-23T23:00:00",1E-3,"3.08","ppm @ 7% O2","3.08","5.8","9780"]
[68029,"BLR2","Unit_2",2028,"acid gas","SO2","2010-03-24",1E-3,"1.37","ppm @ 7% O2","1.37","5.8","9780"]
[68029,"BLR2","Unit_2",2028,"acid gas","SO2","2010-03-24T01:00:00",1.0999999999999999E-2,"1.3","ppm @ 7% O2","1.3","5.8","9780"]
[68029,"BLR2","Unit_2",2028,"acid gas","SO2","2010-03-24T02:00:00",1.0999999999999999E-2,"2.8","ppm @ 7% O2","2.8","5.9","9780"]
[68029,"BLR2","Unit_2",2028,"acid gas","SO2","2010-03-24T03:00:00",5.0000000000000001E-3,"3.45","ppm @ 7% O2","3.45","5.9","9780"]
[68029,"BLR2","Unit_2",2028,"acid gas","SO2","2010-03-24T04:00:00",2E-3,"3.09","ppm @ 7% O2","3.09","6","9780"]
[68029,"BLR2","Unit_2",2028,"acid gas","SO2","2010-03-24T05:00:00",2.1999999999999999E-2,"2.5","ppm @ 7% O2","2.5","5.9","9780"]
[68029,{"$f":"IF(D561=2027,\"BLR1\",\"BLR2\")","v":"BLR2"},{"$f":"IF(D561=2027,\"Unit_1\",\"Unit_2\")","v":"Unit_2"},2028,"acid gas","SO2","2010-03-24T06:00:00",0.01,"4.5","ppm @ 7% O2","4.5","6","9780"]
[68029,"BLR2","Unit_2",2028,"acid gas","SO2","2010-03-24T07:00:00",8.9999999999999993E-3,"5.04","ppm @ 7% O2","5.04","5.9","9780"]
[68029,"BLR2","Unit_2",2028,"acid gas","SO2","2010-03-24T08:00:00",1.7000000000000001E-2,"5.6","ppm @ 7% O2","5.6","5.7","9780"]
[68029,"BLR2","Unit_2",2028,"acid gas","SO2","2010-03-24T09:00:00",0.02,"5.14","ppm @ 7% O2","5.14","5.8","9780"]
[68029,"BLR2","Unit_2",2028,"acid gas","SO2","2010-03-24T10:00:00",5.0000000000000001E-3,"6.11","ppm @ 7% O2","6.11","5.8","9780"]
[68029,"BLR2","Unit_2",2028,"acid gas","SO2","2010-03-24T11:00:00",8.9999999999999993E-3,"5.17","ppm @ 7% O2","5.17","6","9780"]
[68029,"BLR2","Unit_2",2028,"acid gas","SO2","2010-03-24T12:00:00",2.5000000000000001E-2,"5.09","ppm @ 7% O2","5.09","5.9","9780"]
[68029,"BLR2","Unit_2",2028,"acid gas","SO2","2010-03-24T13:00:00",1E-3,"5.11","ppm @ 7% O2","5.11","5.9","9780"]
[68029,"BLR2","Unit_2",2028,"acid gas","SO2","2010-03-24T14:00:00",2E-3,"4.34","ppm @ 7% O2","4.34","6","9780"]
[68029,"BLR2","Unit_2",2028,"acid gas","SO2","2010-03-24T15:00:00",2E-3,"2.27","ppm @ 7% O2","2.27","6","9780"]
[68029,"BLR2","Unit_2",2028,"acid gas","SO2","2010-03-24T16:00:00",1.2999999999999999E-2,"1.38","ppm @ 7% O2","1.38","6","9780"]
[68029,"BLR2","Unit_2",2028,"acid gas","SO2","2010-03-24T17:00:00",2.1999999999999999E-2,"3.59","ppm @ 7% O2","3.59","5.9","9780"]
[68029,"BLR2","Unit_2",2028,"acid gas","SO2","2010-03-24T18:00:00",1E-3,"5.08","ppm @ 7% O2","5.08","5.8","9780"]
[68029,"BLR2","Unit_2",2028,"acid gas","SO2","2010-03-24T19:00:00",2E-3,"4.16","ppm @ 7% O2","4.16","6","9780"]
[68029,"BLR2","Unit_2",2028,"acid gas","SO2","2010-03-24T20:00:00",1.4999999999999999E-2,"3.12","ppm @ 7% O2","3.12","6.1","9780"]
[68029,"BLR2","Unit_2",2028,"acid gas","SO2","2010-03-24T21:00:00",2E-3,"2.37","ppm @ 7% O2","2.37","6.2","9780"]
[68029,"BLR2","Unit_2",2028,"acid gas","SO2","2010-03-24T22:00:00",1.0999999999999999E-2,"3.22","ppm @ 7% O2","3.22","6","9780"]
[68029,"BLR2","Unit_2",2028,"acid gas","SO2","2010-03-24T23:00:00",1.7000000000000001E-2,"3.84","ppm @ 7% O2","3.84","5.9","9780"]
[68029,"BLR2","Unit_2",2028,"acid gas","SO2","2010-03-25",0.02,"5.19","ppm @ 7% O2","5.19","5.9","9780"]
[68029,"BLR2","Unit_2",2028,"acid gas","SO2","2010-03-25T01:00:00",4.0000000000000001E-3,"6.26","ppm @ 7% O2","6.26","5.9","9780"]
[68029,"BLR2","Unit_2",2028,"acid gas","SO2","2010-03-25T02:00:00",1.6E-2,"5.42","ppm @ 7% O2","5.42","5.9","9780"]
[68029,"BLR2","Unit_2",2028,"acid gas","SO2","2010-03-25T03:00:00",1.4999999999999999E-2,"4.92","ppm @ 7% O2","4.92","5.9","9780"]
[68029,"BLR2","Unit_2",2028,"acid gas","SO2","2010-03-25T04:00:00",1E-3,"4.25","ppm @ 7% O2","4.25","5.9","9780"]
[68029,"BLR2","Unit_2",2028,"acid gas","SO2","2010-03-25T05:00:00",1E-3,"3.2","ppm @ 7% O2","3.2","5.9","9780"]
[68029,"BLR2","Unit_2",2028,"acid gas","SO2","2010-03-25T06:00:00",7.0000000000000001E-3,"1.61","ppm @ 7% O2","1.61","5.9","9780"]
[68029,"BLR2","Unit_2",2028,"acid gas","SO2","2010-03-25T07:00:00",1.9E-2,"1.87","ppm @ 7% O2","1.87","5.9","9780"]
[68029,"BLR2","Unit_2",2028,"acid gas","SO2","2010-03-25T08:00:00",1.2E-2,"4.1","ppm @ 7% O2","4.1","5.9","9780"]
[68029,"BLR2","Unit_2",2028,"acid gas","SO2","2010-03-25T09:00:00",1.2E-2,"5.52","ppm @ 7% O2","5.52","5.9","9780"]
[68029,"BLR2","Unit_2",2028,"acid gas","SO2","2010-03-25T10:00:00",2E-3,"5.29","ppm @ 7% O2","5.29","5.9","9780"]
[68029,"BLR2","Unit_2",2028,"acid gas","SO2","2010-03-25T11:00:00",1.7000000000000001E-2,"4","ppm @ 7% O2","4","5.9","9780"]
[68029,"BLR2","Unit_2",2028,"acid gas","SO2","2010-03-25T12:00:00",1.0999999999999999E-2,"4.14","ppm @ 7% O2","4.14","6","9780"]
[68029,"BLR2","Unit_2",2028,"acid gas","SO2","2010-03-25T13:00:00",1.4999999999999999E-2,"5.48","ppm @ 7% O2","5.48","6","9780"]
[68029,"BLR2","Unit_2",2028,"acid gas","SO2","2010-03-25T14:00:00",1.0999999999999999E-2,"5.64","ppm @ 7% O2","5.64","6","9780"]
[68029,"BLR2","Unit_2",2028,"acid gas","SO2","2010-03-25T15:00:00",7.0000000000000001E-3,"5.29","ppm @ 7% O2","5.29","6","9780"]
[68029,"BLR2","Unit_2",2028,"acid gas","SO2","2010-03-25T16:00:00",1.4E-2,"3.78","ppm @ 7% O2","3.78","6","9780"]
[68029,"BLR2","Unit_2",2028,"acid gas","SO2","2010-03-25T17:00:00",8.0000000000000002E-3,"4.31","ppm @ 7% O2","4.31","6","9780"]
[68029,"BLR2","Unit_2",2028,"acid gas","SO2","2010-03-25T18:00:00",1.7999999999999999E-2,"5.15","ppm @ 7% O2","5.15","6","9780"]
[68029,"BLR2","Unit_2",2028,"acid gas","SO2","2010-03-25T19:00:00",1.7000000000000001E-2,"5.83","ppm @ 7% O2","5.83","5.9","9780"]
[68029,"BLR2","Unit_2",2028,"acid gas","SO2","2010-03-25T20:00:00",2E-3,"5.31","ppm @ 7% O2","5.31","6","9780"]
[68029,"BLR2","Unit_2",2028,"acid gas","SO2","2010-03-25T21:00:00",1.9E-2,"4.85","ppm @ 7% O2","4.85","6","9780"]
[68029,"BLR2","Unit_2",2028,"acid gas","SO2","2010-03-25T22:00:00",2.4E-2,"5.64","ppm @ 7% O2","5.64","6","9780"]
[68029,"BLR2","Unit_2",2028,"acid gas","SO2","2010-03-25T23:00:00",1.2999999999999999E-2,"7.27","ppm @ 7% O2","7.27","6","9780"]
[68029,"BLR2","Unit_2",2028,"acid gas","SO2","2010-03-26",1E-3,"6.02","ppm @ 7% O2","6.02","6","9780"]
[68029,"BLR2","Unit_2",2028,"acid gas","SO2","2010-03-26T01:00:00",1.4E-2,"4.31","ppm @ 7% O2","4.31","6","9780"]
[68029,"BLR2","Unit_2",2028,"acid gas","SO2","2010-03-26T02:00:00",2.3E-2,"3.67","ppm @ 7% O2","3.67","6.1","9780"]
[68029,"BLR2","Unit_2",2028,"acid gas","SO2","2010-03-26T03:00:00",1.4E-2,"6.29","ppm @ 7% O2","6.29","6.8","9780"]
[68029,"BLR2","Unit_2",2028,"acid gas","SO2","2010-03-26T04:00:00",7.0000000000000001E-3,"6.15","ppm @ 7% O2","6.15","7.2","9780"]
[68029,"BLR2","Unit_2",2028,"acid gas","SO2","2010-03-26T05:00:00",1.0999999999999999E-2,"5.67","ppm @ 7% O2","5.67","7.1","9780"]
[68029,"BLR2","Unit_2",2028,"acid gas","SO2","2010-03-26T06:00:00",1.6E-2,"3.79","ppm @ 7% O2","3.79","6.9","9780"]
[68029,"BLR2","Unit_2",2028,"acid gas","SO2","2010-03-26T07:00:00",0.01,"4.9","ppm @ 7% O2","4.9","6.7","9780"]
[68029,"BLR2","Unit_2",2028,"acid gas","SO2","2010-03-26T08:00:00",2.3E-2,"5.67","ppm @ 7% O2","5.67","5.8","9780"]
[68029,"BLR2","Unit_2",2028,"acid gas","SO2","2010-03-26T09:00:00",5.0000000000000001E-3,"6.16","ppm @ 7% O2","6.16","5.9","9780"]
[68029,"BLR2","Unit_2",2028,"acid gas","SO2","2010-03-26T10:00:00",8.0000000000000002E-3,"4.85","ppm @ 7% O2","4.85","5.9","9780"]
[68029,"BLR2","Unit_2",2028,"acid gas","SO2","2010-03-26T11:00:00",0.02,"4.89","ppm @ 7% O2","4.89","5.9","9780"]
[68029,"BLR2","Unit_2",2028,"acid gas","SO2","2010-03-26T12:00:00",8.0000000000000002E-3,"4.76","ppm @ 7% O2","4.76","5.9","9780"]
[68029,"BLR2","Unit_2",2028,"acid gas","SO2","2010-03-26T13:00:00",1.4E-2,"5.8","ppm @ 7% O2","5.8","6","9780"]
[68029,"BLR2","Unit_2",2028,"acid gas","SO2","2010-03-26T14:00:00",1.2999999999999999E-2,"4.92","ppm @ 7% O2","4.92","6","9780"]
[68029,"BLR2","Unit_2",2028,"acid gas","SO2","2010-03-26T15:00:00",5.0000000000000001E-3,"4.39","ppm @ 7% O2","4.39","6.1","9780"]
[68029,"BLR2","Unit_2",2028,"acid gas","SO2","2010-03-26T16:00:00",1.7000000000000001E-2,"4.32","ppm @ 7% O2","4.32","5.9","9780"]
[68029,"BLR2","Unit_2",2028,"acid gas","SO2","2010-03-26T17:00:00",1.6E-2,"4.89","ppm @ 7% O2","4.89","6","9780"]
[68029,"BLR2","Unit_2",2028,"acid gas","SO2","2010-03-26T18:00:00",1.0999999999999999E-2,"5.42","ppm @ 7% O2","5.42","5.9","9780"]
[68029,"BLR2","Unit_2",2028,"acid gas","SO2","2010-03-26T19:00:00",1.6E-2,"5.89","ppm @ 7% O2","5.89","5.9","9780"]
[68029,"BLR2","Unit_2",2028,"acid gas","SO2","2010-03-26T20:00:00",8.9999999999999993E-3,"5.49","ppm @ 7% O2","5.49","5.9","9780"]
[68029,"BLR2","Unit_2",2028,"acid gas","SO2","2010-03-26T21:00:00",3.0000000000000001E-3,"4.51","ppm @ 7% O2","4.51","5.9","9780"]
[68029,{"$f":"IF(D625=2027,\"BLR1\",\"BLR2\")","v":"BLR2"},{"$f":"IF(D625=2027,\"Unit_1\",\"Unit_2\")","v":"Unit_2"},2028,"acid gas","SO2","2010-03-26T22:00:00",7.0000000000000001E-3,"3.19","ppm @ 7% O2","3.19","5.9","9780"]
[68029,"BLR2","Unit_2",2028,"acid gas","SO2","2010-03-26T23:00:00",1.2999999999999999E-2,"2.8","ppm @ 7% O2","2.8","5.9","9780"]
[68029,"BLR2","Unit_2",2028,"acid gas","SO2","2010-03-27",1.2E-2,"3.33","ppm @ 7% O2","3.33","6","9780"]
[68029,"BLR2","Unit_2",2028,"acid gas","SO2","2010-03-27T01:00:00",7.0000000000000001E-3,"4.28","ppm @ 7% O2","4.28","6","9780"]
[68029,"BLR2","Unit_2",2028,"acid gas","SO2","2010-03-27T02:00:00",1E-3,"3.34","ppm @ 7% O2","3.34","6","9780"]
[68029,"BLR2","Unit_2",2028,"acid gas","SO2","2010-03-27T03:00:00",1E-3,"2.29","ppm @ 7% O2","2.29","6","9780"]
[68029,"BLR2","Unit_2",2028,"acid gas","SO2","2010-03-27T04:00:00",7.0000000000000001E-3,"0.96","ppm @ 7% O2","0.96","6.1","9780"]
[68029,"BLR2","Unit_2",2028,"acid gas","SO2","2010-03-27T05:00:00",7.0000000000000001E-3,"1.49","ppm @ 7% O2","1.49","6.1","9780"]
[68029,"BLR2","Unit_2",2028,"acid gas","SO2","2010-03-27T06:00:00",1.9E-2,"3.45","ppm @ 7% O2","3.45","6.1","9780"]
[68029,"BLR2","Unit_2",2028,"acid gas","SO2","2010-03-27T07:00:00",1.4999999999999999E-2,"5.44","ppm @ 7% O2","5.44","6","9780"]
[68029,"BLR2","Unit_2",2028,"acid gas","SO2","2010-03-27T08:00:00",0.02,"6.65","ppm @ 7% O2","6.65","5.9","9780"]
[68029,"BLR2","Unit_2",2028,"acid gas","SO2","2010-03-27T09:00:00",8.0000000000000002E-3,"6.49","ppm @ 7% O2","6.49","5.9","9780"]
[68029,"BLR2","Unit_2",2028,"acid gas","SO2","2010-03-27T10:00:00",6.0000000000000001E-3,"4.9","ppm @ 7% O2","4.9","5.9","9780"]
[68029,"BLR2","Unit_2",2028,"acid gas","SO2","2010-03-27T11:00:00",0.01,"3.82","ppm @ 7% O2","3.82","5.9","9780"]
[68029,"BLR2","Unit_2",2028,"acid gas","SO2","2010-03-27T12:00:00",7.0000000000000001E-3,"3.17","ppm @ 7% O2","3.17","5.8","9780"]
[68029,"BLR2","Unit_2",2028,"acid gas","SO2","2010-03-27T13:00:00",8.0000000000000002E-3,"3.52","ppm @ 7% O2","3.52","5.7","9780"]
[68029,"BLR2","Unit_2",2028,"acid gas","SO2","2010-03-27T14:00:00",2E-3,"2.85","ppm @ 7% O2","2.85","5.7","9780"]
[68029,"BLR2","Unit_2",2028,"acid gas","SO2","2010-03-27T15:00:00",2.1000000000000001E-2,"3.14","ppm @ 7% O2","3.14","5.7","9780"]
[68029,"BLR2","Unit_2",2028,"acid gas","SO2","2010-03-27T16:00:00",4.0000000000000001E-3,"3.98","ppm @ 7% O2","3.98","5.7","9780"]
[68029,"BLR2","Unit_2",2028,"acid gas","SO2","2010-03-27T17:00:00",6.0000000000000001E-3,"4.04","ppm @ 7% O2","4.04","5.8","9780"]
[68029,"BLR2","Unit_2",2028,"acid gas","SO2","2010-03-27T18:00:00",1.4999999999999999E-2,"3.63","ppm @ 7% O2","3.63","5.8","9780"]
[68029,"BLR2","Unit_2",2028,"acid gas","SO2","2010-03-27T19:00:00",1.7999999999999999E-2,"4.42","ppm @ 7% O2","4.42","5.9","9780"]
[68029,"BLR2","Unit_2",2028,"acid gas","SO2","2010-03-27T20:00:00",6.0000000000000001E-3,"5.53","ppm @ 7% O2","5.53","6","9780"]
[68029,"BLR2","Unit_2",2028,"acid gas","SO2","2010-03-27T21:00:00",4.0000000000000001E-3,"4.94","ppm @ 7% O2","4.94","6","9780"]
[68029,"BLR2","Unit_2",2028,"acid gas","SO2","2010-03-27T22:00:00",0.01,"3.29","ppm @ 7% O2","3.29","6","9780"]
[68029,"BLR2","Unit_2",2028,"acid gas","SO2","2010-03-27T23:00:00",2.1999999999999999E-2,"3.77","ppm @ 7% O2","3.77","6","9780"]
[68029,"BLR2","Unit_2",2028,"acid gas","SO2","2010-03-28",8.9999999999999993E-3,"4.94","ppm @ 7% O2","4.94","6.1","9780"]
[68029,"BLR2","Unit_2",2028,"acid gas","SO2","2010-03-28T01:00:00",3.0000000000000001E-3,"5.07","ppm @ 7% O2","5.07","6","9780"]
[68029,"BLR2","Unit_2",2028,"acid gas","SO2","2010-03-28T02:00:00",8.0000000000000002E-3,"3.93","ppm @ 7% O2","3.93","6.1","9780"]
[68029,"BLR2","Unit_2",2028,"acid gas","SO2","2010-03-28T03:00:00",5.0000000000000001E-3,"2.63","ppm @ 7% O2","2.63","6.3","9780"]
[68029,"BLR2","Unit_2",2028,"acid gas","SO2","2010-03-28T04:00:00",8.9999999999999993E-3,"2.67","ppm @ 7% O2","2.67","6.8","9780"]
[68029,"BLR2","Unit_2",2028,"acid gas","SO2","2010-03-28T05:00:00",1E-3,"2.12","ppm @ 7% O2","2.12","6.3","9780"]
[68029,"BLR2","Unit_2",2028,"acid gas","SO2","2010-03-28T06:00:00",2E-3,"1.77","ppm @ 7% O2","1.77","6.1","9780"]
[68029,"BLR2","Unit_2",2028,"acid gas","SO2","2010-03-28T07:00:00",1.7000000000000001E-2,"2.25","ppm @ 7% O2","2.25","6","9780"]
[68029,"BLR2","Unit_2",2028,"acid gas","SO2","2010-03-28T08:00:00",1.4E-2,"3.46","ppm @ 7% O2","3.46","6","9780"]
[68029,"BLR2","Unit_2",2028,"acid gas","SO2","2010-03-28T09:00:00",5.0000000000000001E-3,"4.8","ppm @ 7% O2","4.8","6.1","9780"]
[68029,"BLR2","Unit_2",2028,"acid gas","SO2","2010-03-28T10:00:00",1.4E-2,"4.48","ppm @ 7% O2","4.48","6.1","9780"]
[68029,"BLR2","Unit_2",2028,"acid gas","SO2","2010-03-28T11:00:00",1.0999999999999999E-2,"4.45","ppm @ 7% O2","4.45","5.9","9780"]
[68029,"BLR2","Unit_2",2028,"acid gas","SO2","2010-03-28T12:00:00",0.02,"5.25","ppm @ 7% O2","5.25","5.9","9780"]
[68029,"BLR2","Unit_2",2028,"acid gas","SO2","2010-03-28T13:00:00",8.9999999999999993E-3,"5.95","ppm @ 7% O2","5.95","5.9","9780"]
[68029,"BLR2","Unit_2",2028,"acid gas","SO2","2010-03-28T14:00:00",2E-3,"5.05","ppm @ 7% O2","5.05","5.9","9780"]
[68029,"BLR2","Unit_2",2028,"acid gas","SO2","2010-03-28T15:00:00",1E-3,"2.97","ppm @ 7% O2","2.97","6","9780"]
[68029,"BLR2","Unit_2",2028,"acid gas","SO2","2010-03-28T16:00:00",0.02,"1.84","ppm @ 7% O2","1.84","6","9780"]
[68029,"BLR2","Unit_2",2028,"acid gas","SO2","2010-03-28T17:00:00",1.0999999999999999E-2,"3.27","ppm @ 7% O2","3.27","6","9780"]
[68029,"BLR2","Unit_2",2028,"acid gas","SO2","2010-03-28T18:00:00",1.2E-2,"5.5","ppm @ 7% O2","5.5","5.9","9780"]
[68029,"BLR2","Unit_2",2028,"acid gas","SO2","2010-03-28T19:00:00",8.9999999999999993E-3,"5.44","ppm @ 7% O2","5.44","6","9780"]
[68029,"BLR2","Unit_2",2028,"acid gas","SO2","2010-03-28T20:00:00",1.2E-2,"4.59","ppm @ 7% O2","4.59","6","9780"]
[68029,"BLR2","Unit_2",2028,"acid gas","SO2","2010-03-28T21:00:00",1.0999999999999999E-2,"3.78","ppm @ 7% O2","3.78","6.1","9780"]
[68029,"BLR2","Unit_2",2028,"acid gas","SO2","2010-03-28T22:00:00",6.0000000000000001E-3,"4.39","ppm @ 7% O2","4.39","6.1","9780"]
[68029,"BLR2","Unit_2",2028,"acid gas","SO2","2010-03-28T23:00:00",8.9999999999999993E-3,"3.69","ppm @ 7% O2","3.69","6.1","9780"]
[68029,"BLR2","Unit_2",2028,"acid gas","SO2","2010-03-29",2.3E-2,"4.77","ppm @ 7% O2","4.77","6.1","9780"]
[68029,"BLR2","Unit_2",2028,"acid gas","SO2","2010-03-29T01:00:00",1.2999999999999999E-2,"5.79","ppm @ 7% O2","5.79","6.1","9780"]
[68029,"BLR2","Unit_2",2028,"acid gas","SO2","2010-03-29T02:00:00",7.0000000000000001E-3,"6.45","ppm @ 7% O2","6.45","6.2","9780"]
[68029,"BLR2","Unit_2",2028,"acid gas","SO2","2010-03-29T03:00:00",1E-3,"4.04","ppm @ 7% O2","4.04","6.1","9780"]
[68029,"BLR2","Unit_2",2028,"acid gas","SO2","2010-03-29T04:00:00",1.2999999999999999E-2,"2.25","ppm @ 7% O2","2.25","6.2","9780"]
[68029,"BLR2","Unit_2",2028,"acid gas","SO2","2010-03-29T05:00:00",3.0000000000000001E-3,"2.39","ppm @ 7% O2","2.39","6.1","9780"]
[68029,"BLR2","Unit_2",2028,"acid gas","SO2","2010-03-29T06:00:00",0.01,"2.79","ppm @ 7% O2","2.79","6.2","9780"]
[68029,"BLR2","Unit_2",2028,"acid gas","SO2","2010-03-29T07:00:00",0.01,"3.85","ppm @ 7% O2","3.85","6.1","9780"]
[68029,"BLR2","Unit_2",2028,"acid gas","SO2","2010-03-29T08:00:00",1E-3,"2.95","ppm @ 7% O2","2.95","6","9780"]
[68029,"BLR2","Unit_2",2028,"acid gas","SO2","2010-03-29T09:00:00",6.0000000000000001E-3,"2.41","ppm @ 7% O2","2.41","5.9","9780"]
[68029,"BLR2","Unit_2",2028,"acid gas","SO2","2010-03-29T10:00:00",1.4E-2,"2.33","ppm @ 7% O2","2.33","5.8","9780"]
[68029,"BLR2","Unit_2",2028,"acid gas","SO2","2010-03-29T11:00:00",1.2999999999999999E-2,"3.86","ppm @ 7% O2","3.86","5.8","9780"]
[68029,"BLR2","Unit_2",2028,"acid gas","SO2","2010-03-29T12:00:00",7.0000000000000001E-3,"5.15","ppm @ 7% O2","5.15","5.9","9780"]
[68029,"BLR2","Unit_2",2028,"acid gas","SO2","2010-03-29T13:00:00",1E-3,"3.71","ppm @ 7% O2","3.71","5.9","9780"]
[68029,{"$f":"IF(D689=2027,\"BLR1\",\"BLR2\")","v":"BLR2"},{"$f":"IF(D689=2027,\"Unit_1\",\"Unit_2\")","v":"Unit_2"},2028,"acid gas","SO2","2010-03-29T14:00:00",3.0000000000000001E-3,"1.88","ppm @ 7% O2","1.88","6","9780"]
[68029,"BLR2","Unit_2",2028,"acid gas","SO2","2010-03-29T15:00:00",2.5000000000000001E-2,"2.23","ppm @ 7% O2","2.23","6","9780"]
[68029,"BLR2","Unit_2",2028,"acid gas","SO2","2010-03-29T16:00:00",8.9999999999999993E-3,"4.07","ppm @ 7% O2","4.07","6","9780"]
[68029,"BLR2","Unit_2",2028,"acid gas","SO2","2010-03-29T17:00:00",6.0000000000000001E-3,"5.36","ppm @ 7% O2","5.36","6.1","9780"]
[68029,"BLR2","Unit_2",2028,"acid gas","SO2","2010-03-29T18:00:00",0.01,"4.4","ppm @ 7% O2","4.4","6","9780"]
[68029,"BLR2","Unit_2",2028,"acid gas","SO2","2010-03-29T19:00:00",0.01,"3.85","ppm @ 7% O2","3.85","6","9780"]
[68029,"BLR2","Unit_2",2028,"acid gas","SO2","2010-03-29T20:00:00",8.9999999999999993E-3,"3.46","ppm @ 7% O2","3.46","6.1","9780"]
[68029,"BLR2","Unit_2",2028,"acid gas","SO2","2010-03-29T21:00:00",1.4999999999999999E-2,"4.28","ppm @ 7% O2","4.28","6.1","9780"]
[68029,"BLR2","Unit_2",2028,"acid gas","SO2","2010-03-29T22:00:00",1.4E-2,"4.9","ppm @ 7% O2","4.9","6.1","9780"]
[68029,"BLR2","Unit_2",2028,"acid gas","SO2","2010-03-29T23:00:00",1.6E-2,"6.13","ppm @ 7% O2","6.13","6.1","9780"]
[68029,"BLR2","Unit_2",2028,"acid gas","SO2","2010-03-30",6.0000000000000001E-3,"5.8","ppm @ 7% O2","5.8","6.1","9780"]
[68029,"BLR2","Unit_2",2028,"acid gas","SO2","2010-03-30T01:00:00",0.01,"4.28","ppm @ 7% O2","4.28","6.2","9780"]
[68029,"BLR2","Unit_2",2028,"acid gas","SO2","2010-03-30T02:00:00",0.01,"4.03","ppm @ 7% O2","4.03","6.2","9780"]
[68029,"BLR2","Unit_2",2028,"acid gas","SO2","2010-03-30T03:00:00",1.6E-2,"3.99","ppm @ 7% O2","3.99","6.1","9780"]
[68029,"BLR2","Unit_2",2028,"acid gas","SO2","2010-03-30T04:00:00",6.0000000000000001E-3,"5.17","ppm @ 7% O2","5.17","6.1","9780"]
[68029,"BLR2","Unit_2",2028,"acid gas","SO2","2010-03-30T05:00:00",1.2999999999999999E-2,"4.15","ppm @ 7% O2","4.15","6.2","9780"]
[68029,"BLR2","Unit_2",2028,"acid gas","SO2","2010-03-30T06:00:00",0.02,"5.64","ppm @ 7% O2","5.64","6.3","9780"]
[68029,"BLR2","Unit_2",2028,"acid gas","SO2","2010-03-30T07:00:00",2.3E-2,"6.43","ppm @ 7% O2","6.43","6.2","9780"]
[68029,"BLR2","Unit_2",2028,"acid gas","SO2","2010-03-30T08:00:00",1E-3,"6.94","ppm @ 7% O2","6.94","6","9780"]
[68029,"BLR2","Unit_2",2028,"acid gas","SO2","2010-03-30T09:00:00",1.6E-2,"4.96","ppm @ 7% O2","4.96","5.9","9780"]
[68029,"BLR2","Unit_2",2028,"acid gas","SO2","2010-03-30T10:00:00",2.5000000000000001E-2,"5.97","ppm @ 7% O2","5.97","5.9","9780"]
[68029,"BLR2","Unit_2",2028,"acid gas","SO2","2010-03-30T11:00:00",8.0000000000000002E-3,"6.31","ppm @ 7% O2","6.31","5.8","9780"]
[68029,"BLR2","Unit_2",2028,"acid gas","SO2","2010-03-30T12:00:00",8.0000000000000002E-3,"6.59","ppm @ 7% O2","6.59","5.8","9780"]
[68029,"BLR2","Unit_2",2028,"acid gas","SO2","2010-03-30T13:00:00",1.7000000000000001E-2,"4.78","ppm @ 7% O2","4.78","5.7","9780"]
[68029,"BLR2","Unit_2",2028,"acid gas","SO2","2010-03-30T14:00:00",1.2E-2,"4.97","ppm @ 7% O2","4.97","5.8","9780"]
[68029,"BLR2","Unit_2",2028,"acid gas","SO2","2010-03-30T15:00:00",0.02,"5.95","ppm @ 7% O2","5.95","5.8","9780"]
[68029,"BLR2","Unit_2",2028,"acid gas","SO2","2010-03-30T16:00:00",3.0000000000000001E-3,"5.68","ppm @ 7% O2","5.68","5.9","9780"]
[68029,"BLR2","Unit_2",2028,"acid gas","SO2","2010-03-30T17:00:00",1.2999999999999999E-2,"4.37","ppm @ 7% O2","4.37","5.9","9780"]
[68029,"BLR2","Unit_2",2028,"acid gas","SO2","2010-03-30T18:00:00",1.2999999999999999E-2,"3.97","ppm @ 7% O2","3.97","5.9","9780"]
[68029,"BLR2","Unit_2",2028,"acid gas","SO2","2010-03-30T19:00:00",2.8000000000000001E-2,"5.77","ppm @ 7% O2","5.77","5.8","9780"]
[68029,"BLR2","Unit_2",2028,"acid gas","SO2","2010-03-30T20:00:00",3.0000000000000001E-3,"7.17","ppm @ 7% O2","7.17","5.9","9780"]
[68029,"BLR2","Unit_2",2028,"acid gas","SO2","2010-03-30T21:00:00",1E-3,"5.65","ppm @ 7% O2","5.65","5.9","9780"]
[68029,"BLR2","Unit_2",2028,"acid gas","SO2","2010-03-30T22:00:00",1E-3,"2.41","ppm @ 7% O2","2.41","5.9","9780"]
[68029,"BLR2","Unit_2",2028,"acid gas","SO2","2010-03-30T23:00:00",1E-3,"0.29","ppm @ 7% O2","0.29","6.1","9780"]
[null,null,null,null,null,null,null,{"$f":"AVERAGE(H241:H722)","v":1.0796680497925279E-2},"Average"]
[]
[68029,{"$f":"IF(D725=2027,\"BLR1\",\"BLR2\")","v":"BLR1"},{"$f":"IF(D725=2027,\"Unit_1\",\"Unit_2\")","v":"Unit_1"},2027,"acid gas","SO2","2010-03-01","0.022","6","ppm @ 7% O2","6","5.9","9780"]
[68029,"BLR1","Unit_1",2027,"acid gas","SO2","2010-03-01T01:00:00","0.003","5","ppm @ 7% O2","5","5.9","9780"]
[68029,"BLR1","Unit_1",2027,"acid gas","SO2","2010-03-01T02:00:00","0.014","5","ppm @ 7% O2","5","5.9","9780"]
[68029,"BLR1","Unit_1",2027,"acid gas","SO2","2010-03-01T03:00:00","0.004","4","ppm @ 7% O2","4","5.9","9780"]
[68029,"BLR1","Unit_1",2027,"acid gas","SO2","2010-03-01T04:00:00","0.005","3","ppm @ 7% O2","3","5.9","9780"]
[68029,"BLR1","Unit_1",2027,"acid gas","SO2","2010-03-01T05:00:00","0.008","3","ppm @ 7% O2","3","5.9","9780"]
[68029,"BLR1","Unit_1",2027,"acid gas","SO2","2010-03-01T06:00:00","0.013","3","ppm @ 7% O2","3","5.8","9780"]
[68029,"BLR1","Unit_1",2027,"acid gas","SO2","2010-03-01T07:00:00","0.015","4","ppm @ 7% O2","4","5.7","9780"]
[68029,"BLR1","Unit_1",2027,"acid gas","SO2","2010-03-01T08:00:00","0.009","5","ppm @ 7% O2","5","5.8","9780"]
[68029,"BLR1","Unit_1",2027,"acid gas","SO2","2010-03-01T09:00:00","0.003","4","ppm @ 7% O2","4","5.7","9780"]
[68029,"BLR1","Unit_1",2027,"acid gas","SO2","2010-03-01T10:00:00","0.005","3","ppm @ 7% O2","3","5.5","9780"]
[68029,"BLR1","Unit_1",2027,"acid gas","SO2","2010-03-01T11:00:00","0.009","2","ppm @ 7% O2","2","5.5","9780"]
[68029,"BLR1","Unit_1",2027,"acid gas","SO2","2010-03-01T12:00:00","0.006","2","ppm @ 7% O2","2","5.5","9780"]
[68029,"BLR1","Unit_1",2027,"acid gas","SO2","2010-03-01T13:00:00","0.014","3","ppm @ 7% O2","3","5.4","9780"]
[68029,"BLR1","Unit_1",2027,"acid gas","SO2","2010-03-01T14:00:00","0.006","4","ppm @ 7% O2","4","5.5","9780"]
[68029,"BLR1","Unit_1",2027,"acid gas","SO2","2010-03-01T15:00:00","0.005","3","ppm @ 7% O2","3","5.5","9780"]
[68029,"BLR1","Unit_1",2027,"acid gas","SO2","2010-03-01T16:00:00","0.010","3","ppm @ 7% O2","3","5.5","9780"]
[68029,"BLR1","Unit_1",2027,"acid gas","SO2","2010-03-01T17:00:00","0.013","3","ppm @ 7% O2","3","5.6","9780"]
[68029,"BLR1","Unit_1",2027,"acid gas","SO2","2010-03-01T18:00:00","0.015","4","ppm @ 7% O2","4","5.6","9780"]
[68029,"BLR1","Unit_1",2027,"acid gas","SO2","2010-03-01T19:00:00","0.012","5","ppm @ 7% O2","5","5.6","9780"]
[68029,"BLR1","Unit_1",2027,"acid gas","SO2","2010-03-01T20:00:00","0.012","6","ppm @ 7% O2","6","5.6","9780"]
[68029,"BLR1","Unit_1",2027,"acid gas","SO2","2010-03-01T21:00:00","0.017","6","ppm @ 7% O2","6","5.7","9780"]
[68029,"BLR1","Unit_1",2027,"acid gas","SO2","2010-03-01T22:00:00","0.009","6","ppm @ 7% O2","6","5.8","9780"]
[68029,"BLR1","Unit_1",2027,"acid gas","SO2","2010-03-01T23:00:00","0.016","5","ppm @ 7% O2","5","5.8","9780"]
[68029,"BLR1","Unit_1",2027,"acid gas","SO2","2010-03-02","0.016","5","ppm @ 7% O2","5","5.8","9780"]
[68029,"BLR1","Unit_1",2027,"acid gas","SO2","2010-03-02T01:00:00","0.016","6","ppm @ 7% O2","6","5.8","9780"]
[68029,"BLR1","Unit_1",2027,"acid gas","SO2","2010-03-02T02:00:00","0.013","6","ppm @ 7% O2","6","5.8","9780"]
[68029,"BLR1","Unit_1",2027,"acid gas","SO2","2010-03-02T03:00:00","0.016","7","ppm @ 7% O2","7","5.9","9780"]
[68029,"BLR1","Unit_1",2027,"acid gas","SO2","2010-03-02T04:00:00","0.013","6","ppm @ 7% O2","6","5.9","9780"]
[68029,"BLR1","Unit_1",2027,"acid gas","SO2","2010-03-02T05:00:00","0.013","6","ppm @ 7% O2","6","5.9","9780"]
[68029,"BLR1","Unit_1",2027,"acid gas","SO2","2010-03-02T06:00:00","0.014","6","ppm @ 7% O2","6","5.8","9780"]
[68029,"BLR1","Unit_1",2027,"acid gas","SO2","2010-03-02T07:00:00","0.010","5","ppm @ 7% O2","5","5.7","9780"]
[68029,"BLR1","Unit_1",2027,"acid gas","SO2","2010-03-02T08:00:00","0.017","6","ppm @ 7% O2","6","5.7","9780"]
[68029,"BLR1","Unit_1",2027,"acid gas","SO2","2010-03-02T09:00:00","0.013","6","ppm @ 7% O2","6","5.7","9780"]
[68029,"BLR1","Unit_1",2027,"acid gas","SO2","2010-03-02T10:00:00","0.011","6","ppm @ 7% O2","6","5.7","9780"]
[68029,"BLR1","Unit_1",2027,"acid gas","SO2","2010-03-02T11:00:00","0.017","6","ppm @ 7% O2","6","5.7","9780"]
[68029,"BLR1","Unit_1",2027,"acid gas","SO2","2010-03-02T12:00:00","0.020","6","ppm @ 7% O2","6","5.7","9780"]
[68029,"BLR1","Unit_1",2027,"acid gas","SO2","2010-03-02T13:00:00","0.012","6","ppm @ 7% O2","6","5.7","9780"]
[68029,"BLR1","Unit_1",2027,"acid gas","SO2","2010-03-02T14:00:00","0.003","6","ppm @ 7% O2","6","5.7","9780"]
[68029,"BLR1","Unit_1",2027,"acid gas","SO2","2010-03-02T15:00:00","0.008","4","ppm @ 7% O2","4","5.7","9780"]
[68029,"BLR1","Unit_1",2027,"acid gas","SO2","2010-03-02T16:00:00","0.022","4","ppm @ 7% O2","4","5.7","9780"]
[68029,"BLR1","Unit_1",2027,"acid gas","SO2","2010-03-02T17:00:00","0.006","5","ppm @ 7% O2","5","5.7","9780"]
[68029,"BLR1","Unit_1",2027,"acid gas","SO2","2010-03-02T18:00:00","0.006","5","ppm @ 7% O2","5","5.8","9780"]
[68029,"BLR1","Unit_1",2027,"acid gas","SO2","2010-03-02T19:00:00","0.010","4","ppm @ 7% O2","4","5.7","9780"]
[68029,"BLR1","Unit_1",2027,"acid gas","SO2","2010-03-02T20:00:00","0.008","3","ppm @ 7% O2","3","5.7","9780"]
[68029,"BLR1","Unit_1",2027,"acid gas","SO2","2010-03-02T21:00:00","0.011","4","ppm @ 7% O2","4","5.7","9780"]
[68029,"BLR1","Unit_1",2027,"acid gas","SO2","2010-03-02T22:00:00","0.008","4","ppm @ 7% O2","4","5.7","9780"]
[68029,"BLR1","Unit_1",2027,"acid gas","SO2","2010-03-02T23:00:00","0.004","4","ppm @ 7% O2","4","5.8","9780"]
[68029,"BLR1","Unit_1",2027,"acid gas","SO2","2010-03-03","0.010","3","ppm @ 7% O2","3","5.8","9780"]
[68029,"BLR1","Unit_1",2027,"acid gas","SO2","2010-03-03T01:00:00","0.008","3","ppm @ 7% O2","3","5.8","9780"]
[68029,"BLR1","Unit_1",2027,"acid gas","SO2","2010-03-03T02:00:00","0.001","3","ppm @ 7% O2","3","5.8","9780"]
[68029,"BLR1","Unit_1",2027,"acid gas","SO2","2010-03-03T03:00:00","0.003","2","ppm @ 7% O2","2","5.8","9780"]
[68029,"BLR1","Unit_1",2027,"acid gas","SO2","2010-03-03T04:00:00","0.016","2","ppm @ 7% O2","2","5.8","9780"]
[68029,"BLR1","Unit_1",2027,"acid gas","SO2","2010-03-03T05:00:00","0.011","3","ppm @ 7% O2","3","5.8","9780"]
[68029,"BLR1","Unit_1",2027,"acid gas","SO2","2010-03-03T06:00:00","0.010","5","ppm @ 7% O2","5","5.8","9780"]
[68029,"BLR1","Unit_1",2027,"acid gas","SO2","2010-03-03T07:00:00","0.010","4","ppm @ 7% O2","4","5.8","9780"]
[68029,"BLR1","Unit_1",2027,"acid gas","SO2","2010-03-03T08:00:00","0.019","5","ppm @ 7% O2","5","5.8","9780"]
[68029,"BLR1","Unit_1",2027,"acid gas","SO2","2010-03-03T09:00:00","0.006","5","ppm @ 7% O2","5","5.8","9780"]
[68029,"BLR1","Unit_1",2027,"acid gas","SO2","2010-03-03T10:00:00","0.003","4","ppm @ 7% O2","4","5.8","9780"]
[68029,"BLR1","Unit_1",2027,"acid gas","SO2","2010-03-03T11:00:00","0.019","3","ppm @ 7% O2","3","5.8","9780"]
[68029,"BLR1","Unit_1",2027,"acid gas","SO2","2010-03-03T12:00:00","0.013","5","ppm @ 7% O2","5","5.9","9780"]
[68029,"BLR1","Unit_1",2027,"acid gas","SO2","2010-03-03T13:00:00","0.005","5","ppm @ 7% O2","5","5.9","9780"]
[68029,"BLR1","Unit_1",2027,"acid gas","SO2","2010-03-03T14:00:00","0.013","5","ppm @ 7% O2","5","5.9","9780"]
[68029,"BLR1","Unit_1",2027,"acid gas","SO2","2010-03-03T15:00:00","0.013","4","ppm @ 7% O2","4","5.9","9780"]
[68029,{"$f":"IF(D789=2027,\"BLR1\",\"BLR2\")","v":"BLR1"},{"$f":"IF(D789=2027,\"Unit_1\",\"Unit_2\")","v":"Unit_1"},2027,"acid gas","SO2","2010-03-03T16:00:00","0.020","5","ppm @ 7% O2","5","5.9","9780"]
[68029,"BLR1","Unit_1",2027,"acid gas","SO2","2010-03-03T17:00:00","0.005","6","ppm @ 7% O2","6","5.9","9780"]
[68029,"BLR1","Unit_1",2027,"acid gas","SO2","2010-03-03T18:00:00","0.002","4","ppm @ 7% O2","4","5.9","9780"]
[68029,"BLR1","Unit_1",2027,"acid gas","SO2","2010-03-03T19:00:00","0.002","2","ppm @ 7% O2","2","5.9","9780"]
[68029,"BLR1","Unit_1",2027,"acid gas","SO2","2010-03-03T20:00:00","0.005","1","ppm @ 7% O2","1","5.9","9780"]
[68029,"BLR1","Unit_1",2027,"acid gas","SO2","2010-03-03T21:00:00","0.003","1","ppm @ 7% O2","1","5.8","9780"]
[68029,"BLR1","Unit_1",2027,"acid gas","SO2","2010-03-03T22:00:00","0.003","1","ppm @ 7% O2","1","5.7","9780"]
[68029,"BLR1","Unit_1",2027,"acid gas","SO2","2010-03-03T23:00:00","0.003","1","ppm @ 7% O2","1","5.7","9780"]
[68029,"BLR1","Unit_1",2027,"acid gas","SO2","2010-03-04","0.004","1","ppm @ 7% O2","1","5.7","9780"]
[68029,"BLR1","Unit_1",2027,"acid gas","SO2","2010-03-04T01:00:00","0.008","2","ppm @ 7% O2","2","5.7","9780"]
[68029,"BLR1","Unit_1",2027,"acid gas","SO2","2010-03-04T02:00:00","0.007","2","ppm @ 7% O2","2","5.8","9780"]
[68029,"BLR1","Unit_1",2027,"acid gas","SO2","2010-03-04T03:00:00","0.010","3","ppm @ 7% O2","3","5.8","9780"]
[68029,"BLR1","Unit_1",2027,"acid gas","SO2","2010-03-04T04:00:00","0.006","3","ppm @ 7% O2","3","5.8","9780"]
[68029,"BLR1","Unit_1",2027,"acid gas","SO2","2010-03-04T05:00:00","0.013","3","ppm @ 7% O2","3","5.8","9780"]
[68029,"BLR1","Unit_1",2027,"acid gas","SO2","2010-03-04T06:00:00","0.013","5","ppm @ 7% O2","5","5.7","9780"]
[68029,"BLR1","Unit_1",2027,"acid gas","SO2","2010-03-04T07:00:00","0.013","5","ppm @ 7% O2","5","5.7","9780"]
[68029,"BLR1","Unit_1",2027,"acid gas","SO2","2010-03-04T08:00:00","0.013","5","ppm @ 7% O2","5","5.7","9780"]
[68029,"BLR1","Unit_1",2027,"acid gas","SO2","2010-03-04T09:00:00","0.013","5","ppm @ 7% O2","5","5.7","9780"]
[68029,"BLR1","Unit_1",2027,"acid gas","SO2","2010-03-04T10:00:00","0.013","5","ppm @ 7% O2","5","5.8","9780"]
[68029,"BLR1","Unit_1",2027,"acid gas","SO2","2010-03-04T11:00:00","0.013","5","ppm @ 7% O2","5","5.7","9780"]
[68029,"BLR1","Unit_1",2027,"acid gas","SO2","2010-03-04T12:00:00","0.013","5","ppm @ 7% O2","5","5.8","9780"]
[68029,"BLR1","Unit_1",2027,"acid gas","SO2","2010-03-04T13:00:00","0.013","5","ppm @ 7% O2","5","5.8","9780"]
[68029,"BLR1","Unit_1",2027,"acid gas","SO2","2010-03-04T14:00:00","0.013","5","ppm @ 7% O2","5","5.9","9780"]
[68029,"BLR1","Unit_1",2027,"acid gas","SO2","2010-03-04T15:00:00","0.013","5","ppm @ 7% O2","5","5.9","9780"]
[68029,"BLR1","Unit_1",2027,"acid gas","SO2","2010-03-04T16:00:00","0.013","5","ppm @ 7% O2","5","5.9","9780"]
[68029,"BLR1","Unit_1",2027,"acid gas","SO2","2010-03-04T17:00:00","0.012","5","ppm @ 7% O2","5","5.9","9780"]
[68029,"BLR1","Unit_1",2027,"acid gas","SO2","2010-03-04T18:00:00","0.012","5","ppm @ 7% O2","5","5.9","9780"]
[68029,"BLR1","Unit_1",2027,"acid gas","SO2","2010-03-04T19:00:00","0.012","5","ppm @ 7% O2","5","5.9","9780"]
[68029,"BLR1","Unit_1",2027,"acid gas","SO2","2010-03-04T20:00:00","0.012","5","ppm @ 7% O2","5","5.9","9780"]
[68029,"BLR1","Unit_1",2027,"acid gas","SO2","2010-03-04T21:00:00","0.012","5","ppm @ 7% O2","5","5.9","9780"]
[68029,"BLR1","Unit_1",2027,"acid gas","SO2","2010-03-04T22:00:00","0.012","5","ppm @ 7% O2","5","5.9","9780"]
[68029,"BLR1","Unit_1",2027,"acid gas","SO2","2010-03-04T23:00:00","0.012","5","ppm @ 7% O2","5","5.9","9780"]
[68029,"BLR1","Unit_1",2027,"acid gas","SO2","2010-03-05","0.012","5","ppm @ 7% O2","5","5.9","9780"]
[68029,"BLR1","Unit_1",2027,"acid gas","SO2","2010-03-05T01:00:00","0.012","5","ppm @ 7% O2","5","5.9","9780"]
[68029,"BLR1","Unit_1",2027,"acid gas","SO2","2010-03-05T02:00:00","0.012","5","ppm @ 7% O2","5","5.9","9780"]
[68029,"BLR1","Unit_1",2027,"acid gas","SO2","2010-03-05T03:00:00","0.012","5","ppm @ 7% O2","5","5.9","9780"]
[68029,"BLR1","Unit_1",2027,"acid gas","SO2","2010-03-05T04:00:00","0.011","5","ppm @ 7% O2","5","5.9","9780"]
[68029,"BLR1","Unit_1",2027,"acid gas","SO2","2010-03-05T05:00:00","0.012","5","ppm @ 7% O2","5","5.9","9780"]
[68029,"BLR1","Unit_1",2027,"acid gas","SO2","2010-03-05T06:00:00","0.009","5","ppm @ 7% O2","5","5.8","9780"]
[68029,"BLR1","Unit_1",2027,"acid gas","SO2","2010-03-05T07:00:00","0.022","5","ppm @ 7% O2","5","5.9","9780"]
[68029,"BLR1","Unit_1",2027,"acid gas","SO2","2010-03-05T08:00:00","0.009","6","ppm @ 7% O2","6","5.9","9780"]
[68029,"BLR1","Unit_1",2027,"acid gas","SO2","2010-03-05T09:00:00","0.011","6","ppm @ 7% O2","6","5.8","9780"]
[68029,"BLR1","Unit_1",2027,"acid gas","SO2","2010-03-05T10:00:00","0.012","5","ppm @ 7% O2","5","5.7","9780"]
[68029,"BLR1","Unit_1",2027,"acid gas","SO2","2010-03-05T11:00:00","0.015","5","ppm @ 7% O2","5","5.7","9780"]
[68029,"BLR1","Unit_1",2027,"acid gas","SO2","2010-03-05T12:00:00","0.013","6","ppm @ 7% O2","6","5.7","9780"]
[68029,"BLR1","Unit_1",2027,"acid gas","SO2","2010-03-05T13:00:00","0.006","5","ppm @ 7% O2","5","5.8","9780"]
[68029,"BLR1","Unit_1",2027,"acid gas","SO2","2010-03-05T14:00:00","0.015","5","ppm @ 7% O2","5","5.8","9780"]
[68029,"BLR1","Unit_1",2027,"acid gas","SO2","2010-03-05T15:00:00","0.016","5","ppm @ 7% O2","5","5.8","9780"]
[68029,"BLR1","Unit_1",2027,"acid gas","SO2","2010-03-05T16:00:00","0.007","5","ppm @ 7% O2","5","5.8","9780"]
[68029,"BLR1","Unit_1",2027,"acid gas","SO2","2010-03-05T17:00:00","0.002","4","ppm @ 7% O2","4","5.8","9780"]
[68029,"BLR1","Unit_1",2027,"acid gas","SO2","2010-03-05T18:00:00","0.017","3","ppm @ 7% O2","3","5.7","9780"]
[68029,"BLR1","Unit_1",2027,"acid gas","SO2","2010-03-05T19:00:00","0.005","3","ppm @ 7% O2","3","5.8","9780"]
[68029,"BLR1","Unit_1",2027,"acid gas","SO2","2010-03-05T20:00:00","0.006","3","ppm @ 7% O2","3","5.7","9780"]
[68029,"BLR1","Unit_1",2027,"acid gas","SO2","2010-03-05T21:00:00","0.018","4","ppm @ 7% O2","4","5.7","9780"]
[68029,"BLR1","Unit_1",2027,"acid gas","SO2","2010-03-05T22:00:00","0.009","4","ppm @ 7% O2","4","5.7","9780"]
[68029,"BLR1","Unit_1",2027,"acid gas","SO2","2010-03-05T23:00:00","0.009","5","ppm @ 7% O2","5","5.7","9780"]
[68029,"BLR1","Unit_1",2027,"acid gas","SO2","2010-03-06","0.008","4","ppm @ 7% O2","4","5.8","9780"]
[68029,"BLR1","Unit_1",2027,"acid gas","SO2","2010-03-06T01:00:00","0.007","3","ppm @ 7% O2","3","5.8","9780"]
[68029,"BLR1","Unit_1",2027,"acid gas","SO2","2010-03-06T02:00:00","0.013","4","ppm @ 7% O2","4","5.8","9780"]
[68029,"BLR1","Unit_1",2027,"acid gas","SO2","2010-03-06T03:00:00","0.019","5","ppm @ 7% O2","5","5.9","9780"]
[68029,"BLR1","Unit_1",2027,"acid gas","SO2","2010-03-06T04:00:00","0.013","6","ppm @ 7% O2","6","5.9","9780"]
[68029,"BLR1","Unit_1",2027,"acid gas","SO2","2010-03-06T05:00:00","0.011","6","ppm @ 7% O2","6","5.9","9780"]
[68029,"BLR1","Unit_1",2027,"acid gas","SO2","2010-03-06T06:00:00","0.014","5","ppm @ 7% O2","5","5.8","9780"]
[68029,"BLR1","Unit_1",2027,"acid gas","SO2","2010-03-06T07:00:00","0.013","5","ppm @ 7% O2","5","5.8","9780"]
[68029,{"$f":"IF(D853=2027,\"BLR1\",\"BLR2\")","v":"BLR1"},{"$f":"IF(D853=2027,\"Unit_1\",\"Unit_2\")","v":"Unit_1"},2027,"acid gas","SO2","2010-03-06T08:00:00","0.011","5","ppm @ 7% O2","5","5.8","9780"]
[68029,"BLR1","Unit_1",2027,"acid gas","SO2","2010-03-06T09:00:00","0.014","5","ppm @ 7% O2","5","5.8","9780"]
[68029,"BLR1","Unit_1",2027,"acid gas","SO2","2010-03-06T10:00:00","0.011","5","ppm @ 7% O2","5","5.7","9780"]
[68029,"BLR1","Unit_1",2027,"acid gas","SO2","2010-03-06T11:00:00","0.015","5","ppm @ 7% O2","5","5.8","9780"]
[68029,"BLR1","Unit_1",2027,"acid gas","SO2","2010-03-06T12:00:00","0.016","5","ppm @ 7% O2","5","5.8","9780"]
[68029,"BLR1","Unit_1",2027,"acid gas","SO2","2010-03-06T13:00:00","0.009","5","ppm @ 7% O2","5","5.8","9780"]
[68029,"BLR1","Unit_1",2027,"acid gas","SO2","2010-03-06T14:00:00","0.020","6","ppm @ 7% O2","6","5.8","9780"]
[68029,"BLR1","Unit_1",2027,"acid gas","SO2","2010-03-06T15:00:00","0.008","6","ppm @ 7% O2","6","5.9","9780"]
[68029,"BLR1","Unit_1",2027,"acid gas","SO2","2010-03-06T16:00:00","0.009","5","ppm @ 7% O2","5","5.9","9780"]
[68029,"BLR1","Unit_1",2027,"acid gas","SO2","2010-03-06T17:00:00","0.016","5","ppm @ 7% O2","5","5.8","9780"]
[68029,"BLR1","Unit_1",2027,"acid gas","SO2","2010-03-06T18:00:00","0.012","5","ppm @ 7% O2","5","5.8","9780"]
[68029,"BLR1","Unit_1",2027,"acid gas","SO2","2010-03-06T19:00:00","0.018","6","ppm @ 7% O2","6","5.9","9780"]
[68029,"BLR1","Unit_1",2027,"acid gas","SO2","2010-03-06T20:00:00","0.014","6","ppm @ 7% O2","6","5.9","9780"]
[68029,"BLR1","Unit_1",2027,"acid gas","SO2","2010-03-06T21:00:00","0.014","6","ppm @ 7% O2","6","5.9","9780"]
[68029,"BLR1","Unit_1",2027,"acid gas","SO2","2010-03-06T22:00:00","0.004","5","ppm @ 7% O2","5","6.1","9780"]
[68029,"BLR1","Unit_1",2027,"acid gas","SO2","2010-03-06T23:00:00","0.015","5","ppm @ 7% O2","5","6","9780"]
[68029,"BLR1","Unit_1",2027,"acid gas","SO2","2010-03-07","0.010","4","ppm @ 7% O2","4","5.9","9780"]
[68029,"BLR1","Unit_1",2027,"acid gas","SO2","2010-03-07T01:00:00","0.014","5","ppm @ 7% O2","5","5.9","9780"]
[68029,"BLR1","Unit_1",2027,"acid gas","SO2","2010-03-07T02:00:00","0.014","5","ppm @ 7% O2","5","5.9","9780"]
[68029,"BLR1","Unit_1",2027,"acid gas","SO2","2010-03-07T03:00:00","0.023","6","ppm @ 7% O2","6","5.9","9780"]
[68029,"BLR1","Unit_1",2027,"acid gas","SO2","2010-03-07T04:00:00","0.003","6","ppm @ 7% O2","6","5.9","9780"]
[68029,"BLR1","Unit_1",2027,"acid gas","SO2","2010-03-07T05:00:00","0.006","5","ppm @ 7% O2","5","5.8","9780"]
[68029,"BLR1","Unit_1",2027,"acid gas","SO2","2010-03-07T06:00:00","0.017","4","ppm @ 7% O2","4","5.9","9780"]
[68029,"BLR1","Unit_1",2027,"acid gas","SO2","2010-03-07T07:00:00","0.008","4","ppm @ 7% O2","4","5.8","9780"]
[68029,"BLR1","Unit_1",2027,"acid gas","SO2","2010-03-07T08:00:00","0.016","5","ppm @ 7% O2","5","5.8","9780"]
[68029,"BLR1","Unit_1",2027,"acid gas","SO2","2010-03-07T09:00:00","0.015","6","ppm @ 7% O2","6","5.8","9780"]
[68029,"BLR1","Unit_1",2027,"acid gas","SO2","2010-03-07T10:00:00","0.014","6","ppm @ 7% O2","6","5.8","9780"]
[68029,"BLR1","Unit_1",2027,"acid gas","SO2","2010-03-07T11:00:00","0.014","6","ppm @ 7% O2","6","5.8","9780"]
[68029,"BLR1","Unit_1",2027,"acid gas","SO2","2010-03-07T12:00:00","0.014","6","ppm @ 7% O2","6","5.7","9780"]
[68029,"BLR1","Unit_1",2027,"acid gas","SO2","2010-03-07T13:00:00","0.013","5","ppm @ 7% O2","5","5.7","9780"]
[68029,"BLR1","Unit_1",2027,"acid gas","SO2","2010-03-07T14:00:00","0.006","5","ppm @ 7% O2","5","5.8","9780"]
[68029,"BLR1","Unit_1",2027,"acid gas","SO2","2010-03-07T15:00:00","0.016","4","ppm @ 7% O2","4","5.8","9780"]
[68029,"BLR1","Unit_1",2027,"acid gas","SO2","2010-03-07T16:00:00","0.006","4","ppm @ 7% O2","4","5.8","9780"]
[68029,"BLR1","Unit_1",2027,"acid gas","SO2","2010-03-07T17:00:00","0.014","4","ppm @ 7% O2","4","5.7","9780"]
[68029,"BLR1","Unit_1",2027,"acid gas","SO2","2010-03-07T18:00:00","0.026","5","ppm @ 7% O2","5","5.7","9780"]
[68029,"BLR1","Unit_1",2027,"acid gas","SO2","2010-03-07T19:00:00","0.002","6","ppm @ 7% O2","6","5.9","9780"]
[68029,"BLR1","Unit_1",2027,"acid gas","SO2","2010-03-07T20:00:00","0.011","5","ppm @ 7% O2","5","5.9","9780"]
[68029,"BLR1","Unit_1",2027,"acid gas","SO2","2010-03-07T21:00:00","0.016","5","ppm @ 7% O2","5","5.8","9780"]
[68029,"BLR1","Unit_1",2027,"acid gas","SO2","2010-03-07T22:00:00","0.014","5","ppm @ 7% O2","5","5.5","9780"]
[68029,"BLR1","Unit_1",2027,"acid gas","SO2","2010-03-07T23:00:00","0.001","5","ppm @ 7% O2","5","5.7","9780"]
[68029,"BLR1","Unit_1",2027,"acid gas","SO2","2010-03-08","0.003","3","ppm @ 7% O2","3","6","9780"]
[68029,"BLR1","Unit_1",2027,"acid gas","SO2","2010-03-08T01:00:00","0.001","1","ppm @ 7% O2","1","7.3","9780"]
[68029,"BLR1","Unit_1",2027,"acid gas","SO2","2010-03-08T02:00:00","0.001","1","ppm @ 7% O2","1","8.1","9780"]
[68029,"BLR1","Unit_1",2027,"acid gas","SO2","2010-03-08T03:00:00","0.001","1","ppm @ 7% O2","1","8.1","9780"]
[68029,"BLR1","Unit_1",2027,"acid gas","SO2","2010-03-08T04:00:00","0.001","0","ppm @ 7% O2","0","7.8","9780"]
[68029,"BLR1","Unit_1",2027,"acid gas","SO2","2010-03-08T05:00:00","0.001","0","ppm @ 7% O2","0","6.8","9780"]
[68029,"BLR1","Unit_1",2027,"acid gas","SO2","2010-03-08T06:00:00","0.010","0","ppm @ 7% O2","0","5.6","9780"]
[68029,"BLR1","Unit_1",2027,"acid gas","SO2","2010-03-08T07:00:00","0.021","3","ppm @ 7% O2","3","5.5","9780"]
[68029,"BLR1","Unit_1",2027,"acid gas","SO2","2010-03-08T08:00:00","0.011","5","ppm @ 7% O2","5","5.6","9780"]
[68029,"BLR1","Unit_1",2027,"acid gas","SO2","2010-03-08T09:00:00","0.007","6","ppm @ 7% O2","6","5.7","9780"]
[68029,"BLR1","Unit_1",2027,"acid gas","SO2","2010-03-08T10:00:00","0.004","4","ppm @ 7% O2","4","5.6","9780"]
[68029,"BLR1","Unit_1",2027,"acid gas","SO2","2010-03-08T11:00:00","0.007","3","ppm @ 7% O2","3","5.7","9780"]
[68029,"BLR1","Unit_1",2027,"acid gas","SO2","2010-03-08T12:00:00","0.018","3","ppm @ 7% O2","3","5.7","9780"]
[68029,"BLR1","Unit_1",2027,"acid gas","SO2","2010-03-08T13:00:00","0.024","5","ppm @ 7% O2","5","5.8","9780"]
[68029,"BLR1","Unit_1",2027,"acid gas","SO2","2010-03-08T14:00:00","0.005","7","ppm @ 7% O2","7","5.8","9780"]
[68029,"BLR1","Unit_1",2027,"acid gas","SO2","2010-03-08T15:00:00","0.003","6","ppm @ 7% O2","6","5.8","9780"]
[68029,"BLR1","Unit_1",2027,"acid gas","SO2","2010-03-08T16:00:00","0.008","3","ppm @ 7% O2","3","5.8","9780"]
[68029,"BLR1","Unit_1",2027,"acid gas","SO2","2010-03-08T17:00:00","0.014","3","ppm @ 7% O2","3","5.9","9780"]
[68029,"BLR1","Unit_1",2027,"acid gas","SO2","2010-03-08T18:00:00","0.013","4","ppm @ 7% O2","4","5.9","9780"]
[68029,"BLR1","Unit_1",2027,"acid gas","SO2","2010-03-08T19:00:00","0.009","5","ppm @ 7% O2","5","6","9780"]
[68029,"BLR1","Unit_1",2027,"acid gas","SO2","2010-03-08T20:00:00","0.011","5","ppm @ 7% O2","5","6","9780"]
[68029,"BLR1","Unit_1",2027,"acid gas","SO2","2010-03-08T21:00:00","0.014","5","ppm @ 7% O2","5","5.9","9780"]
[68029,"BLR1","Unit_1",2027,"acid gas","SO2","2010-03-08T22:00:00","0.015","5","ppm @ 7% O2","5","5.9","9780"]
[68029,"BLR1","Unit_1",2027,"acid gas","SO2","2010-03-08T23:00:00","0.015","6","ppm @ 7% O2","6","5.9","9780"]
[68029,{"$f":"IF(D917=2027,\"BLR1\",\"BLR2\")","v":"BLR1"},{"$f":"IF(D917=2027,\"Unit_1\",\"Unit_2\")","v":"Unit_1"},2027,"acid gas","SO2","2010-03-09","0.017","6","ppm @ 7% O2","6","6","9780"]
[68029,"BLR1","Unit_1",2027,"acid gas","SO2","2010-03-09T01:00:00","0.010","6","ppm @ 7% O2","6","6","9780"]
[68029,"BLR1","Unit_1",2027,"acid gas","SO2","2010-03-09T02:00:00","0.013","6","ppm @ 7% O2","6","6","9780"]
[68029,"BLR1","Unit_1",2027,"acid gas","SO2","2010-03-09T03:00:00","0.011","5","ppm @ 7% O2","5","6.1","9780"]
[68029,"BLR1","Unit_1",2027,"acid gas","SO2","2010-03-09T04:00:00","0.015","5","ppm @ 7% O2","5","6.1","9780"]
[68029,"BLR1","Unit_1",2027,"acid gas","SO2","2010-03-09T05:00:00","0.012","5","ppm @ 7% O2","5","6","9780"]
[68029,"BLR1","Unit_1",2027,"acid gas","SO2","2010-03-09T06:00:00","0.001","3","ppm @ 7% O2","3","6","9780"]
[68029,"BLR1","Unit_1",2027,"acid gas","SO2","2010-03-09T07:00:00","0.001","1","ppm @ 7% O2","1","5.8","9780"]
[68029,"BLR1","Unit_1",2027,"acid gas","SO2","2010-03-09T08:00:00","0.001","0","ppm @ 7% O2","0","5.8","9780"]
[68029,"BLR1","Unit_1",2027,"acid gas","SO2","2010-03-09T09:00:00","0.001","0","ppm @ 7% O2","0","5.6","9780"]
[68029,"BLR1","Unit_1",2027,"acid gas","SO2","2010-03-09T10:00:00","0.007","1","ppm @ 7% O2","1","5.6","9780"]
[68029,"BLR1","Unit_1",2027,"acid gas","SO2","2010-03-09T11:00:00","0.015","2","ppm @ 7% O2","2","5.6","9780"]
[68029,"BLR1","Unit_1",2027,"acid gas","SO2","2010-03-09T12:00:00","0.016","4","ppm @ 7% O2","4","5.6","9780"]
[68029,"BLR1","Unit_1",2027,"acid gas","SO2","2010-03-09T13:00:00","0.019","6","ppm @ 7% O2","6","5.6","9780"]
[68029,"BLR1","Unit_1",2027,"acid gas","SO2","2010-03-09T14:00:00","0.013","7","ppm @ 7% O2","7","5.6","9780"]
[68029,"BLR1","Unit_1",2027,"acid gas","SO2","2010-03-09T15:00:00","0.008","6","ppm @ 7% O2","6","5.7","9780"]
[68029,"BLR1","Unit_1",2027,"acid gas","SO2","2010-03-09T16:00:00","0.012","5","ppm @ 7% O2","5","5.6","9780"]
[68029,"BLR1","Unit_1",2027,"acid gas","SO2","2010-03-09T17:00:00","0.013","5","ppm @ 7% O2","5","5.7","9780"]
[68029,"BLR1","Unit_1",2027,"acid gas","SO2","2010-03-09T18:00:00","0.013","5","ppm @ 7% O2","5","5.6","9780"]
[68029,"BLR1","Unit_1",2027,"acid gas","SO2","2010-03-09T19:00:00","0.004","5","ppm @ 7% O2","5","5.6","9780"]
[68029,"BLR1","Unit_1",2027,"acid gas","SO2","2010-03-09T20:00:00","0.011","4","ppm @ 7% O2","4","5.6","9780"]
[68029,"BLR1","Unit_1",2027,"acid gas","SO2","2010-03-09T21:00:00","0.014","4","ppm @ 7% O2","4","5.5","9780"]
[68029,"BLR1","Unit_1",2027,"acid gas","SO2","2010-03-09T22:00:00","0.013","5","ppm @ 7% O2","5","5.5","9780"]
[68029,"BLR1","Unit_1",2027,"acid gas","SO2","2010-03-09T23:00:00","0.014","5","ppm @ 7% O2","5","5.6","9780"]
[68029,"BLR1","Unit_1",2027,"acid gas","SO2","2010-03-10","0.013","6","ppm @ 7% O2","6","5.6","9780"]
[68029,"BLR1","Unit_1",2027,"acid gas","SO2","2010-03-10T01:00:00","0.014","5","ppm @ 7% O2","5","5.6","9780"]
[68029,"BLR1","Unit_1",2027,"acid gas","SO2","2010-03-10T02:00:00","0.016","6","ppm @ 7% O2","6","5.7","9780"]
[68029,"BLR1","Unit_1",2027,"acid gas","SO2","2010-03-10T03:00:00","0.016","6","ppm @ 7% O2","6","5.7","9780"]
[68029,"BLR1","Unit_1",2027,"acid gas","SO2","2010-03-10T04:00:00","0.014","6","ppm @ 7% O2","6","5.7","9780"]
[68029,"BLR1","Unit_1",2027,"acid gas","SO2","2010-03-10T05:00:00","0.013","6","ppm @ 7% O2","6","5.7","9780"]
[68029,"BLR1","Unit_1",2027,"acid gas","SO2","2010-03-10T06:00:00","0.016","6","ppm @ 7% O2","6","5.7","9780"]
[68029,"BLR1","Unit_1",2027,"acid gas","SO2","2010-03-10T07:00:00","0.014","6","ppm @ 7% O2","6","5.6","9780"]
[68029,"BLR1","Unit_1",2027,"acid gas","SO2","2010-03-10T08:00:00","0.012","6","ppm @ 7% O2","6","5.6","9780"]
[68029,"BLR1","Unit_1",2027,"acid gas","SO2","2010-03-10T09:00:00","0.014","5","ppm @ 7% O2","5","5.6","9780"]
[68029,"BLR1","Unit_1",2027,"acid gas","SO2","2010-03-10T10:00:00","0.013","5","ppm @ 7% O2","5","5.5","9780"]
[68029,"BLR1","Unit_1",2027,"acid gas","SO2","2010-03-10T11:00:00","0.012","5","ppm @ 7% O2","5","5.4","9780"]
[68029,"BLR1","Unit_1",2027,"acid gas","SO2","2010-03-10T12:00:00","0.014","6","ppm @ 7% O2","6","5.6","9780"]
[68029,"BLR1","Unit_1",2027,"acid gas","SO2","2010-03-10T13:00:00","0.015","5","ppm @ 7% O2","5","5.6","9780"]
[68029,"BLR1","Unit_1",2027,"acid gas","SO2","2010-03-10T14:00:00","0.016","6","ppm @ 7% O2","6","5.6","9780"]
[68029,"BLR1","Unit_1",2027,"acid gas","SO2","2010-03-10T15:00:00","0.012","6","ppm @ 7% O2","6","5.6","9780"]
[68029,"BLR1","Unit_1",2027,"acid gas","SO2","2010-03-10T16:00:00","0.013","6","ppm @ 7% O2","6","5.6","9780"]
[68029,"BLR1","Unit_1",2027,"acid gas","SO2","2010-03-10T17:00:00","0.009","6","ppm @ 7% O2","6","5.6","9780"]
[68029,"BLR1","Unit_1",2027,"acid gas","SO2","2010-03-10T18:00:00","0.003","4","ppm @ 7% O2","4","5.5","9780"]
[68029,"BLR1","Unit_1",2027,"acid gas","SO2","2010-03-10T19:00:00","0.002","3","ppm @ 7% O2","3","5.5","9780"]
[68029,"BLR1","Unit_1",2027,"acid gas","SO2","2010-03-10T20:00:00","0.001","1","ppm @ 7% O2","1","5.5","9780"]
[68029,"BLR1","Unit_1",2027,"acid gas","SO2","2010-03-10T21:00:00","0.001","1","ppm @ 7% O2","1","5.4","9780"]
[68029,"BLR1","Unit_1",2027,"acid gas","SO2","2010-03-10T22:00:00","0.001","0","ppm @ 7% O2","0","5.5","9780"]
[68029,"BLR1","Unit_1",2027,"acid gas","SO2","2010-03-10T23:00:00","0.001","0","ppm @ 7% O2","0","5.5","9780"]
[68029,"BLR1","Unit_1",2027,"acid gas","SO2","2010-03-11","0.002","1","ppm @ 7% O2","1","5.5","9780"]
[68029,"BLR1","Unit_1",2027,"acid gas","SO2","2010-03-11T01:00:00","0.001","1","ppm @ 7% O2","1","5.7","9780"]
[68029,"BLR1","Unit_1",2027,"acid gas","SO2","2010-03-11T02:00:00","0.014","1","ppm @ 7% O2","1","6.7","9780"]
[68029,"BLR1","Unit_1",2027,"acid gas","SO2","2010-03-11T03:00:00","0.003","2","ppm @ 7% O2","2","6.2","9780"]
[68029,"BLR1","Unit_1",2027,"acid gas","SO2","2010-03-11T04:00:00","0.002","3","ppm @ 7% O2","3","5.8","9780"]
[68029,"BLR1","Unit_1",2027,"acid gas","SO2","2010-03-11T05:00:00","0.008","3","ppm @ 7% O2","3","5.8","9780"]
[68029,"BLR1","Unit_1",2027,"acid gas","SO2","2010-03-11T06:00:00","0.006","2","ppm @ 7% O2","2","5.8","9780"]
[68029,"BLR1","Unit_1",2027,"acid gas","SO2","2010-03-11T07:00:00","0.011","3","ppm @ 7% O2","3","5.7","9780"]
[68029,"BLR1","Unit_1",2027,"acid gas","SO2","2010-03-11T08:00:00","0.015","4","ppm @ 7% O2","4","5.7","9780"]
[68029,"BLR1","Unit_1",2027,"acid gas","SO2","2010-03-11T09:00:00","0.015","5","ppm @ 7% O2","5","5.7","9780"]
[68029,"BLR1","Unit_1",2027,"acid gas","SO2","2010-03-11T10:00:00","0.012","6","ppm @ 7% O2","6","5.7","9780"]
[68029,"BLR1","Unit_1",2027,"acid gas","SO2","2010-03-11T11:00:00","0.003","5","ppm @ 7% O2","5","5.7","9780"]
[68029,"BLR1","Unit_1",2027,"acid gas","SO2","2010-03-11T12:00:00","0.007","4","ppm @ 7% O2","4","5.7","9780"]
[68029,"BLR1","Unit_1",2027,"acid gas","SO2","2010-03-11T13:00:00","0.007","2","ppm @ 7% O2","2","5.7","9780"]
[68029,"BLR1","Unit_1",2027,"acid gas","SO2","2010-03-11T14:00:00","0.007","3","ppm @ 7% O2","3","5.8","9780"]
[68029,"BLR1","Unit_1",2027,"acid gas","SO2","2010-03-11T15:00:00","0.017","3","ppm @ 7% O2","3","5.8","9780"]
[68029,{"$f":"IF(D981=2027,\"BLR1\",\"BLR2\")","v":"BLR1"},{"$f":"IF(D981=2027,\"Unit_1\",\"Unit_2\")","v":"Unit_1"},2027,"acid gas","SO2","2010-03-11T16:00:00","0.018","5","ppm @ 7% O2","5","5.8","9780"]
[68029,"BLR1","Unit_1",2027,"acid gas","SO2","2010-03-11T17:00:00","0.006","5","ppm @ 7% O2","5","5.7","9780"]
[68029,"BLR1","Unit_1",2027,"acid gas","SO2","2010-03-11T18:00:00","0.003","5","ppm @ 7% O2","5","5.7","9780"]
[68029,"BLR1","Unit_1",2027,"acid gas","SO2","2010-03-11T19:00:00","0.006","3","ppm @ 7% O2","3","5.7","9780"]
[68029,"BLR1","Unit_1",2027,"acid gas","SO2","2010-03-11T20:00:00","0.008","2","ppm @ 7% O2","2","5.7","9780"]
[68029,"BLR1","Unit_1",2027,"acid gas","SO2","2010-03-11T21:00:00","0.010","3","ppm @ 7% O2","3","5.7","9780"]
[68029,"BLR1","Unit_1",2027,"acid gas","SO2","2010-03-11T22:00:00","0.008","3","ppm @ 7% O2","3","5.6","9780"]
[68029,"BLR1","Unit_1",2027,"acid gas","SO2","2010-03-11T23:00:00","0.002","3","ppm @ 7% O2","3","5.6","9780"]
[68029,"BLR1","Unit_1",2027,"acid gas","SO2","2010-03-12","0.002","2","ppm @ 7% O2","2","5.7","9780"]
[68029,"BLR1","Unit_1",2027,"acid gas","SO2","2010-03-12T01:00:00","0.001","1","ppm @ 7% O2","1","5.9","9780"]
[68029,"BLR1","Unit_1",2027,"acid gas","SO2","2010-03-12T02:00:00","0.001","1","ppm @ 7% O2","1","7","9780"]
[68029,"BLR1","Unit_1",2027,"acid gas","SO2","2010-03-12T03:00:00","0.001","0","ppm @ 7% O2","0","7.2","9780"]
[68029,"BLR1","Unit_1",2027,"acid gas","SO2","2010-03-12T04:00:00","0.016","1","ppm @ 7% O2","1","7.2","9780"]
[68029,"BLR1","Unit_1",2027,"acid gas","SO2","2010-03-12T05:00:00","0.005","3","ppm @ 7% O2","3","6.2","9780"]
[68029,"BLR1","Unit_1",2027,"acid gas","SO2","2010-03-12T06:00:00","0.008","3","ppm @ 7% O2","3","6","9780"]
[68029,"BLR1","Unit_1",2027,"acid gas","SO2","2010-03-12T07:00:00","0.016","5","ppm @ 7% O2","5","6.1","9780"]
[68029,"BLR1","Unit_1",2027,"acid gas","SO2","2010-03-12T08:00:00","0.015","5","ppm @ 7% O2","5","6","9780"]
[68029,"BLR1","Unit_1",2027,"acid gas","SO2","2010-03-12T09:00:00","0.020","6","ppm @ 7% O2","6","5.9","9780"]
[68029,"BLR1","Unit_1",2027,"acid gas","SO2","2010-03-12T10:00:00","0.005","6","ppm @ 7% O2","6","6","9780"]
[68029,"BLR1","Unit_1",2027,"acid gas","SO2","2010-03-12T11:00:00","0.002","4","ppm @ 7% O2","4","6","9780"]
[68029,"BLR1","Unit_1",2027,"acid gas","SO2","2010-03-12T12:00:00","0.002","2","ppm @ 7% O2","2","6","9780"]
[68029,"BLR1","Unit_1",2027,"acid gas","SO2","2010-03-12T13:00:00","0.012","1","ppm @ 7% O2","1","6","9780"]
[68029,"BLR1","Unit_1",2027,"acid gas","SO2","2010-03-12T14:00:00","0.014","3","ppm @ 7% O2","3","6","9780"]
[68029,"BLR1","Unit_1",2027,"acid gas","SO2","2010-03-12T15:00:00","0.012","5","ppm @ 7% O2","5","6.1","9780"]
[68029,"BLR1","Unit_1",2027,"acid gas","SO2","2010-03-12T16:00:00","0.017","6","ppm @ 7% O2","6","6.1","9780"]
[68029,"BLR1","Unit_1",2027,"acid gas","SO2","2010-03-12T17:00:00","0.002","5","ppm @ 7% O2","5","5.8","9780"]
[68029,"BLR1","Unit_1",2027,"acid gas","SO2","2010-03-12T18:00:00","0.003","4","ppm @ 7% O2","4","5.8","9780"]
[68029,"BLR1","Unit_1",2027,"acid gas","SO2","2010-03-12T19:00:00","0.024","3","ppm @ 7% O2","3","5.7","9780"]
[68029,"BLR1","Unit_1",2027,"acid gas","SO2","2010-03-12T20:00:00","0.004","4","ppm @ 7% O2","4","5.7","9780"]
[68029,"BLR1","Unit_1",2027,"acid gas","SO2","2010-03-12T21:00:00","0.005","4","ppm @ 7% O2","4","5.7","9780"]
[68029,"BLR1","Unit_1",2027,"acid gas","SO2","2010-03-12T22:00:00","0.010","4","ppm @ 7% O2","4","5.7","9780"]
[68029,"BLR1","Unit_1",2027,"acid gas","SO2","2010-03-12T23:00:00","0.003","2","ppm @ 7% O2","2","5.7","9780"]
[68029,"BLR1","Unit_1",2027,"acid gas","SO2","2010-03-13","0.010","2","ppm @ 7% O2","2","5.7","9780"]
[68029,"BLR1","Unit_1",2027,"acid gas","SO2","2010-03-13T01:00:00","0.007","3","ppm @ 7% O2","3","5.8","9780"]
[68029,"BLR1","Unit_1",2027,"acid gas","SO2","2010-03-13T02:00:00","0.007","3","ppm @ 7% O2","3","5.8","9780"]
[68029,"BLR1","Unit_1",2027,"acid gas","SO2","2010-03-13T03:00:00","0.013","4","ppm @ 7% O2","4","5.8","9780"]
[68029,"BLR1","Unit_1",2027,"acid gas","SO2","2010-03-13T04:00:00","0.019","4","ppm @ 7% O2","4","5.7","9780"]
[68029,"BLR1","Unit_1",2027,"acid gas","SO2","2010-03-13T05:00:00","0.006","5","ppm @ 7% O2","5","5.7","9780"]
[68029,"BLR1","Unit_1",2027,"acid gas","SO2","2010-03-13T06:00:00","0.014","5","ppm @ 7% O2","5","6","9780"]
[68029,"BLR1","Unit_1",2027,"acid gas","SO2","2010-03-13T07:00:00","0.023","6","ppm @ 7% O2","6","6.2","9780"]
[68029,"BLR1","Unit_1",2027,"acid gas","SO2","2010-03-13T08:00:00","0.012","6","ppm @ 7% O2","6","5.7","9780"]
[68029,"BLR1","Unit_1",2027,"acid gas","SO2","2010-03-13T09:00:00","0.012","7","ppm @ 7% O2","7","6","9780"]
[68029,"BLR1","Unit_1",2027,"acid gas","SO2","2010-03-13T10:00:00","0.014","6","ppm @ 7% O2","6","6","9780"]
[68029,"BLR1","Unit_1",2027,"acid gas","SO2","2010-03-13T11:00:00","0.015","6","ppm @ 7% O2","6","6","9780"]
[68029,"BLR1","Unit_1",2027,"acid gas","SO2","2010-03-13T12:00:00","0.014","5","ppm @ 7% O2","5","6","9780"]
[68029,"BLR1","Unit_1",2027,"acid gas","SO2","2010-03-13T13:00:00","0.012","6","ppm @ 7% O2","6","6","9780"]
[68029,"BLR1","Unit_1",2027,"acid gas","SO2","2010-03-13T14:00:00","0.022","6","ppm @ 7% O2","6","6","9780"]
[68029,"BLR1","Unit_1",2027,"acid gas","SO2","2010-03-13T15:00:00","0.007","7","ppm @ 7% O2","7","6","9780"]
[68029,"BLR1","Unit_1",2027,"acid gas","SO2","2010-03-13T16:00:00","0.007","5","ppm @ 7% O2","5","6","9780"]
[68029,"BLR1","Unit_1",2027,"acid gas","SO2","2010-03-13T17:00:00","0.018","5","ppm @ 7% O2","5","6.1","9780"]
[68029,"BLR1","Unit_1",2027,"acid gas","SO2","2010-03-13T18:00:00","0.011","4","ppm @ 7% O2","4","6.1","9780"]
[68029,"BLR1","Unit_1",2027,"acid gas","SO2","2010-03-13T19:00:00","0.007","5","ppm @ 7% O2","5","6.1","9780"]
[68029,"BLR1","Unit_1",2027,"acid gas","SO2","2010-03-13T20:00:00","0.006","4","ppm @ 7% O2","4","6","9780"]
[68029,"BLR1","Unit_1",2027,"acid gas","SO2","2010-03-13T21:00:00","0.008","3","ppm @ 7% O2","3","5.9","9780"]
[68029,"BLR1","Unit_1",2027,"acid gas","SO2","2010-03-13T22:00:00","0.012","3","ppm @ 7% O2","3","5.8","9780"]
[68029,"BLR1","Unit_1",2027,"acid gas","SO2","2010-03-13T23:00:00","0.012","4","ppm @ 7% O2","4","5.8","9780"]
[68029,"BLR1","Unit_1",2027,"acid gas","SO2","2010-03-14","0.011","5","ppm @ 7% O2","5","5.7","9780"]
[68029,"BLR1","Unit_1",2027,"acid gas","SO2","2010-03-14T01:00:00","0.005","4","ppm @ 7% O2","4","5.7","9780"]
[68029,"BLR1","Unit_1",2027,"acid gas","SO2","2010-03-14T02:00:00","0.008","4","ppm @ 7% O2","4","5.7","9780"]
[68029,"BLR1","Unit_1",2027,"acid gas","SO2","2010-03-14T03:00:00","0.020","4","ppm @ 7% O2","4","5.8","9780"]
[68029,"BLR1","Unit_1",2027,"acid gas","SO2","2010-03-14T04:00:00","0.009","5","ppm @ 7% O2","5","5.7","9780"]
[68029,"BLR1","Unit_1",2027,"acid gas","SO2","2010-03-14T05:00:00","0.014","5","ppm @ 7% O2","5","5.7","9780"]
[68029,"BLR1","Unit_1",2027,"acid gas","SO2","2010-03-14T06:00:00","0.012","5","ppm @ 7% O2","5","5.8","9780"]
[68029,"BLR1","Unit_1",2027,"acid gas","SO2","2010-03-14T07:00:00","0.007","5","ppm @ 7% O2","5","5.8","9780"]
[68029,{"$f":"IF(D1045=2027,\"BLR1\",\"BLR2\")","v":"BLR1"},{"$f":"IF(D1045=2027,\"Unit_1\",\"Unit_2\")","v":"Unit_1"},2027,"acid gas","SO2","2010-03-14T08:00:00","0.012","4","ppm @ 7% O2","4","5.9","9780"]
[68029,"BLR1","Unit_1",2027,"acid gas","SO2","2010-03-14T09:00:00","0.012","4","ppm @ 7% O2","4","5.9","9780"]
[68029,"BLR1","Unit_1",2027,"acid gas","SO2","2010-03-14T10:00:00","0.012","4","ppm @ 7% O2","4","5.9","9780"]
[68029,"BLR1","Unit_1",2027,"acid gas","SO2","2010-03-14T11:00:00","0.012","5","ppm @ 7% O2","5","5.9","9780"]
[68029,"BLR1","Unit_1",2027,"acid gas","SO2","2010-03-14T12:00:00","0.008","5","ppm @ 7% O2","5","5.9","9780"]
[68029,"BLR1","Unit_1",2027,"acid gas","SO2","2010-03-14T13:00:00","0.015","4","ppm @ 7% O2","4","6","9780"]
[68029,"BLR1","Unit_1",2027,"acid gas","SO2","2010-03-14T14:00:00","0.011","4","ppm @ 7% O2","4","5.9","9780"]
[68029,"BLR1","Unit_1",2027,"acid gas","SO2","2010-03-14T15:00:00","0.017","5","ppm @ 7% O2","5","5.9","9780"]
[68029,"BLR1","Unit_1",2027,"acid gas","SO2","2010-03-14T16:00:00","0.012","6","ppm @ 7% O2","6","6","9780"]
[68029,"BLR1","Unit_1",2027,"acid gas","SO2","2010-03-14T17:00:00","0.018","6","ppm @ 7% O2","6","5.9","9780"]
[68029,"BLR1","Unit_1",2027,"acid gas","SO2","2010-03-14T18:00:00","0.013","6","ppm @ 7% O2","6","6","9780"]
[68029,"BLR1","Unit_1",2027,"acid gas","SO2","2010-03-14T19:00:00","0.014","6","ppm @ 7% O2","6","6.1","9780"]
[68029,"BLR1","Unit_1",2027,"acid gas","SO2","2010-03-14T20:00:00","0.016","6","ppm @ 7% O2","6","6","9780"]
[68029,"BLR1","Unit_1",2027,"acid gas","SO2","2010-03-14T21:00:00","0.014","5","ppm @ 7% O2","5","6","9780"]
[68029,"BLR1","Unit_1",2027,"acid gas","SO2","2010-03-14T22:00:00","0.014","6","ppm @ 7% O2","6","6","9780"]
[68029,"BLR1","Unit_1",2027,"acid gas","SO2","2010-03-14T23:00:00","0.009","6","ppm @ 7% O2","6","6","9780"]
[68029,"BLR1","Unit_1",2027,"acid gas","SO2","2010-03-15","0.006","4","ppm @ 7% O2","4","6","9780"]
[68029,"BLR1","Unit_1",2027,"acid gas","SO2","2010-03-15T01:00:00","0.009","4","ppm @ 7% O2","4","6","9780"]
[68029,"BLR1","Unit_1",2027,"acid gas","SO2","2010-03-15T02:00:00","0.016","3","ppm @ 7% O2","3","6.1","9780"]
[68029,"BLR1","Unit_1",2027,"acid gas","SO2","2010-03-15T03:00:00","0.016","5","ppm @ 7% O2","5","6.1","9780"]
[68029,"BLR1","Unit_1",2027,"acid gas","SO2","2010-03-15T04:00:00","0.003","5","ppm @ 7% O2","5","6.1","9780"]
[68029,"BLR1","Unit_1",2027,"acid gas","SO2","2010-03-15T05:00:00","0.015","5","ppm @ 7% O2","5","6.1","9780"]
[68029,"BLR1","Unit_1",2027,"acid gas","SO2","2010-03-15T06:00:00","0.020","5","ppm @ 7% O2","5","6","9780"]
[68029,"BLR1","Unit_1",2027,"acid gas","SO2","2010-03-15T07:00:00","0.007","5","ppm @ 7% O2","5","6","9780"]
[68029,"BLR1","Unit_1",2027,"acid gas","SO2","2010-03-15T08:00:00","0.013","5","ppm @ 7% O2","5","6.1","9780"]
[68029,"BLR1","Unit_1",2027,"acid gas","SO2","2010-03-15T09:00:00","0.019","6","ppm @ 7% O2","6","6.1","9780"]
[68029,"BLR1","Unit_1",2027,"acid gas","SO2","2010-03-15T10:00:00","0.012","6","ppm @ 7% O2","6","6.1","9780"]
[68029,"BLR1","Unit_1",2027,"acid gas","SO2","2010-03-15T11:00:00","0.012","6","ppm @ 7% O2","6","6.2","9780"]
[68029,"BLR1","Unit_1",2027,"acid gas","SO2","2010-03-15T12:00:00","0.019","6","ppm @ 7% O2","6","6.2","9780"]
[68029,"BLR1","Unit_1",2027,"acid gas","SO2","2010-03-15T13:00:00","0.014","6","ppm @ 7% O2","6","6.3","9780"]
[68029,"BLR1","Unit_1",2027,"acid gas","SO2","2010-03-15T14:00:00","0.010","6","ppm @ 7% O2","6","6.3","9780"]
[68029,"BLR1","Unit_1",2027,"acid gas","SO2","2010-03-15T15:00:00","0.022","6","ppm @ 7% O2","6","6.3","9780"]
[68029,"BLR1","Unit_1",2027,"acid gas","SO2","2010-03-15T16:00:00","0.009","6","ppm @ 7% O2","6","6.3","9780"]
[68029,"BLR1","Unit_1",2027,"acid gas","SO2","2010-03-15T17:00:00","0.010","5","ppm @ 7% O2","5","6.3","9780"]
[68029,"BLR1","Unit_1",2027,"acid gas","SO2","2010-03-15T18:00:00","0.010","5","ppm @ 7% O2","5","6.3","9780"]
[68029,"BLR1","Unit_1",2027,"acid gas","SO2","2010-03-15T19:00:00","0.016","4","ppm @ 7% O2","4","6.3","9780"]
[68029,"BLR1","Unit_1",2027,"acid gas","SO2","2010-03-15T20:00:00","0.013","5","ppm @ 7% O2","5","6.4","9780"]
[68029,"BLR1","Unit_1",2027,"acid gas","SO2","2010-03-15T21:00:00","0.017","6","ppm @ 7% O2","6","6.4","9780"]
[68029,"BLR1","Unit_1",2027,"acid gas","SO2","2010-03-15T22:00:00","0.018","7","ppm @ 7% O2","7","6.4","9780"]
[68029,"BLR1","Unit_1",2027,"acid gas","SO2","2010-03-15T23:00:00","0.017","7","ppm @ 7% O2","7","6.4","9780"]
[68029,"BLR1","Unit_1",2027,"acid gas","SO2","2010-03-16","0.013","7","ppm @ 7% O2","7","6.3","9780"]
[68029,"BLR1","Unit_1",2027,"acid gas","SO2","2010-03-16T01:00:00","0.018","6","ppm @ 7% O2","6","6.3","9780"]
[68029,"BLR1","Unit_1",2027,"acid gas","SO2","2010-03-16T02:00:00","0.014","6","ppm @ 7% O2","6","6.4","9780"]
[68029,"BLR1","Unit_1",2027,"acid gas","SO2","2010-03-16T03:00:00","0.016","6","ppm @ 7% O2","6","6.5","9780"]
[68029,"BLR1","Unit_1",2027,"acid gas","SO2","2010-03-16T04:00:00","0.017","7","ppm @ 7% O2","7","6.5","9780"]
[68029,"BLR1","Unit_1",2027,"acid gas","SO2","2010-03-16T05:00:00","0.013","6","ppm @ 7% O2","6","6.4","9780"]
[68029,"BLR1","Unit_1",2027,"acid gas","SO2","2010-03-16T06:00:00","0.002","5","ppm @ 7% O2","5","6.4","9780"]
[68029,"BLR1","Unit_1",2027,"acid gas","SO2","2010-03-16T07:00:00","0.002","3","ppm @ 7% O2","3","6.3","9780"]
[68029,"BLR1","Unit_1",2027,"acid gas","SO2","2010-03-16T08:00:00","0.003","2","ppm @ 7% O2","2","6.3","9780"]
[68029,"BLR1","Unit_1",2027,"acid gas","SO2","2010-03-16T09:00:00","0.012","1","ppm @ 7% O2","1","6.3","9780"]
[68029,"BLR1","Unit_1",2027,"acid gas","SO2","2010-03-16T10:00:00","0.021","4","ppm @ 7% O2","4","6.2","9780"]
[68029,"BLR1","Unit_1",2027,"acid gas","SO2","2010-03-16T11:00:00","0.001","5","ppm @ 7% O2","5","6.2","9780"]
[68029,"BLR1","Unit_1",2027,"acid gas","SO2","2010-03-16T12:00:00","0.001","4","ppm @ 7% O2","4","6.2","9780"]
[68029,"BLR1","Unit_1",2027,"acid gas","SO2","2010-03-16T13:00:00","0.007","2","ppm @ 7% O2","2","6.1","9780"]
[68029,"BLR1","Unit_1",2027,"acid gas","SO2","2010-03-16T14:00:00","0.012","2","ppm @ 7% O2","2","6.2","9780"]
[68029,"BLR1","Unit_1",2027,"acid gas","SO2","2010-03-16T15:00:00","0.006","3","ppm @ 7% O2","3","6.2","9780"]
[68029,"BLR1","Unit_1",2027,"acid gas","SO2","2010-03-16T16:00:00","0.005","3","ppm @ 7% O2","3","6.2","9780"]
[68029,"BLR1","Unit_1",2027,"acid gas","SO2","2010-03-16T17:00:00","0.015","3","ppm @ 7% O2","3","6.2","9780"]
[68029,"BLR1","Unit_1",2027,"acid gas","SO2","2010-03-16T18:00:00","0.014","4","ppm @ 7% O2","4","6.3","9780"]
[68029,"BLR1","Unit_1",2027,"acid gas","SO2","2010-03-16T19:00:00","0.008","5","ppm @ 7% O2","5","6.3","9780"]
[68029,"BLR1","Unit_1",2027,"acid gas","SO2","2010-03-16T20:00:00","0.011","4","ppm @ 7% O2","4","6.4","9780"]
[68029,"BLR1","Unit_1",2027,"acid gas","SO2","2010-03-16T21:00:00","0.006","4","ppm @ 7% O2","4","6.3","9780"]
[68029,"BLR1","Unit_1",2027,"acid gas","SO2","2010-03-16T22:00:00","0.014","4","ppm @ 7% O2","4","6.3","9780"]
[68029,"BLR1","Unit_1",2027,"acid gas","SO2","2010-03-16T23:00:00","0.012","4","ppm @ 7% O2","4","6.3","9780"]
[68029,{"$f":"IF(D1109=2027,\"BLR1\",\"BLR2\")","v":"BLR1"},{"$f":"IF(D1109=2027,\"Unit_1\",\"Unit_2\")","v":"Unit_1"},2027,"acid gas","SO2","2010-03-17","0.015","5","ppm @ 7% O2","5","6.3","9780"]
[68029,"BLR1","Unit_1",2027,"acid gas","SO2","2010-03-17T01:00:00","0.015","5","ppm @ 7% O2","5","6.3","9780"]
[68029,"BLR1","Unit_1",2027,"acid gas","SO2","2010-03-17T02:00:00","0.008","6","ppm @ 7% O2","6","6.3","9780"]
[68029,"BLR1","Unit_1",2027,"acid gas","SO2","2010-03-17T03:00:00","0.007","4","ppm @ 7% O2","4","6.3","9780"]
[68029,"BLR1","Unit_1",2027,"acid gas","SO2","2010-03-17T04:00:00","0.007","4","ppm @ 7% O2","4","6.3","9780"]
[68029,"BLR1","Unit_1",2027,"acid gas","SO2","2010-03-17T05:00:00","0.008","3","ppm @ 7% O2","3","6.3","9780"]
[68029,"BLR1","Unit_1",2027,"acid gas","SO2","2010-03-17T06:00:00","0.017","4","ppm @ 7% O2","4","6.1","9780"]
[68029,"BLR1","Unit_1",2027,"acid gas","SO2","2010-03-17T07:00:00","0.008","4","ppm @ 7% O2","4","6","9780"]
[68029,"BLR1","Unit_1",2027,"acid gas","SO2","2010-03-17T08:00:00","0.008","4","ppm @ 7% O2","4","5.9","9780"]
[68029,"BLR1","Unit_1",2027,"acid gas","SO2","2010-03-17T09:00:00","0.010","4","ppm @ 7% O2","4","6","9780"]
[68029,"BLR1","Unit_1",2027,"acid gas","SO2","2010-03-17T10:00:00","0.001","3","ppm @ 7% O2","3","5.9","9780"]
[68029,"BLR1","Unit_1",2027,"acid gas","SO2","2010-03-17T11:00:00","0.001","2","ppm @ 7% O2","2","5.9","9780"]
[68029,"BLR1","Unit_1",2027,"acid gas","SO2","2010-03-17T12:00:00","0.001","1","ppm @ 7% O2","1","5.9","9780"]
[68029,"BLR1","Unit_1",2027,"acid gas","SO2","2010-03-17T13:00:00","0.001","0","ppm @ 7% O2","0","5.9","9780"]
[68029,"BLR1","Unit_1",2027,"acid gas","SO2","2010-03-17T14:00:00","0.009","1","ppm @ 7% O2","1","5.8","9780"]
[68029,"BLR1","Unit_1",2027,"acid gas","SO2","2010-03-17T15:00:00","0.013","3","ppm @ 7% O2","3","5.9","9780"]
[68029,"BLR1","Unit_1",2027,"acid gas","SO2","2010-03-17T16:00:00","0.008","4","ppm @ 7% O2","4","5.8","9780"]
[68029,"BLR1","Unit_1",2027,"acid gas","SO2","2010-03-17T17:00:00","0.016","5","ppm @ 7% O2","5","5.9","9780"]
[68029,"BLR1","Unit_1",2027,"acid gas","SO2","2010-03-17T18:00:00","0.010","5","ppm @ 7% O2","5","5.8","9780"]
[68029,"BLR1","Unit_1",2027,"acid gas","SO2","2010-03-17T19:00:00","0.019","5","ppm @ 7% O2","5","5.8","9780"]
[68029,"BLR1","Unit_1",2027,"acid gas","SO2","2010-03-17T20:00:00","0.012","6","ppm @ 7% O2","6","5.8","9780"]
[68029,"BLR1","Unit_1",2027,"acid gas","SO2","2010-03-17T21:00:00","0.012","6","ppm @ 7% O2","6","5.8","9780"]
[68029,"BLR1","Unit_1",2027,"acid gas","SO2","2010-03-17T22:00:00","0.020","6","ppm @ 7% O2","6","5.8","9780"]
[68029,"BLR1","Unit_1",2027,"acid gas","SO2","2010-03-17T23:00:00","0.009","6","ppm @ 7% O2","6","5.8","9780"]
[68029,"BLR1","Unit_1",2027,"acid gas","SO2","2010-03-18","0.012","6","ppm @ 7% O2","6","5.9","9780"]
[68029,"BLR1","Unit_1",2027,"acid gas","SO2","2010-03-18T01:00:00","0.018","6","ppm @ 7% O2","6","5.9","9780"]
[68029,"BLR1","Unit_1",2027,"acid gas","SO2","2010-03-18T02:00:00","0.010","5","ppm @ 7% O2","5","5.9","9780"]
[68029,"BLR1","Unit_1",2027,"acid gas","SO2","2010-03-18T03:00:00","0.009","5","ppm @ 7% O2","5","5.8","9780"]
[68029,"BLR1","Unit_1",2027,"acid gas","SO2","2010-03-18T04:00:00","0.015","5","ppm @ 7% O2","5","5.8","9780"]
[68029,"BLR1","Unit_1",2027,"acid gas","SO2","2010-03-18T05:00:00","0.016","5","ppm @ 7% O2","5","5.8","9780"]
[68029,"BLR1","Unit_1",2027,"acid gas","SO2","2010-03-18T06:00:00","0.015","6","ppm @ 7% O2","6","5.9","9780"]
[68029,"BLR1","Unit_1",2027,"acid gas","SO2","2010-03-18T07:00:00","0.016","7","ppm @ 7% O2","7","6","9780"]
[68029,"BLR1","Unit_1",2027,"acid gas","SO2","2010-03-18T08:00:00","0.001","5","ppm @ 7% O2","5","5.1","9780"]
[68029,"BLR1","Unit_1",2027,"acid gas","SO2","2010-03-18T09:00:00","0.012","4","ppm @ 7% O2","4","5.5","9780"]
[68029,"BLR1","Unit_1",2027,"acid gas","SO2","2010-03-18T10:00:00","0.011","3","ppm @ 7% O2","3","5.6","9780"]
[68029,"BLR1","Unit_1",2027,"acid gas","SO2","2010-03-18T11:00:00","0.019","5","ppm @ 7% O2","5","5.7","9780"]
[68029,"BLR1","Unit_1",2027,"acid gas","SO2","2010-03-18T12:00:00","0.012","6","ppm @ 7% O2","6","5.8","9780"]
[68029,"BLR1","Unit_1",2027,"acid gas","SO2","2010-03-18T13:00:00","0.017","6","ppm @ 7% O2","6","5.8","9780"]
[68029,"BLR1","Unit_1",2027,"acid gas","SO2","2010-03-18T14:00:00","0.013","6","ppm @ 7% O2","6","5.7","9780"]
[68029,"BLR1","Unit_1",2027,"acid gas","SO2","2010-03-18T15:00:00","0.001","5","ppm @ 7% O2","5","5.8","9780"]
[68029,"BLR1","Unit_1",2027,"acid gas","SO2","2010-03-18T16:00:00","0.000","3","ppm @ 7% O2","3","1.4","9780"]
[68029,"BLR1","Unit_1",2027,"acid gas","SO2","2010-03-18T17:00:00","0.000","1","ppm @ 7% O2","1","0.0DN","9780"]
[68029,"BLR1","Unit_1",2027,"acid gas","SO2","2010-03-18T18:00:00","0.000","0","ppm @ 7% O2","0","0.0DN","9780"]
[68029,"BLR1","Unit_1",2027,"acid gas","SO2","2010-03-18T19:00:00","0.000","0","ppm @ 7% O2","0","0.0DN","9780"]
[68029,"BLR1","Unit_1",2027,"acid gas","SO2","2010-03-18T20:00:00","0.000","0","ppm @ 7% O2","0","0.0DN","9780"]
[68029,"BLR1","Unit_1",2027,"acid gas","SO2","2010-03-18T21:00:00","0.000","0","ppm @ 7% O2","0","0.0DN","9780"]
[68029,"BLR1","Unit_1",2027,"acid gas","SO2","2010-03-18T22:00:00","0.000","0","ppm @ 7% O2","0","0.0DN","9780"]
[68029,"BLR1","Unit_1",2027,"acid gas","SO2","2010-03-18T23:00:00","0.000","0","ppm @ 7% O2","0","0.0DN","9780"]
[68029,"BLR1","Unit_1",2027,"acid gas","SO2","2010-03-19","0.000","0","ppm @ 7% O2","0","0.0DN","9780"]
[68029,"BLR1","Unit_1",2027,"acid gas","SO2","2010-03-19T01:00:00","0.000","0","ppm @ 7% O2","0","0.0DN","9780"]
[68029,"BLR1","Unit_1",2027,"acid gas","SO2","2010-03-19T02:00:00","0.000","0","ppm @ 7% O2","0","0.0DN","9780"]
[68029,"BLR1","Unit_1",2027,"acid gas","SO2","2010-03-19T03:00:00","0.000","0","ppm @ 7% O2","0","0.0DN","9780"]
[68029,"BLR1","Unit_1",2027,"acid gas","SO2","2010-03-19T04:00:00","0.000","0","ppm @ 7% O2","0","0.0DN","9780"]
[68029,"BLR1","Unit_1",2027,"acid gas","SO2","2010-03-19T05:00:00","0.000","0","ppm @ 7% O2","0","0.0DN","9780"]
[68029,"BLR1","Unit_1",2027,"acid gas","SO2","2010-03-19T06:00:00","0.000","0","ppm @ 7% O2","0","0.0DN","9780"]
[68029,"BLR1","Unit_1",2027,"acid gas","SO2","2010-03-19T07:00:00","0.000","0","ppm @ 7% O2","0","0.0DN","9780"]
[68029,"BLR1","Unit_1",2027,"acid gas","SO2","2010-03-19T08:00:00","0.000","0","ppm @ 7% O2","0","0.0DN","9780"]
[68029,"BLR1","Unit_1",2027,"acid gas","SO2","2010-03-19T09:00:00","0.000","0","ppm @ 7% O2","0","0.0DN","9780"]
[68029,"BLR1","Unit_1",2027,"acid gas","SO2","2010-03-19T10:00:00","0.000","0","ppm @ 7% O2","0","0.0DN","9780"]
[68029,"BLR1","Unit_1",2027,"acid gas","SO2","2010-03-19T11:00:00","0.000","0","ppm @ 7% O2","0","0.0DN","9780"]
[68029,"BLR1","Unit_1",2027,"acid gas","SO2","2010-03-19T12:00:00","0.000","0","ppm @ 7% O2","0","0.0DN","9780"]
[68029,"BLR1","Unit_1",2027,"acid gas","SO2","2010-03-19T13:00:00","0.000","0","ppm @ 7% O2","0","0.0DN","9780"]
[68029,"BLR1","Unit_1",2027,"acid gas","SO2","2010-03-19T14:00:00","0.000","0","ppm @ 7% O2","0","0.0DN","9780"]
[68029,"BLR1","Unit_1",2027,"acid gas","SO2","2010-03-19T15:00:00","0.000","0","ppm @ 7% O2","0","0.0DN","9780"]
[68029,{"$f":"IF(D1173=2027,\"BLR1\",\"BLR2\")","v":"BLR1"},{"$f":"IF(D1173=2027,\"Unit_1\",\"Unit_2\")","v":"Unit_1"},2027,"acid gas","SO2","2010-03-19T16:00:00","0.000","0","ppm @ 7% O2","0","0.0DN","9780"]
[68029,"BLR1","Unit_1",2027,"acid gas","SO2","2010-03-19T17:00:00","0.000","0","ppm @ 7% O2","0","0.0DN","9780"]
[68029,"BLR1","Unit_1",2027,"acid gas","SO2","2010-03-19T18:00:00","0.000","0","ppm @ 7% O2","0","0.0DN","9780"]
[68029,"BLR1","Unit_1",2027,"acid gas","SO2","2010-03-19T19:00:00","0.000","0","ppm @ 7% O2","0","0.0DN","9780"]
[68029,"BLR1","Unit_1",2027,"acid gas","SO2","2010-03-19T20:00:00","0.000","0","ppm @ 7% O2","0","0.0DN","9780"]
[68029,"BLR1","Unit_1",2027,"acid gas","SO2","2010-03-19T21:00:00","0.000","0","ppm @ 7% O2","0","0.0DN","9780"]
[68029,"BLR1","Unit_1",2027,"acid gas","SO2","2010-03-19T22:00:00","0.000","0","ppm @ 7% O2","0","0.0DN","9780"]
[68029,"BLR1","Unit_1",2027,"acid gas","SO2","2010-03-19T23:00:00","0.000","0","ppm @ 7% O2","0","0.0DN","9780"]
[68029,"BLR1","Unit_1",2027,"acid gas","SO2","2010-03-20","0.000","0","ppm @ 7% O2","0","0.0DN","9780"]
[68029,"BLR1","Unit_1",2027,"acid gas","SO2","2010-03-20T01:00:00","0.000","0","ppm @ 7% O2","0","0.0DN","9780"]
[68029,"BLR1","Unit_1",2027,"acid gas","SO2","2010-03-20T02:00:00","0.000","0","ppm @ 7% O2","0","0.0DN","9780"]
[68029,"BLR1","Unit_1",2027,"acid gas","SO2","2010-03-20T03:00:00","0.000","0","ppm @ 7% O2","0","0.0DN","9780"]
[68029,"BLR1","Unit_1",2027,"acid gas","SO2","2010-03-20T04:00:00","0.000","0","ppm @ 7% O2","0","0.0DN","9780"]
[68029,"BLR1","Unit_1",2027,"acid gas","SO2","2010-03-20T05:00:00","0.000","0","ppm @ 7% O2","0","0.0DN","9780"]
[68029,"BLR1","Unit_1",2027,"acid gas","SO2","2010-03-20T06:00:00","0.000","0","ppm @ 7% O2","0","0.0DN","9780"]
[68029,"BLR1","Unit_1",2027,"acid gas","SO2","2010-03-20T07:00:00","0.000","0","ppm @ 7% O2","0","0.0DN","9780"]
[68029,"BLR1","Unit_1",2027,"acid gas","SO2","2010-03-20T08:00:00","0.000","0","ppm @ 7% O2","0","0.0DN","9780"]
[68029,"BLR1","Unit_1",2027,"acid gas","SO2","2010-03-20T09:00:00","0.000","0","ppm @ 7% O2","0","0.0DN","9780"]
[68029,"BLR1","Unit_1",2027,"acid gas","SO2","2010-03-20T10:00:00","0.000","0","ppm @ 7% O2","0","0.0DN","9780"]
[68029,"BLR1","Unit_1",2027,"acid gas","SO2","2010-03-20T11:00:00","0.000","0","ppm @ 7% O2","0","0.0DN","9780"]
[68029,"BLR1","Unit_1",2027,"acid gas","SO2","2010-03-20T12:00:00","0.000","0","ppm @ 7% O2","0","0.0DN","9780"]
[68029,"BLR1","Unit_1",2027,"acid gas","SO2","2010-03-20T13:00:00","0.000","0","ppm @ 7% O2","0","0.0DN","9780"]
[68029,"BLR1","Unit_1",2027,"acid gas","SO2","2010-03-20T14:00:00","0.000","0","ppm @ 7% O2","0","0.0DN","9780"]
[68029,"BLR1","Unit_1",2027,"acid gas","SO2","2010-03-20T15:00:00","0.000","0","ppm @ 7% O2","0","0.0DN","9780"]
[68029,"BLR1","Unit_1",2027,"acid gas","SO2","2010-03-20T16:00:00","0.000","0","ppm @ 7% O2","0","0.0DN","9780"]
[68029,"BLR1","Unit_1",2027,"acid gas","SO2","2010-03-20T17:00:00","0.000","0","ppm @ 7% O2","0","0.0DN","9780"]
[68029,"BLR1","Unit_1",2027,"acid gas","SO2","2010-03-20T18:00:00","0.000","0","ppm @ 7% O2","0","0.0DN","9780"]
[68029,"BLR1","Unit_1",2027,"acid gas","SO2","2010-03-20T19:00:00","0.000","0","ppm @ 7% O2","0","0.0DN","9780"]
[68029,"BLR1","Unit_1",2027,"acid gas","SO2","2010-03-20T20:00:00","0.000","0","ppm @ 7% O2","0","0.0DN","9780"]
[68029,"BLR1","Unit_1",2027,"acid gas","SO2","2010-03-20T21:00:00","0.000","0","ppm @ 7% O2","0","0.0DN","9780"]
[68029,"BLR1","Unit_1",2027,"acid gas","SO2","2010-03-20T22:00:00","0.000","0","ppm @ 7% O2","0","0.0DN","9780"]
[68029,"BLR1","Unit_1",2027,"acid gas","SO2","2010-03-20T23:00:00","0.000","0","ppm @ 7% O2","0","0.0DN","9780"]
[68029,"BLR1","Unit_1",2027,"acid gas","SO2","2010-03-21","0.000","0","ppm @ 7% O2","0","0.0DN","9780"]
[68029,"BLR1","Unit_1",2027,"acid gas","SO2","2010-03-21T01:00:00","0.000","0","ppm @ 7% O2","0","0.0DN","9780"]
[68029,"BLR1","Unit_1",2027,"acid gas","SO2","2010-03-21T02:00:00","0.000","0","ppm @ 7% O2","0","0.0DN","9780"]
[68029,"BLR1","Unit_1",2027,"acid gas","SO2","2010-03-21T03:00:00","0.000","0","ppm @ 7% O2","0","0.0DN","9780"]
[68029,"BLR1","Unit_1",2027,"acid gas","SO2","2010-03-21T04:00:00","0.000","0","ppm @ 7% O2","0","0.0DN","9780"]
[68029,"BLR1","Unit_1",2027,"acid gas","SO2","2010-03-21T05:00:00","0.000","0","ppm @ 7% O2","0","0.0DN","9780"]
[68029,"BLR1","Unit_1",2027,"acid gas","SO2","2010-03-21T06:00:00","0.000","0","ppm @ 7% O2","0","0.0DN","9780"]
[68029,"BLR1","Unit_1",2027,"acid gas","SO2","2010-03-21T07:00:00","0.000","0","ppm @ 7% O2","0","0.0DN","9780"]
[68029,"BLR1","Unit_1",2027,"acid gas","SO2","2010-03-21T08:00:00","0.000","0","ppm @ 7% O2","0","0.0DN","9780"]
[68029,"BLR1","Unit_1",2027,"acid gas","SO2","2010-03-21T09:00:00","0.000","0","ppm @ 7% O2","0","0.0DN","9780"]
[68029,"BLR1","Unit_1",2027,"acid gas","SO2","2010-03-21T10:00:00","0.000","0","ppm @ 7% O2","0","0.0DN","9780"]
[68029,"BLR1","Unit_1",2027,"acid gas","SO2","2010-03-21T11:00:00","0.000","0","ppm @ 7% O2","0","0.0DN","9780"]
[68029,"BLR1","Unit_1",2027,"acid gas","SO2","2010-03-21T12:00:00","0.000","0","ppm @ 7% O2","0","0.0DN","9780"]
[68029,"BLR1","Unit_1",2027,"acid gas","SO2","2010-03-21T13:00:00","0.000","0","ppm @ 7% O2","0","0.0DN","9780"]
[68029,"BLR1","Unit_1",2027,"acid gas","SO2","2010-03-21T14:00:00","0.000","0","ppm @ 7% O2","0","0.0DN","9780"]
[68029,"BLR1","Unit_1",2027,"acid gas","SO2","2010-03-21T15:00:00","0.000","0","ppm @ 7% O2","0","0.0DN","9780"]
[68029,"BLR1","Unit_1",2027,"acid gas","SO2","2010-03-21T16:00:00","0.000","0","ppm @ 7% O2","0","0.0DN","9780"]
[68029,"BLR1","Unit_1",2027,"acid gas","SO2","2010-03-21T17:00:00","0.000","0","ppm @ 7% O2","0","0.0DN","9780"]
[68029,"BLR1","Unit_1",2027,"acid gas","SO2","2010-03-21T18:00:00","0.000","0","ppm @ 7% O2","0","0.0DN","9780"]
[68029,"BLR1","Unit_1",2027,"acid gas","SO2","2010-03-21T19:00:00","0.000","0","ppm @ 7% O2","0","0.0DN","9780"]
[68029,"BLR1","Unit_1",2027,"acid gas","SO2","2010-03-21T20:00:00","0.000","0","ppm @ 7% O2","0","0.0DN","9780"]
[68029,"BLR1","Unit_1",2027,"acid gas","SO2","2010-03-21T21:00:00","0.000","0","ppm @ 7% O2","0","0.0DN","9780"]
[68029,"BLR1","Unit_1",2027,"acid gas","SO2","2010-03-21T22:00:00","0.000","0","ppm @ 7% O2","0","0.0DN","9780"]
[68029,"BLR1","Unit_1",2027,"acid gas","SO2","2010-03-21T23:00:00","0.000","0","ppm @ 7% O2","0","0.0DN","9780"]
[68029,"BLR1","Unit_1",2027,"acid gas","SO2","2010-03-22","0.000","0","ppm @ 7% O2","0","0.0DN","9780"]
[68029,"BLR1","Unit_1",2027,"acid gas","SO2","2010-03-22T01:00:00","0.000","0","ppm @ 7% O2","0","0.0DN","9780"]
[68029,"BLR1","Unit_1",2027,"acid gas","SO2","2010-03-22T02:00:00","0.000","0","ppm @ 7% O2","0","0.0DN","9780"]
[68029,"BLR1","Unit_1",2027,"acid gas","SO2","2010-03-22T03:00:00","0.000","0","ppm @ 7% O2","0","0.0DN","9780"]
[68029,"BLR1","Unit_1",2027,"acid gas","SO2","2010-03-22T04:00:00","0.000","0","ppm @ 7% O2","0","0.0DN","9780"]
[68029,"BLR1","Unit_1",2027,"acid gas","SO2","2010-03-22T05:00:00","0.000","0","ppm @ 7% O2","0","0.0DN","9780"]
[68029,"BLR1","Unit_1",2027,"acid gas","SO2","2010-03-22T06:00:00","0.000","0","ppm @ 7% O2","0","0.0DN","9780"]
[68029,"BLR1","Unit_1",2027,"acid gas","SO2","2010-03-22T07:00:00","0.000","0","ppm @ 7% O2","0","0.0DN","9780"]
[68029,{"$f":"IF(D1237=2027,\"BLR1\",\"BLR2\")","v":"BLR1"},{"$f":"IF(D1237=2027,\"Unit_1\",\"Unit_2\")","v":"Unit_1"},2027,"acid gas","SO2","2010-03-22T08:00:00","0.000","0","ppm @ 7% O2","0","0.0DN","9780"]
[68029,"BLR1","Unit_1",2027,"acid gas","SO2","2010-03-22T09:00:00","0.000","0","ppm @ 7% O2","0","0.0DN","9780"]
[68029,"BLR1","Unit_1",2027,"acid gas","SO2","2010-03-22T10:00:00","0.000","0","ppm @ 7% O2","0","0.0DN","9780"]
[68029,"BLR1","Unit_1",2027,"acid gas","SO2","2010-03-22T11:00:00","0.000","0","ppm @ 7% O2","0","0.0DN","9780"]
[68029,"BLR1","Unit_1",2027,"acid gas","SO2","2010-03-22T12:00:00","0.000","0","ppm @ 7% O2","0","0.0DN","9780"]
[68029,"BLR1","Unit_1",2027,"acid gas","SO2","2010-03-22T13:00:00","0.000","0","ppm @ 7% O2","0","0.0DN","9780"]
[68029,"BLR1","Unit_1",2027,"acid gas","SO2","2010-03-22T14:00:00","0.000","0","ppm @ 7% O2","0","0.0DN","9780"]
[68029,"BLR1","Unit_1",2027,"acid gas","SO2","2010-03-22T15:00:00","0.000","0","ppm @ 7% O2","0","0.0DN","9780"]
[68029,"BLR1","Unit_1",2027,"acid gas","SO2","2010-03-22T16:00:00","0.000","0","ppm @ 7% O2","0","0.0DN","9780"]
[68029,"BLR1","Unit_1",2027,"acid gas","SO2","2010-03-22T17:00:00","0.000","0","ppm @ 7% O2","0","0.0DN","9780"]
[68029,"BLR1","Unit_1",2027,"acid gas","SO2","2010-03-22T18:00:00","0.000","0","ppm @ 7% O2","0","0.0DN","9780"]
[68029,"BLR1","Unit_1",2027,"acid gas","SO2","2010-03-22T19:00:00","0.000","0","ppm @ 7% O2","0","0.0DN","9780"]
[68029,"BLR1","Unit_1",2027,"acid gas","SO2","2010-03-22T20:00:00","0.000","0","ppm @ 7% O2","0","0.0DN","9780"]
[68029,"BLR1","Unit_1",2027,"acid gas","SO2","2010-03-22T21:00:00","0.000","0","ppm @ 7% O2","0","0.0DN","9780"]
[68029,"BLR1","Unit_1",2027,"acid gas","SO2","2010-03-22T22:00:00","0.000","0","ppm @ 7% O2","0","0.0DN","9780"]
[68029,"BLR1","Unit_1",2027,"acid gas","SO2","2010-03-22T23:00:00","0.000","0","ppm @ 7% O2","0","0.0DN","9780"]
[68029,"BLR1","Unit_1",2027,"acid gas","SO2","2010-03-23","0.000","0","ppm @ 7% O2","0","0.0DN","9780"]
[68029,"BLR1","Unit_1",2027,"acid gas","SO2","2010-03-23T01:00:00","0.000","0","ppm @ 7% O2","0","0.0DN","9780"]
[68029,"BLR1","Unit_1",2027,"acid gas","SO2","2010-03-23T02:00:00","0.000","0","ppm @ 7% O2","0","0.9","9780"]
[68029,"BLR1","Unit_1",2027,"acid gas","SO2","2010-03-23T03:00:00","0.000","0","ppm @ 7% O2","0","0.1","9780"]
[68029,"BLR1","Unit_1",2027,"acid gas","SO2","2010-03-23T04:00:00","0.000","0","ppm @ 7% O2","0","9.9","9780"]
[68029,"BLR1","Unit_1",2027,"acid gas","SO2","2010-03-23T05:00:00","0.000","0","ppm @ 7% O2","0","9.6","9780"]
[68029,"BLR1","Unit_1",2027,"acid gas","SO2","2010-03-23T06:00:00","0.000","1","ppm @ 7% O2","1","9.4","9780"]
[68029,"BLR1","Unit_1",2027,"acid gas","SO2","2010-03-23T07:00:00","0.036","6","ppm @ 7% O2","6","9.2","9780"]
[68029,"BLR1","Unit_1",2027,"acid gas","SO2","2010-03-23T08:00:00","0.050","12","ppm @ 7% O2","12","8.5","9780"]
[68029,"BLR1","Unit_1",2027,"acid gas","SO2","2010-03-23T09:00:00","0.050","17","ppm @ 7% O2","17","8","9780"]
[68029,"BLR1","Unit_1",2027,"acid gas","SO2","2010-03-23T10:00:00","0.050","20","ppm @ 7% O2","20","7.8","9780"]
[68029,"BLR1","Unit_1",2027,"acid gas","SO2","2010-03-23T11:00:00","0.050","20","ppm @ 7% O2","20","7.6","9780"]
[68029,"BLR1","Unit_1",2027,"acid gas","SO2","2010-03-23T12:00:00","0.050","20","ppm @ 7% O2","20","7.4","9780"]
[68029,"BLR1","Unit_1",2027,"acid gas","SO2","2010-03-23T13:00:00","0.050","20","ppm @ 7% O2","20","6.7","9780"]
[68029,"BLR1","Unit_1",2027,"acid gas","SO2","2010-03-23T14:00:00","0.014","18","ppm @ 7% O2","18","5.5","9780"]
[68029,"BLR1","Unit_1",2027,"acid gas","SO2","2010-03-23T15:00:00","0.006","12","ppm @ 7% O2","12","4.2","9780"]
[68029,"BLR1","Unit_1",2027,"acid gas","SO2","2010-03-23T16:00:00","0.005","6","ppm @ 7% O2","6","3.7","9780"]
[68029,"BLR1","Unit_1",2027,"acid gas","SO2","2010-03-23T17:00:00","0.004","2","ppm @ 7% O2","2","2.8","9780"]
[68029,"BLR1","Unit_1",2027,"acid gas","SO2","2010-03-23T18:00:00","0.004","2","ppm @ 7% O2","2","2.4","9780"]
[68029,"BLR1","Unit_1",2027,"acid gas","SO2","2010-03-23T19:00:00","0.003","2","ppm @ 7% O2","2","1.5","9780"]
[68029,"BLR1","Unit_1",2027,"acid gas","SO2","2010-03-23T20:00:00","0.002","1","ppm @ 7% O2","1","9.7","9780"]
[68029,"BLR1","Unit_1",2027,"acid gas","SO2","2010-03-23T21:00:00","0.002","1","ppm @ 7% O2","1","9.6","9780"]
[68029,"BLR1","Unit_1",2027,"acid gas","SO2","2010-03-23T22:00:00","0.002","1","ppm @ 7% O2","1","9.8","9780"]
[68029,"BLR1","Unit_1",2027,"acid gas","SO2","2010-03-23T23:00:00","0.002","1","ppm @ 7% O2","1","9.9","9780"]
[68029,"BLR1","Unit_1",2027,"acid gas","SO2","2010-03-24","0.002","1","ppm @ 7% O2","1","9.9","9780"]
[68029,"BLR1","Unit_1",2027,"acid gas","SO2","2010-03-24T01:00:00","0.002","1","ppm @ 7% O2","1","0","9780"]
[68029,"BLR1","Unit_1",2027,"acid gas","SO2","2010-03-24T02:00:00","0.015","1","ppm @ 7% O2","1","9","9780"]
[68029,"BLR1","Unit_1",2027,"acid gas","SO2","2010-03-24T03:00:00","0.008","3","ppm @ 7% O2","3","7.8","9780"]
[68029,"BLR1","Unit_1",2027,"acid gas","SO2","2010-03-24T04:00:00","0.004","3","ppm @ 7% O2","3","7","9780"]
[68029,"BLR1","Unit_1",2027,"acid gas","SO2","2010-03-24T05:00:00","0.005","4","ppm @ 7% O2","4","7","9780"]
[68029,"BLR1","Unit_1",2027,"acid gas","SO2","2010-03-24T06:00:00","0.001","2","ppm @ 7% O2","2","6.9","9780"]
[68029,"BLR1","Unit_1",2027,"acid gas","SO2","2010-03-24T07:00:00","0.012","2","ppm @ 7% O2","2","6.9","9780"]
[68029,"BLR1","Unit_1",2027,"acid gas","SO2","2010-03-24T08:00:00","0.014","3","ppm @ 7% O2","3","6.8","9780"]
[68029,"BLR1","Unit_1",2027,"acid gas","SO2","2010-03-24T09:00:00","0.008","4","ppm @ 7% O2","4","6.7","9780"]
[68029,"BLR1","Unit_1",2027,"acid gas","SO2","2010-03-24T10:00:00","0.008","5","ppm @ 7% O2","5","6.3","9780"]
[68029,"BLR1","Unit_1",2027,"acid gas","SO2","2010-03-24T11:00:00","0.023","4","ppm @ 7% O2","4","6.1","9780"]
[68029,"BLR1","Unit_1",2027,"acid gas","SO2","2010-03-24T12:00:00","0.008","5","ppm @ 7% O2","5","5.3","9780"]
[68029,"BLR1","Unit_1",2027,"acid gas","SO2","2010-03-24T13:00:00","0.003","5","ppm @ 7% O2","5","5.5","9780"]
[68029,"BLR1","Unit_1",2027,"acid gas","SO2","2010-03-24T14:00:00","0.015","4","ppm @ 7% O2","4","5.7","9780"]
[68029,"BLR1","Unit_1",2027,"acid gas","SO2","2010-03-24T15:00:00","0.015","4","ppm @ 7% O2","4","5.7","9780"]
[68029,"BLR1","Unit_1",2027,"acid gas","SO2","2010-03-24T16:00:00","0.010","5","ppm @ 7% O2","5","5.8","9780"]
[68029,"BLR1","Unit_1",2027,"acid gas","SO2","2010-03-24T17:00:00","0.004","5","ppm @ 7% O2","5","5.8","9780"]
[68029,"BLR1","Unit_1",2027,"acid gas","SO2","2010-03-24T18:00:00","0.003","3","ppm @ 7% O2","3","5.8","9780"]
[68029,"BLR1","Unit_1",2027,"acid gas","SO2","2010-03-24T19:00:00","0.005","2","ppm @ 7% O2","2","5.8","9780"]
[68029,"BLR1","Unit_1",2027,"acid gas","SO2","2010-03-24T20:00:00","0.014","2","ppm @ 7% O2","2","5.9","9780"]
[68029,"BLR1","Unit_1",2027,"acid gas","SO2","2010-03-24T21:00:00","0.015","4","ppm @ 7% O2","4","5.9","9780"]
[68029,"BLR1","Unit_1",2027,"acid gas","SO2","2010-03-24T22:00:00","0.011","5","ppm @ 7% O2","5","5.8","9780"]
[68029,"BLR1","Unit_1",2027,"acid gas","SO2","2010-03-24T23:00:00","0.021","6","ppm @ 7% O2","6","5.9","9780"]
[68029,{"$f":"IF(D1301=2027,\"BLR1\",\"BLR2\")","v":"BLR1"},{"$f":"IF(D1301=2027,\"Unit_1\",\"Unit_2\")","v":"Unit_1"},2027,"acid gas","SO2","2010-03-25","0.010","6","ppm @ 7% O2","6","5.9","9780"]
[68029,"BLR1","Unit_1",2027,"acid gas","SO2","2010-03-25T01:00:00","0.015","6","ppm @ 7% O2","6","5.9","9780"]
[68029,"BLR1","Unit_1",2027,"acid gas","SO2","2010-03-25T02:00:00","0.014","6","ppm @ 7% O2","6","6","9780"]
[68029,"BLR1","Unit_1",2027,"acid gas","SO2","2010-03-25T03:00:00","0.020","6","ppm @ 7% O2","6","6","9780"]
[68029,"BLR1","Unit_1",2027,"acid gas","SO2","2010-03-25T04:00:00","0.006","6","ppm @ 7% O2","6","6","9780"]
[68029,"BLR1","Unit_1",2027,"acid gas","SO2","2010-03-25T05:00:00","0.002","5","ppm @ 7% O2","5","6","9780"]
[68029,"BLR1","Unit_1",2027,"acid gas","SO2","2010-03-25T06:00:00","0.014","3","ppm @ 7% O2","3","5.8","9780"]
[68029,"BLR1","Unit_1",2027,"acid gas","SO2","2010-03-25T07:00:00","0.015","3","ppm @ 7% O2","3","5.7","9780"]
[68029,"BLR1","Unit_1",2027,"acid gas","SO2","2010-03-25T08:00:00","0.009","5","ppm @ 7% O2","5","5.6","9780"]
[68029,"BLR1","Unit_1",2027,"acid gas","SO2","2010-03-25T09:00:00","0.008","5","ppm @ 7% O2","5","5.7","9780"]
[68029,"BLR1","Unit_1",2027,"acid gas","SO2","2010-03-25T10:00:00","0.001","3","ppm @ 7% O2","3","5.8","9780"]
[68029,"BLR1","Unit_1",2027,"acid gas","SO2","2010-03-25T11:00:00","0.001","2","ppm @ 7% O2","2","5.9","9780"]
[68029,"BLR1","Unit_1",2027,"acid gas","SO2","2010-03-25T12:00:00","0.001","1","ppm @ 7% O2","1","5.8","9780"]
[68029,"BLR1","Unit_1",2027,"acid gas","SO2","2010-03-25T13:00:00","0.001","0","ppm @ 7% O2","0","6","9780"]
[68029,"BLR1","Unit_1",2027,"acid gas","SO2","2010-03-25T14:00:00","0.001","0","ppm @ 7% O2","0","6.2","9780"]
[68029,"BLR1","Unit_1",2027,"acid gas","SO2","2010-03-25T15:00:00","0.001","0","ppm @ 7% O2","0","6.2","9780"]
[68029,"BLR1","Unit_1",2027,"acid gas","SO2","2010-03-25T16:00:00","0.001","0","ppm @ 7% O2","0","5","9780"]
[68029,"BLR1","Unit_1",2027,"acid gas","SO2","2010-03-25T17:00:00","0.001","0","ppm @ 7% O2","0","1.9","9780"]
[68029,"BLR1","Unit_1",2027,"acid gas","SO2","2010-03-25T18:00:00","0.002","0","ppm @ 7% O2","0","6.3","9780"]
[68029,"BLR1","Unit_1",2027,"acid gas","SO2","2010-03-25T19:00:00","0.010","1","ppm @ 7% O2","1","6.4","9780"]
[68029,"BLR1","Unit_1",2027,"acid gas","SO2","2010-03-25T20:00:00","0.011","3","ppm @ 7% O2","3","6.4","9780"]
[68029,"BLR1","Unit_1",2027,"acid gas","SO2","2010-03-25T21:00:00","0.009","4","ppm @ 7% O2","4","6.4","9780"]
[68029,"BLR1","Unit_1",2027,"acid gas","SO2","2010-03-25T22:00:00","0.010","4","ppm @ 7% O2","4","6.4","9780"]
[68029,"BLR1","Unit_1",2027,"acid gas","SO2","2010-03-25T23:00:00","0.012","4","ppm @ 7% O2","4","6.5","9780"]
[68029,"BLR1","Unit_1",2027,"acid gas","SO2","2010-03-26","0.011","5","ppm @ 7% O2","5","6.5","9780"]
[68029,"BLR1","Unit_1",2027,"acid gas","SO2","2010-03-26T01:00:00","0.020","6","ppm @ 7% O2","6","6.5","9780"]
[68029,"BLR1","Unit_1",2027,"acid gas","SO2","2010-03-26T02:00:00","0.011","6","ppm @ 7% O2","6","6.5","9780"]
[68029,"BLR1","Unit_1",2027,"acid gas","SO2","2010-03-26T03:00:00","0.010","5","ppm @ 7% O2","5","6.5","9780"]
[68029,"BLR1","Unit_1",2027,"acid gas","SO2","2010-03-26T04:00:00","0.012","5","ppm @ 7% O2","5","6.5","9780"]
[68029,"BLR1","Unit_1",2027,"acid gas","SO2","2010-03-26T05:00:00","0.008","4","ppm @ 7% O2","4","6.4","9780"]
[68029,"BLR1","Unit_1",2027,"acid gas","SO2","2010-03-26T06:00:00","0.017","5","ppm @ 7% O2","5","6.4","9780"]
[68029,"BLR1","Unit_1",2027,"acid gas","SO2","2010-03-26T07:00:00","0.020","5","ppm @ 7% O2","5","6.4","9780"]
[68029,"BLR1","Unit_1",2027,"acid gas","SO2","2010-03-26T08:00:00","0.009","6","ppm @ 7% O2","6","6.2","9780"]
[68029,"BLR1","Unit_1",2027,"acid gas","SO2","2010-03-26T09:00:00","0.002","6","ppm @ 7% O2","6","6.2","9780"]
[68029,"BLR1","Unit_1",2027,"acid gas","SO2","2010-03-26T10:00:00","0.005","3","ppm @ 7% O2","3","6.2","9780"]
[68029,"BLR1","Unit_1",2027,"acid gas","SO2","2010-03-26T11:00:00","0.015","2","ppm @ 7% O2","2","6.2","9780"]
[68029,"BLR1","Unit_1",2027,"acid gas","SO2","2010-03-26T12:00:00","0.019","4","ppm @ 7% O2","4","6.2","9780"]
[68029,"BLR1","Unit_1",2027,"acid gas","SO2","2010-03-26T13:00:00","0.010","6","ppm @ 7% O2","6","6.3","9780"]
[68029,"BLR1","Unit_1",2027,"acid gas","SO2","2010-03-26T14:00:00","0.019","6","ppm @ 7% O2","6","6.3","9780"]
[68029,"BLR1","Unit_1",2027,"acid gas","SO2","2010-03-26T15:00:00","0.008","6","ppm @ 7% O2","6","6.3","9780"]
[68029,"BLR1","Unit_1",2027,"acid gas","SO2","2010-03-26T16:00:00","0.017","6","ppm @ 7% O2","6","6.2","9780"]
[68029,"BLR1","Unit_1",2027,"acid gas","SO2","2010-03-26T17:00:00","0.009","6","ppm @ 7% O2","6","6.2","9780"]
[68029,"BLR1","Unit_1",2027,"acid gas","SO2","2010-03-26T18:00:00","0.021","5","ppm @ 7% O2","5","6.2","9780"]
[68029,"BLR1","Unit_1",2027,"acid gas","SO2","2010-03-26T19:00:00","0.007","6","ppm @ 7% O2","6","6.2","9780"]
[68029,"BLR1","Unit_1",2027,"acid gas","SO2","2010-03-26T20:00:00","0.004","5","ppm @ 7% O2","5","6.2","9780"]
[68029,"BLR1","Unit_1",2027,"acid gas","SO2","2010-03-26T21:00:00","0.002","3","ppm @ 7% O2","3","6.2","9780"]
[68029,"BLR1","Unit_1",2027,"acid gas","SO2","2010-03-26T22:00:00","0.001","1","ppm @ 7% O2","1","6.1","9780"]
[68029,"BLR1","Unit_1",2027,"acid gas","SO2","2010-03-26T23:00:00","0.001","1","ppm @ 7% O2","1","6.1","9780"]
[68029,"BLR1","Unit_1",2027,"acid gas","SO2","2010-03-27","0.001","0","ppm @ 7% O2","0","6.2","9780"]
[68029,"BLR1","Unit_1",2027,"acid gas","SO2","2010-03-27T01:00:00","0.004","0","ppm @ 7% O2","0","6.2","9780"]
[68029,"BLR1","Unit_1",2027,"acid gas","SO2","2010-03-27T02:00:00","0.002","1","ppm @ 7% O2","1","6.2","9780"]
[68029,"BLR1","Unit_1",2027,"acid gas","SO2","2010-03-27T03:00:00","0.001","1","ppm @ 7% O2","1","6.7","9780"]
[68029,"BLR1","Unit_1",2027,"acid gas","SO2","2010-03-27T04:00:00","0.012","1","ppm @ 7% O2","1","7.2","9780"]
[68029,"BLR1","Unit_1",2027,"acid gas","SO2","2010-03-27T05:00:00","0.005","2","ppm @ 7% O2","2","7.2","9780"]
[68029,"BLR1","Unit_1",2027,"acid gas","SO2","2010-03-27T06:00:00","0.001","2","ppm @ 7% O2","2","8","9780"]
[68029,"BLR1","Unit_1",2027,"acid gas","SO2","2010-03-27T07:00:00","0.028","4","ppm @ 7% O2","4","8","9780"]
[68029,"BLR1","Unit_1",2027,"acid gas","SO2","2010-03-27T08:00:00","0.011","5","ppm @ 7% O2","5","6.5","9780"]
[68029,"BLR1","Unit_1",2027,"acid gas","SO2","2010-03-27T09:00:00","0.008","6","ppm @ 7% O2","6","6.4","9780"]
[68029,"BLR1","Unit_1",2027,"acid gas","SO2","2010-03-27T10:00:00","0.011","5","ppm @ 7% O2","5","6.4","9780"]
[68029,"BLR1","Unit_1",2027,"acid gas","SO2","2010-03-27T11:00:00","0.010","4","ppm @ 7% O2","4","6.3","9780"]
[68029,"BLR1","Unit_1",2027,"acid gas","SO2","2010-03-27T12:00:00","0.016","4","ppm @ 7% O2","4","6.2","9780"]
[68029,"BLR1","Unit_1",2027,"acid gas","SO2","2010-03-27T13:00:00","0.001","4","ppm @ 7% O2","4","6.2","9780"]
[68029,"BLR1","Unit_1",2027,"acid gas","SO2","2010-03-27T14:00:00","0.004","3","ppm @ 7% O2","3","6.3","9780"]
[68029,"BLR1","Unit_1",2027,"acid gas","SO2","2010-03-27T15:00:00","0.001","2","ppm @ 7% O2","2","6.3","9780"]
[68029,{"$f":"IF(D1365=2027,\"BLR1\",\"BLR2\")","v":"BLR1"},{"$f":"IF(D1365=2027,\"Unit_1\",\"Unit_2\")","v":"Unit_1"},2027,"acid gas","SO2","2010-03-27T16:00:00","0.005","1","ppm @ 7% O2","1","6.6","9780"]
[68029,"BLR1","Unit_1",2027,"acid gas","SO2","2010-03-27T17:00:00","0.017","3","ppm @ 7% O2","3","6.3","9780"]
[68029,"BLR1","Unit_1",2027,"acid gas","SO2","2010-03-27T18:00:00","0.001","3","ppm @ 7% O2","3","6.3","9780"]
[68029,"BLR1","Unit_1",2027,"acid gas","SO2","2010-03-27T19:00:00","0.001","3","ppm @ 7% O2","3","6.3","9780"]
[68029,"BLR1","Unit_1",2027,"acid gas","SO2","2010-03-27T20:00:00","0.001","1","ppm @ 7% O2","1","6.3","9780"]
[68029,"BLR1","Unit_1",2027,"acid gas","SO2","2010-03-27T21:00:00","0.001","0","ppm @ 7% O2","0","6.2","9780"]
[68029,"BLR1","Unit_1",2027,"acid gas","SO2","2010-03-27T22:00:00","0.001","0","ppm @ 7% O2","0","7.1","9780"]
[68029,"BLR1","Unit_1",2027,"acid gas","SO2","2010-03-27T23:00:00","0.001","0","ppm @ 7% O2","0","8.4","9780"]
[68029,"BLR1","Unit_1",2027,"acid gas","SO2","2010-03-28","0.001","0","ppm @ 7% O2","0","8","9780"]
[68029,"BLR1","Unit_1",2027,"acid gas","SO2","2010-03-28T01:00:00","0.001","0","ppm @ 7% O2","0","8","9780"]
[68029,"BLR1","Unit_1",2027,"acid gas","SO2","2010-03-28T02:00:00","0.001","0","ppm @ 7% O2","0","8","9780"]
[68029,"BLR1","Unit_1",2027,"acid gas","SO2","2010-03-28T03:00:00","0.000","0","ppm @ 7% O2","0","8.1","9780"]
[68029,"BLR1","Unit_1",2027,"acid gas","SO2","2010-03-28T04:00:00","0.014","1","ppm @ 7% O2","1","7.4","9780"]
[68029,"BLR1","Unit_1",2027,"acid gas","SO2","2010-03-28T05:00:00","0.001","2","ppm @ 7% O2","2","6.1","9780"]
[68029,"BLR1","Unit_1",2027,"acid gas","SO2","2010-03-28T06:00:00","0.001","2","ppm @ 7% O2","2","8.8","9780"]
[68029,"BLR1","Unit_1",2027,"acid gas","SO2","2010-03-28T07:00:00","0.001","2","ppm @ 7% O2","2","6.5","9780"]
[68029,"BLR1","Unit_1",2027,"acid gas","SO2","2010-03-28T08:00:00","0.001","0","ppm @ 7% O2","0","5.8","9780"]
[68029,"BLR1","Unit_1",2027,"acid gas","SO2","2010-03-28T09:00:00","0.001","0","ppm @ 7% O2","0","5.9","9780"]
[68029,"BLR1","Unit_1",2027,"acid gas","SO2","2010-03-28T10:00:00","0.001","0","ppm @ 7% O2","0","0.0I","9780"]
[68029,"BLR1","Unit_1",2027,"acid gas","SO2","2010-03-28T11:00:00","0.003","1","ppm @ 7% O2","1","0.0I","9780"]
[68029,"BLR1","Unit_1",2027,"acid gas","SO2","2010-03-28T12:00:00","0.005","1","ppm @ 7% O2","1","5.6","9780"]
[68029,"BLR1","Unit_1",2027,"acid gas","SO2","2010-03-28T13:00:00","0.004","2","ppm @ 7% O2","2","5.5","9780"]
[68029,"BLR1","Unit_1",2027,"acid gas","SO2","2010-03-28T14:00:00","0.006","2","ppm @ 7% O2","2","5.5","9780"]
[68029,"BLR1","Unit_1",2027,"acid gas","SO2","2010-03-28T15:00:00","0.004","2","ppm @ 7% O2","2","5.5","9780"]
[68029,"BLR1","Unit_1",2027,"acid gas","SO2","2010-03-28T16:00:00","0.004","2","ppm @ 7% O2","2","5.7","9780"]
[68029,"BLR1","Unit_1",2027,"acid gas","SO2","2010-03-28T17:00:00","0.015","2","ppm @ 7% O2","2","5.8","9780"]
[68029,"BLR1","Unit_1",2027,"acid gas","SO2","2010-03-28T18:00:00","0.016","4","ppm @ 7% O2","4","5.9","9780"]
[68029,"BLR1","Unit_1",2027,"acid gas","SO2","2010-03-28T19:00:00","0.010","5","ppm @ 7% O2","5","5.9","9780"]
[68029,"BLR1","Unit_1",2027,"acid gas","SO2","2010-03-28T20:00:00","0.015","6","ppm @ 7% O2","6","5.9","9780"]
[68029,"BLR1","Unit_1",2027,"acid gas","SO2","2010-03-28T21:00:00","0.018","5","ppm @ 7% O2","5","5.9","9780"]
[68029,"BLR1","Unit_1",2027,"acid gas","SO2","2010-03-28T22:00:00","0.012","6","ppm @ 7% O2","6","5.9","9780"]
[68029,"BLR1","Unit_1",2027,"acid gas","SO2","2010-03-28T23:00:00","0.009","5","ppm @ 7% O2","5","5.9","9780"]
[68029,"BLR1","Unit_1",2027,"acid gas","SO2","2010-03-29","0.019","6","ppm @ 7% O2","6","5.9","9780"]
[68029,"BLR1","Unit_1",2027,"acid gas","SO2","2010-03-29T01:00:00","0.009","5","ppm @ 7% O2","5","5.9","9780"]
[68029,"BLR1","Unit_1",2027,"acid gas","SO2","2010-03-29T02:00:00","0.009","5","ppm @ 7% O2","5","6","9780"]
[68029,"BLR1","Unit_1",2027,"acid gas","SO2","2010-03-29T03:00:00","0.001","4","ppm @ 7% O2","4","6.1","9780"]
[68029,"BLR1","Unit_1",2027,"acid gas","SO2","2010-03-29T04:00:00","0.007","2","ppm @ 7% O2","2","6.9","9780"]
[68029,"BLR1","Unit_1",2027,"acid gas","SO2","2010-03-29T05:00:00","0.011","3","ppm @ 7% O2","3","6.5","9780"]
[68029,"BLR1","Unit_1",2027,"acid gas","SO2","2010-03-29T06:00:00","0.002","3","ppm @ 7% O2","3","5.9","9780"]
[68029,"BLR1","Unit_1",2027,"acid gas","SO2","2010-03-29T07:00:00","0.007","3","ppm @ 7% O2","3","5.9","9780"]
[68029,"BLR1","Unit_1",2027,"acid gas","SO2","2010-03-29T08:00:00","0.011","3","ppm @ 7% O2","3","5.9","9780"]
[68029,"BLR1","Unit_1",2027,"acid gas","SO2","2010-03-29T09:00:00","0.008","3","ppm @ 7% O2","3","6","9780"]
[68029,"BLR1","Unit_1",2027,"acid gas","SO2","2010-03-29T10:00:00","0.023","5","ppm @ 7% O2","5","6","9780"]
[68029,"BLR1","Unit_1",2027,"acid gas","SO2","2010-03-29T11:00:00","0.005","5","ppm @ 7% O2","5","6","9780"]
[68029,"BLR1","Unit_1",2027,"acid gas","SO2","2010-03-29T12:00:00","0.004","5","ppm @ 7% O2","5","6","9780"]
[68029,"BLR1","Unit_1",2027,"acid gas","SO2","2010-03-29T13:00:00","0.016","4","ppm @ 7% O2","4","6","9780"]
[68029,"BLR1","Unit_1",2027,"acid gas","SO2","2010-03-29T14:00:00","0.015","4","ppm @ 7% O2","4","6.1","9780"]
[68029,"BLR1","Unit_1",2027,"acid gas","SO2","2010-03-29T15:00:00","0.012","5","ppm @ 7% O2","5","6.1","9780"]
[68029,"BLR1","Unit_1",2027,"acid gas","SO2","2010-03-29T16:00:00","0.013","6","ppm @ 7% O2","6","6.1","9780"]
[68029,"BLR1","Unit_1",2027,"acid gas","SO2","2010-03-29T17:00:00","0.016","6","ppm @ 7% O2","6","6.1","9780"]
[68029,"BLR1","Unit_1",2027,"acid gas","SO2","2010-03-29T18:00:00","0.019","6","ppm @ 7% O2","6","6.1","9780"]
[68029,"BLR1","Unit_1",2027,"acid gas","SO2","2010-03-29T19:00:00","0.005","6","ppm @ 7% O2","6","6.1","9780"]
[68029,"BLR1","Unit_1",2027,"acid gas","SO2","2010-03-29T20:00:00","0.011","5","ppm @ 7% O2","5","6.1","9780"]
[68029,"BLR1","Unit_1",2027,"acid gas","SO2","2010-03-29T21:00:00","0.012","5","ppm @ 7% O2","5","6.1","9780"]
[68029,"BLR1","Unit_1",2027,"acid gas","SO2","2010-03-29T22:00:00","0.015","4","ppm @ 7% O2","4","6","9780"]
[68029,"BLR1","Unit_1",2027,"acid gas","SO2","2010-03-29T23:00:00","0.003","5","ppm @ 7% O2","5","6","9780"]
[68029,"BLR1","Unit_1",2027,"acid gas","SO2","2010-03-30","0.012","4","ppm @ 7% O2","4","6.1","9780"]
[68029,"BLR1","Unit_1",2027,"acid gas","SO2","2010-03-30T01:00:00","0.014","4","ppm @ 7% O2","4","6.1","9780"]
[68029,"BLR1","Unit_1",2027,"acid gas","SO2","2010-03-30T02:00:00","0.012","4","ppm @ 7% O2","4","6.1","9780"]
[68029,"BLR1","Unit_1",2027,"acid gas","SO2","2010-03-30T03:00:00","0.011","6","ppm @ 7% O2","6","6.1","9780"]
[68029,"BLR1","Unit_1",2027,"acid gas","SO2","2010-03-30T04:00:00","0.012","5","ppm @ 7% O2","5","6.3","9780"]
[68029,"BLR1","Unit_1",2027,"acid gas","SO2","2010-03-30T05:00:00","0.009","5","ppm @ 7% O2","5","6.4","9780"]
[68029,"BLR1","Unit_1",2027,"acid gas","SO2","2010-03-30T06:00:00","0.014","4","ppm @ 7% O2","4","5.9","9780"]
[68029,"BLR1","Unit_1",2027,"acid gas","SO2","2010-03-30T07:00:00","0.018","6","ppm @ 7% O2","6","5.9","9780"]
[68029,{"$f":"IF(D1429=2027,\"BLR1\",\"BLR2\")","v":"BLR1"},{"$f":"IF(D1429=2027,\"Unit_1\",\"Unit_2\")","v":"Unit_1"},2027,"acid gas","SO2","2010-03-30T08:00:00","0.003","5","ppm @ 7% O2","5","5.9","9780"]
[68029,"BLR1","Unit_1",2027,"acid gas","SO2","2010-03-30T09:00:00","0.012","4","ppm @ 7% O2","4","5.8","9780"]
[68029,"BLR1","Unit_1",2027,"acid gas","SO2","2010-03-30T10:00:00","0.009","4","ppm @ 7% O2","4","5.8","9780"]
[68029,"BLR1","Unit_1",2027,"acid gas","SO2","2010-03-30T11:00:00","0.019","4","ppm @ 7% O2","4","5.8","9780"]
[68029,"BLR1","Unit_1",2027,"acid gas","SO2","2010-03-30T12:00:00","0.018","6","ppm @ 7% O2","6","5.8","9780"]
[68029,"BLR1","Unit_1",2027,"acid gas","SO2","2010-03-30T13:00:00","0.008","6","ppm @ 7% O2","6","5.8","9780"]
[68029,"BLR1","Unit_1",2027,"acid gas","SO2","2010-03-30T14:00:00","0.014","6","ppm @ 7% O2","6","5.8","9780"]
[68029,"BLR1","Unit_1",2027,"acid gas","SO2","2010-03-30T15:00:00","0.024","6","ppm @ 7% O2","6","6.1","9780"]
[68029,"BLR1","Unit_1",2027,"acid gas","SO2","2010-03-30T16:00:00","0.014","7","ppm @ 7% O2","7","6.1","9780"]
[68029,"BLR1","Unit_1",2027,"acid gas","SO2","2010-03-30T17:00:00","0.014","7","ppm @ 7% O2","7","6.1","9780"]
[68029,"BLR1","Unit_1",2027,"acid gas","SO2","2010-03-30T18:00:00","0.012","7","ppm @ 7% O2","7","6.1","9780"]
[68029,"BLR1","Unit_1",2027,"acid gas","SO2","2010-03-30T19:00:00","0.014","5","ppm @ 7% O2","5","6.2","9780"]
[68029,"BLR1","Unit_1",2027,"acid gas","SO2","2010-03-30T20:00:00","0.006","5","ppm @ 7% O2","5","6.2","9780"]
[68029,"BLR1","Unit_1",2027,"acid gas","SO2","2010-03-30T21:00:00","0.012","4","ppm @ 7% O2","4","6.2","9780"]
[68029,"BLR1","Unit_1",2027,"acid gas","SO2","2010-03-30T22:00:00","0.025","5","ppm @ 7% O2","5","6.3","9780"]
[68029,"BLR1","Unit_1",2027,"acid gas","SO2","2010-03-30T23:00:00","0.002","6","ppm @ 7% O2","6","6.3","9780"]

{"sheet":"sampling_runs","index":8,"n_rows":7,"n_cols":34,"rows_kept":7,"cut":false,"hidden":false,"merged":[]}
["facility_id","report_id","sampling_port_id","run_id","pollutant_name","conc","conc_units","start_datetime","end_datetime","unit_load","net_generation","fg_moisture_content","fg_flow_rate","fg_flow_rate_units","standard_temperature","standard_pressure","normal_temperature","normal_pressure","fg_oxygen_content","fg_CO2_content","fg_temperature","fg_pressure","Hg_loi","test_method","run_comments","fuel_id","fuel_unit_load","fuel_flow_rate","fuel_ash","fuel_heating_value","fuel_sulfur","O2 Based Calc","CO2 Based Calc"]
[2824,"2006 RATA A","bag10","average","Sulfur Dioxide (SO2)",21,"parts per million by volume (dry) (ppmvd)","2006-01-12","2006-01-12",55,55,15.8,157400,"dscfm",210,null,null,null,6.3,13.3,210,null,null,"6C",null,"subbituminous",55,null,4.5999999999999996,9742,0.32,{"$f":"F2*0.000000166*9820*20.9/(20.9-S2)","v":4.9004086849315079E-2},{"$f":"F2*0.000000166*1840*100/T2","v":4.822736842105263E-2},{"$f":"AG2/AF2","v":0.98414992548170899}]
[2824,"2006 RATA B","bag10","average","Sulfur Dioxide (SO2)",3.3,"parts per million by volume (dry) (ppmvd)","2006-08-17","2006-08-17",56,56,15.75,157787,"dscfm",204,null,null,null,6.29,13.32,204,null,null,"6C 7E",null,"subbituminous",56,null,4.63,9344,0.32,{"$f":"F3*0.000000166*9820*20.9/(20.9-S3)","v":7.6953714168377816E-3},7.5672072072072065E-3,{"$f":"AG3/AF3","v":0.98334528605725946}]
[2824,"RATA 2005","bag10","average","Sulfur Dioxide (SO2)",26.6,"parts per million by volume (dry) (ppmvd)","2005-09-22","2005-09-22",62,62,15.75,157387,"dscfm",218,null,null,null,15.75,13.32,218,null,null,"Method 6C 7E",null,"subbituminous",60,null,5.31,9304,0.32,0.17597066267961173,6.0996276276276289E-2,0.34662753067726798]
[2824,"RATA 2007","bag10","average","Sulfur Dioxide (SO2)",17,"parts per million by volume (dry) (ppmvd)","2007-07-11","2007-07-11",54,54,15.75,157387,"dscfm",206,null,null,null,6.29,13.32,206,null,null,"Methods 6C and 7E",null,"subbituminous",54,null,4.58,9352,0.33,3.964282245037646E-2,3.8982582582582588E-2,0.98334528605725946]
[2824,"RATA 2008","bag10","average","Sulfur Dioxide (SO2)",20,"parts per million by volume (dry) (ppmvd)","2008-08-13","2008-08-13",58,58,15.75,157387,"dscfm",205,null,null,null,6.29,13.32,205,null,null,"Methods 6C and 7E",null,"subbituminous",58,null,4.7699999999999996,9308,0.36,4.66386146475017E-2,4.5861861861861856E-2,0.98334528605725957]
[2824,"RATA 2009","bag10","average","Sulfur Dioxide (SO2)",27,"parts per million by volume (dry) (ppmvd)","2009-07-29","2009-07-29",56,56,9.1999999999999993,204358,"dscfm",201,null,null,null,7.3,12.39,201,null,null,"Methods 6C and 7E",null,"subbituminous",56,null,4.5999999999999996,9380,0.35,6.7637993823529419E-2,6.6560774818401947E-2,0.98407375878211312]

{"sheet":"sampling_run_pollutants1","index":9,"n_rows":7,"n_cols":18,"rows_kept":7,"cut":false,"hidden":false,"merged":[]}
["facility_id","report_id","sampling_port_id","run_id","pollutant_name","conc","conc_units","conc_ND","conc_MDL","emission_rate","emission_rate_units","emission_rate_ND","emission_rate_MDL","emission_factor","emission_factor_units","emission_factor_ND","emission_factor_MDL","run_pollutant_comment"]
[2824,"2006 RATA A","bag10","average","Sulfur Dioxide (SO2)",21,"parts per million by volume (dry) (ppmvd)",false,null,null,null,false,null,null,null,false]
[2824,"2006 RATA B","bag10","average","Sulfur Dioxide (SO2)",3.3,"parts per million by volume (dry) (ppmvd)",false,null,null,null,false,null,null,null,false]
[2824,"RATA 2005","bag10","average","Sulfur Dioxide (SO2)",26.6,"parts per million by volume (dry) (ppmvd)",false,null,null,null,false,null,null,null,false]
[2824,"RATA 2007","bag10","average","Sulfur Dioxide (SO2)",17,"parts per million by volume (dry) (ppmvd)",false,null,null,null,false,null,null,null,false]
[2824,"RATA 2008","bag10","average","Sulfur Dioxide (SO2)",20,"parts per million by volume (dry) (ppmvd)",false,null,null,null,false,null,null,null,false]
[2824,"RATA 2009","bag10","average","Sulfur Dioxide (SO2)",27,"parts per million by volume (dry) (ppmvd)",false,null,null,null,false,null,null,null,false]

{"sheet":"UPL Normal","index":10,"n_rows":108,"n_cols":6,"rows_kept":108,"cut":false,"hidden":false,"merged":[[47,16,48,16]]}
["Emissions (lb/MW)","SO2"]
[null,52071]
["ORIS/Facility/Unit","Sandow"]
["Runs","5A"]
[1,2.5374296569414579E-2]
[2,6.2900655215158488E-2]
[3,9.4350982822737725E-2]
[4,9.6752924775306018E-2]
[5,0.22871142431791891]
[6,0.64997343722330436]
[7]
[8]
[9]
[10]
[11]
[12]
[13]
[14]
[15]
[16]
[17]
[18]
[19]
[20]
[21]
[22]
[23]
[24]
[25]
[26]
[27]
[28]
[29]
[30]
[31]
[32]
[33]
[34]
[35]
[]
["ni = number test Runs =",{"$f":"COUNT(B5:B39)","v":6}]
[]
[]
[]
["Total Number of sources =",null,{"$f":"COUNTA(B2:Q2)","v":1}]
[]
[]
["n =Total # test Runs =",null,{"$f":"SUM(B41:B41)","v":6}]
[]
[]
[]
[]
[null,null,{"$f":"C48-1","v":5}]
[]
[]
[]
[]
["This step is for QC only:"]
[]
["means",{"$f":"AVERAGE(B5:B39)","v":0.19301062015397333}]
[]
[]
[]
[]
[]
[]
[null,null,{"$f":"AVERAGE(B5:B39)","v":0.19301062015397333}]
["UPL Mean ="]
[]
[]
[]
["Pooled Variance = ",null,{"$f":"VAR(B5:H39)","v":5.482387430423221E-2}]
[]
[]
[]
[]
[]
["m= number future Runs =",null,3]
[]
[]
["Term1",null,{"$f":"1/C48+1/C78","v":0.5}]
[]
[]
[]
["Term2",null,{"$f":"C72*C81","v":2.7411937152116105E-2}]
[]
[]
[]
[]
[]
["Squared root Term2",null,{"$f":"SQRT(C85)","v":0.16556550713272408}]
[]
[]
["NOTE: the pvalue for the t-statistic is calculated as: 2*alpha, where 1-alpha is desired confidence, so if 99% confidence is desired then alpha=0.01 and 2*alpha=2*(0.01)"]
[]
[]
["t-statistic","= quantile t-distribution with df degrees of freedom at .99 confidence level =",{"$f":"TINV(2*0.01,C53)","v":3.3649299989072183}]
[]
[]
["UPL  POOLED VARIANCE = ",null,{"$f":"C67+C97*C91","v":0.75012696188916361},{"$f":"IFERROR(IF(FIND(\"MM\",A$1,1)>0,\"lb/MMBtu\",\"lb/MW\"),\"lb/MW\")","v":"lb/MW"},{"$f":"C100*1000","v":750.12696188916357},"lb/GWhr"]
[]
[]
[]
[]
[null,"Normal UPL",{"$f":"'UPL Pooled Template '!F107","v":0.75012696188916361}]
[null,"Lognormal UPL",{"$f":"'Lognormal Template'!D165","v":1.008975932250769},{"$f":"IFERROR(IF(FIND(\"MM\",A$1,1)>0,\"lb/MMBtu\",\"lb/MW\"),\"lb/MW\")","v":"lb/MW"}]
[]
[null,"Final UPL",{"$f":"C106","v":1.008975932250769},"lb/MW"]

{"sheet":"UPL Pooled Template ","index":11,"n_rows":107,"n_cols":12,"rows_kept":107,"cut":false,"hidden":false,"merged":[[0,1,0,11],[37,0,37,3]]}
[{"$f":"'UPL Normal'!B1","v":"SO2"},"Emissions (lb/MW)"]
["Runs","52071\nSandow\n5A"]
[1,2.5374296569414579E-2]
[2,6.2900655215158488E-2]
[3,9.4350982822737725E-2]
[4,9.6752924775306018E-2]
[5,0.22871142431791891]
[6,0.64997343722330436]
[7]
[8]
[9]
[10]
[11]
[12]
[13]
[14]
[15]
[16]
[17]
[18]
[19]
[20]
[21]
[22]
[23]
[24]
[25]
[26]
[27]
[28]
[29]
[30]
[31]
[32]
[33]
[34]
[35]
["Use for large sample sets and small sample sets that are Normal."]
[]
["Testing Normality","Raw Data"]
["Sample Size",{"$f":"COUNT(B3:L37)","v":6}]
["Kurtosis",{"$f":"KURT(B3:L37)","v":4.1981507033588095}]
["SE Kurtosis",{"$f":"SQRT((B41^2-1)/((B41-3)*(B41+5)))","v":1.0298573010888745}]
["Result Kurtosis",{"$f":"IF(ABS(B42/B43)>NORMSINV(1-0.05/2),\"non normal\",\"normal\")","v":"non normal"}]
["Skewness",{"$f":"SKEW(B3:L37)","v":2.0262280332936209}]
["SE Skewness",{"$f":"SQRT((6*B41*(B41-1))/((B41-2)*(B41+1)*(B41+3)))","v":0.84515425472851657}]
["Result Skewness",{"$f":"IF(ABS(B45/B46)>NORMSINV(1-0.05/2),\"non normal\",\"normal\")","v":"non normal"}]
[]
[]
["ni = number test Runs =",{"$f":"COUNT(B3:B37)","v":6},0,0,0,0,0,0,0,0,0,0]
[]
["Total Number of sources =",{"$f":"COUNTA(B2:L2)","v":1}]
[]
[]
["n =Total # test Runs =",{"$f":"SUM(B50:L50)","v":6}]
[]
[]
[]
[]
[null,{"$f":"B55-1","v":5}]
[]
[]
[]
[]
["This step is for QC only:"]
[]
["means",{"$f":"AVERAGE(B3:B37)","v":0.19301062015397333},{"$error":"#DIV/0!"},{"$error":"#DIV/0!"},{"$error":"#DIV/0!"},{"$error":"#DIV/0!"},{"$error":"#DIV/0!"},{"$error":"#DIV/0!"},{"$error":"#DIV/0!"},{"$error":"#DIV/0!"},{"$error":"#DIV/0!"},{"$error":"#DIV/0!"}]
[]
[]
[]
[]
[]
[]
[null,{"$f":"AVERAGE(B3:L37)","v":0.19301062015397333}]
["Mean ="]
[]
[]
[]
["Pooled Variance = ",null,null,{"$f":"VAR(B3:L37)","v":5.482387430423221E-2}]
[]
[]
[]
[]
[]
["m= number future Runs =",{"$f":"'UPL Normal'!C78","v":3}]
[]
[]
["Term1",{"$f":"1/B55+1/B85","v":0.5}]
[]
[]
[]
["Term2",{"$f":"D79*B88","v":2.7411937152116105E-2}]
[]
[]
[]
[]
[]
["Squared root Term2",null,{"$f":"SQRT(B92)","v":0.16556550713272408}]
[]
[]
["NOTE: the pvalue for the t-statistic is calculated as: 2*alpha, where 1-alpha is desired confidence, so if 99% confidence is desired then alpha=0.01 and 2*alpha=2*(0.01)"]
[]
[]
["t-statistic","= quantile t-distribution with df degrees of freedom at .99 confidence level =",null,null,null,null,null,{"$f":"TINV(2*0.01,B60)","v":3.3649299989072183}]
[]
[]
["UPL  POOLED VARIANCE = ",null,null,null,null,{"$f":"B74+H104*C98","v":0.75012696188916361}]